hadoop-hdfs-dev mailing list archives

Site index · List index
Message view « Date » · « Thread »
Top « Date » · « Thread »
From Apache Jenkins Server <jenk...@builds.apache.org>
Subject Build failed in Jenkins: Hadoop-Hdfs-trunk #3020
Date Tue, 12 Apr 2016 14:49:35 GMT
See <https://builds.apache.org/job/Hadoop-Hdfs-trunk/3020/changes>

Changes:

[naganarasimha_gr] YARN-4810. NM applicationpage cause internal error 500. Contributed by

------------------------------------------
[...truncated 9008 lines...]
Tests run: 1, Failures: 0, Errors: 0, Skipped: 0, Time elapsed: 4.753 sec - in org.apache.hadoop.hdfs.server.namenode.snapshot.TestSnapshotListing
Running org.apache.hadoop.hdfs.server.namenode.snapshot.TestSnapshotDiffReport
Tests run: 8, Failures: 0, Errors: 0, Skipped: 0, Time elapsed: 14.38 sec - in org.apache.hadoop.hdfs.server.namenode.snapshot.TestSnapshotDiffReport
Running org.apache.hadoop.hdfs.server.namenode.snapshot.TestSnapshotMetrics
Tests run: 2, Failures: 0, Errors: 0, Skipped: 0, Time elapsed: 7.366 sec - in org.apache.hadoop.hdfs.server.namenode.snapshot.TestSnapshotMetrics
Running org.apache.hadoop.hdfs.server.namenode.snapshot.TestSnapshottableDirListing
Tests run: 2, Failures: 0, Errors: 0, Skipped: 0, Time elapsed: 6.503 sec - in org.apache.hadoop.hdfs.server.namenode.snapshot.TestSnapshottableDirListing
Running org.apache.hadoop.hdfs.server.namenode.snapshot.TestSnapshotReplication
Tests run: 3, Failures: 0, Errors: 0, Skipped: 0, Time elapsed: 9.409 sec - in org.apache.hadoop.hdfs.server.namenode.snapshot.TestSnapshotReplication
Running org.apache.hadoop.hdfs.server.namenode.snapshot.TestFileWithSnapshotFeature
Tests run: 1, Failures: 0, Errors: 0, Skipped: 0, Time elapsed: 0.699 sec - in org.apache.hadoop.hdfs.server.namenode.snapshot.TestFileWithSnapshotFeature
Running org.apache.hadoop.hdfs.server.namenode.snapshot.TestSnapshotDeletion
Tests run: 19, Failures: 0, Errors: 0, Skipped: 0, Time elapsed: 66.416 sec - in org.apache.hadoop.hdfs.server.namenode.snapshot.TestSnapshotDeletion
Running org.apache.hadoop.hdfs.server.namenode.snapshot.TestDisallowModifyROSnapshot
Tests run: 11, Failures: 0, Errors: 0, Skipped: 0, Time elapsed: 4.38 sec - in org.apache.hadoop.hdfs.server.namenode.snapshot.TestDisallowModifyROSnapshot
Running org.apache.hadoop.hdfs.server.namenode.snapshot.TestAclWithSnapshot
Tests run: 16, Failures: 0, Errors: 0, Skipped: 0, Time elapsed: 11.412 sec - in org.apache.hadoop.hdfs.server.namenode.snapshot.TestAclWithSnapshot
Running org.apache.hadoop.hdfs.server.namenode.snapshot.TestSnapshotBlocksMap
Tests run: 7, Failures: 0, Errors: 0, Skipped: 0, Time elapsed: 23.563 sec - in org.apache.hadoop.hdfs.server.namenode.snapshot.TestSnapshotBlocksMap
Running org.apache.hadoop.hdfs.server.namenode.snapshot.TestSnapshot
Tests run: 6, Failures: 0, Errors: 0, Skipped: 0, Time elapsed: 77.203 sec - in org.apache.hadoop.hdfs.server.namenode.snapshot.TestSnapshot
Running org.apache.hadoop.hdfs.server.namenode.snapshot.TestSnapshotFileLength
Tests run: 2, Failures: 0, Errors: 0, Skipped: 0, Time elapsed: 5.993 sec - in org.apache.hadoop.hdfs.server.namenode.snapshot.TestSnapshotFileLength
Running org.apache.hadoop.hdfs.server.namenode.snapshot.TestGetContentSummaryWithSnapshot
Tests run: 1, Failures: 0, Errors: 0, Skipped: 0, Time elapsed: 5.181 sec - in org.apache.hadoop.hdfs.server.namenode.snapshot.TestGetContentSummaryWithSnapshot
Running org.apache.hadoop.hdfs.server.namenode.snapshot.TestSnapshotRename
Tests run: 6, Failures: 0, Errors: 0, Skipped: 0, Time elapsed: 11.546 sec - in org.apache.hadoop.hdfs.server.namenode.snapshot.TestSnapshotRename
Running org.apache.hadoop.hdfs.server.namenode.snapshot.TestSnapshotNameWithInvalidCharacters
Tests run: 2, Failures: 0, Errors: 0, Skipped: 0, Time elapsed: 5.694 sec - in org.apache.hadoop.hdfs.server.namenode.snapshot.TestSnapshotNameWithInvalidCharacters
Running org.apache.hadoop.hdfs.server.namenode.snapshot.TestXAttrWithSnapshot
Tests run: 8, Failures: 0, Errors: 0, Skipped: 0, Time elapsed: 7.642 sec - in org.apache.hadoop.hdfs.server.namenode.snapshot.TestXAttrWithSnapshot
Running org.apache.hadoop.hdfs.server.namenode.snapshot.TestOpenFilesWithSnapshot
Tests run: 7, Failures: 0, Errors: 0, Skipped: 0, Time elapsed: 53.314 sec - in org.apache.hadoop.hdfs.server.namenode.snapshot.TestOpenFilesWithSnapshot
Running org.apache.hadoop.hdfs.server.namenode.snapshot.TestRenameWithSnapshots
Tests run: 36, Failures: 0, Errors: 0, Skipped: 0, Time elapsed: 109.996 sec - in org.apache.hadoop.hdfs.server.namenode.snapshot.TestRenameWithSnapshots
Running org.apache.hadoop.hdfs.server.namenode.snapshot.TestFileContextSnapshot
Tests run: 2, Failures: 0, Errors: 0, Skipped: 0, Time elapsed: 6.309 sec - in org.apache.hadoop.hdfs.server.namenode.snapshot.TestFileContextSnapshot
Running org.apache.hadoop.hdfs.server.namenode.snapshot.TestSnapshotManager
Tests run: 1, Failures: 0, Errors: 0, Skipped: 0, Time elapsed: 0.613 sec - in org.apache.hadoop.hdfs.server.namenode.snapshot.TestSnapshotManager
Running org.apache.hadoop.hdfs.server.namenode.snapshot.TestSnapshotStatsMXBean
Tests run: 1, Failures: 0, Errors: 0, Skipped: 0, Time elapsed: 4.224 sec - in org.apache.hadoop.hdfs.server.namenode.snapshot.TestSnapshotStatsMXBean
Running org.apache.hadoop.hdfs.server.namenode.snapshot.TestNestedSnapshots
Tests run: 5, Failures: 0, Errors: 0, Skipped: 0, Time elapsed: 54.051 sec - in org.apache.hadoop.hdfs.server.namenode.snapshot.TestNestedSnapshots
Running org.apache.hadoop.hdfs.server.namenode.snapshot.TestCheckpointsWithSnapshots
Tests run: 1, Failures: 0, Errors: 0, Skipped: 0, Time elapsed: 4.607 sec - in org.apache.hadoop.hdfs.server.namenode.snapshot.TestCheckpointsWithSnapshots
Running org.apache.hadoop.hdfs.server.namenode.snapshot.TestUpdatePipelineWithSnapshots
Tests run: 1, Failures: 0, Errors: 0, Skipped: 0, Time elapsed: 10.518 sec - in org.apache.hadoop.hdfs.server.namenode.snapshot.TestUpdatePipelineWithSnapshots
Running org.apache.hadoop.hdfs.server.namenode.snapshot.TestINodeFileUnderConstructionWithSnapshot
Tests run: 4, Failures: 0, Errors: 0, Skipped: 0, Time elapsed: 9.998 sec - in org.apache.hadoop.hdfs.server.namenode.snapshot.TestINodeFileUnderConstructionWithSnapshot
Running org.apache.hadoop.hdfs.server.namenode.snapshot.TestSetQuotaWithSnapshot
Tests run: 2, Failures: 0, Errors: 0, Skipped: 0, Time elapsed: 6.533 sec - in org.apache.hadoop.hdfs.server.namenode.snapshot.TestSetQuotaWithSnapshot
Running org.apache.hadoop.hdfs.server.namenode.TestAuditLogAtDebug
Tests run: 6, Failures: 0, Errors: 0, Skipped: 0, Time elapsed: 1.188 sec - in org.apache.hadoop.hdfs.server.namenode.TestAuditLogAtDebug
Running org.apache.hadoop.hdfs.server.namenode.TestSecurityTokenEditLog
Tests run: 2, Failures: 0, Errors: 0, Skipped: 0, Time elapsed: 16.272 sec - in org.apache.hadoop.hdfs.server.namenode.TestSecurityTokenEditLog
Running org.apache.hadoop.hdfs.server.namenode.TestFSEditLogLoader
Tests run: 22, Failures: 0, Errors: 0, Skipped: 0, Time elapsed: 72.117 sec - in org.apache.hadoop.hdfs.server.namenode.TestFSEditLogLoader
Running org.apache.hadoop.hdfs.server.namenode.TestStorageRestore
Tests run: 4, Failures: 0, Errors: 0, Skipped: 0, Time elapsed: 13.772 sec - in org.apache.hadoop.hdfs.server.namenode.TestStorageRestore
Running org.apache.hadoop.hdfs.server.namenode.TestAuditLogger
Tests run: 7, Failures: 0, Errors: 0, Skipped: 0, Time elapsed: 10.265 sec - in org.apache.hadoop.hdfs.server.namenode.TestAuditLogger
Running org.apache.hadoop.hdfs.server.namenode.TestStoragePolicySummary
Tests run: 5, Failures: 0, Errors: 0, Skipped: 0, Time elapsed: 0.206 sec - in org.apache.hadoop.hdfs.server.namenode.TestStoragePolicySummary
Running org.apache.hadoop.hdfs.server.namenode.TestClusterId
Tests run: 13, Failures: 0, Errors: 0, Skipped: 0, Time elapsed: 2.457 sec - in org.apache.hadoop.hdfs.server.namenode.TestClusterId
Running org.apache.hadoop.hdfs.server.namenode.TestNNStorageRetentionFunctional
Tests run: 1, Failures: 0, Errors: 0, Skipped: 0, Time elapsed: 3.742 sec - in org.apache.hadoop.hdfs.server.namenode.TestNNStorageRetentionFunctional
Running org.apache.hadoop.hdfs.server.namenode.TestBlockPlacementPolicyRackFaultTolerant
Tests run: 1, Failures: 0, Errors: 0, Skipped: 0, Time elapsed: 8.926 sec - in org.apache.hadoop.hdfs.server.namenode.TestBlockPlacementPolicyRackFaultTolerant
Running org.apache.hadoop.hdfs.server.namenode.TestFileJournalManager
Tests run: 14, Failures: 0, Errors: 0, Skipped: 0, Time elapsed: 2.627 sec - in org.apache.hadoop.hdfs.server.namenode.TestFileJournalManager
Running org.apache.hadoop.hdfs.server.namenode.TestStartupProgressServlet
Tests run: 3, Failures: 0, Errors: 0, Skipped: 0, Time elapsed: 0.606 sec - in org.apache.hadoop.hdfs.server.namenode.TestStartupProgressServlet
Running org.apache.hadoop.hdfs.server.namenode.TestEditLogRace
Tests run: 8, Failures: 0, Errors: 0, Skipped: 0, Time elapsed: 36.901 sec - in org.apache.hadoop.hdfs.server.namenode.TestEditLogRace
Running org.apache.hadoop.hdfs.server.namenode.TestDiskspaceQuotaUpdate
Tests run: 7, Failures: 0, Errors: 0, Skipped: 0, Time elapsed: 71.979 sec - in org.apache.hadoop.hdfs.server.namenode.TestDiskspaceQuotaUpdate
Running org.apache.hadoop.hdfs.server.namenode.TestCacheDirectives
Tests run: 13, Failures: 0, Errors: 0, Skipped: 0, Time elapsed: 85.633 sec - in org.apache.hadoop.hdfs.server.namenode.TestCacheDirectives
Running org.apache.hadoop.hdfs.server.namenode.TestQuotaWithStripedBlocks
Tests run: 1, Failures: 0, Errors: 0, Skipped: 0, Time elapsed: 6.154 sec - in org.apache.hadoop.hdfs.server.namenode.TestQuotaWithStripedBlocks
Running org.apache.hadoop.hdfs.server.namenode.TestAddBlockRetry
Tests run: 2, Failures: 0, Errors: 0, Skipped: 0, Time elapsed: 11.706 sec - in org.apache.hadoop.hdfs.server.namenode.TestAddBlockRetry
Running org.apache.hadoop.hdfs.server.namenode.TestAddStripedBlocks
Tests run: 6, Failures: 0, Errors: 0, Skipped: 0, Time elapsed: 46.124 sec - in org.apache.hadoop.hdfs.server.namenode.TestAddStripedBlocks
Running org.apache.hadoop.hdfs.server.namenode.TestBackupNode
Tests run: 5, Failures: 0, Errors: 0, Skipped: 0, Time elapsed: 21.418 sec - in org.apache.hadoop.hdfs.server.namenode.TestBackupNode
Running org.apache.hadoop.hdfs.server.namenode.metrics.TestNameNodeMetrics
Tests run: 13, Failures: 0, Errors: 0, Skipped: 0, Time elapsed: 106.787 sec - in org.apache.hadoop.hdfs.server.namenode.metrics.TestNameNodeMetrics
Running org.apache.hadoop.hdfs.server.namenode.metrics.TestNNMetricFilesInGetListingOps
Tests run: 1, Failures: 0, Errors: 0, Skipped: 0, Time elapsed: 7.347 sec - in org.apache.hadoop.hdfs.server.namenode.metrics.TestNNMetricFilesInGetListingOps
Running org.apache.hadoop.hdfs.server.namenode.TestProtectedDirectories
Tests run: 7, Failures: 0, Errors: 0, Skipped: 0, Time elapsed: 12.82 sec - in org.apache.hadoop.hdfs.server.namenode.TestProtectedDirectories
Running org.apache.hadoop.hdfs.server.namenode.TestLargeDirectoryDelete
Tests run: 1, Failures: 0, Errors: 0, Skipped: 0, Time elapsed: 45.941 sec - in org.apache.hadoop.hdfs.server.namenode.TestLargeDirectoryDelete
Running org.apache.hadoop.hdfs.server.namenode.TestCommitBlockSynchronization
Tests run: 5, Failures: 0, Errors: 0, Skipped: 0, Time elapsed: 2.425 sec - in org.apache.hadoop.hdfs.server.namenode.TestCommitBlockSynchronization
Running org.apache.hadoop.hdfs.server.namenode.TestAclConfigFlag
Tests run: 8, Failures: 0, Errors: 0, Skipped: 0, Time elapsed: 12.207 sec - in org.apache.hadoop.hdfs.server.namenode.TestAclConfigFlag
Running org.apache.hadoop.hdfs.server.namenode.TestEditLogJournalFailures
Tests run: 12, Failures: 0, Errors: 0, Skipped: 0, Time elapsed: 13.241 sec - in org.apache.hadoop.hdfs.server.namenode.TestEditLogJournalFailures
Running org.apache.hadoop.hdfs.server.namenode.TestCheckpoint
Tests run: 38, Failures: 0, Errors: 0, Skipped: 0, Time elapsed: 53.719 sec - in org.apache.hadoop.hdfs.server.namenode.TestCheckpoint
Running org.apache.hadoop.hdfs.server.namenode.TestFsLimits
Tests run: 9, Failures: 0, Errors: 0, Skipped: 0, Time elapsed: 2.528 sec - in org.apache.hadoop.hdfs.server.namenode.TestFsLimits
Running org.apache.hadoop.hdfs.server.namenode.TestSecureNameNodeWithExternalKdc
Tests run: 1, Failures: 0, Errors: 0, Skipped: 1, Time elapsed: 0.1 sec - in org.apache.hadoop.hdfs.server.namenode.TestSecureNameNodeWithExternalKdc
Running org.apache.hadoop.hdfs.server.namenode.TestAddOverReplicatedStripedBlocks
Tests run: 4, Failures: 0, Errors: 0, Skipped: 0, Time elapsed: 38.696 sec - in org.apache.hadoop.hdfs.server.namenode.TestAddOverReplicatedStripedBlocks
Running org.apache.hadoop.hdfs.server.namenode.TestStartup
Tests run: 10, Failures: 0, Errors: 0, Skipped: 0, Time elapsed: 26.031 sec - in org.apache.hadoop.hdfs.server.namenode.TestStartup
Running org.apache.hadoop.hdfs.server.namenode.TestCreateEditsLog
Tests run: 1, Failures: 0, Errors: 0, Skipped: 0, Time elapsed: 5.079 sec - in org.apache.hadoop.hdfs.server.namenode.TestCreateEditsLog
Running org.apache.hadoop.hdfs.server.namenode.TestUpgradeDomainBlockPlacementPolicy
Tests run: 1, Failures: 0, Errors: 0, Skipped: 0, Time elapsed: 5.194 sec - in org.apache.hadoop.hdfs.server.namenode.TestUpgradeDomainBlockPlacementPolicy
Running org.apache.hadoop.hdfs.server.namenode.TestPathComponents
Tests run: 1, Failures: 0, Errors: 0, Skipped: 0, Time elapsed: 0.25 sec - in org.apache.hadoop.hdfs.server.namenode.TestPathComponents
Running org.apache.hadoop.hdfs.server.namenode.TestNameCache
Tests run: 1, Failures: 0, Errors: 0, Skipped: 0, Time elapsed: 0.202 sec - in org.apache.hadoop.hdfs.server.namenode.TestNameCache
Running org.apache.hadoop.hdfs.server.namenode.TestProcessCorruptBlocks
Tests run: 4, Failures: 0, Errors: 0, Skipped: 0, Time elapsed: 23.276 sec - in org.apache.hadoop.hdfs.server.namenode.TestProcessCorruptBlocks
Running org.apache.hadoop.hdfs.server.namenode.TestDefaultBlockPlacementPolicy
Tests run: 4, Failures: 0, Errors: 0, Skipped: 0, Time elapsed: 9.668 sec - in org.apache.hadoop.hdfs.server.namenode.TestDefaultBlockPlacementPolicy
Running org.apache.hadoop.hdfs.server.namenode.TestNameNodeRecovery
Tests run: 22, Failures: 0, Errors: 0, Skipped: 0, Time elapsed: 29.314 sec - in org.apache.hadoop.hdfs.server.namenode.TestNameNodeRecovery
Running org.apache.hadoop.hdfs.server.namenode.TestFSImageStorageInspector
Tests run: 1, Failures: 0, Errors: 0, Skipped: 0, Time elapsed: 0.427 sec - in org.apache.hadoop.hdfs.server.namenode.TestFSImageStorageInspector
Running org.apache.hadoop.hdfs.server.namenode.TestNameNodeRpcServerMethods
Tests run: 1, Failures: 0, Errors: 0, Skipped: 0, Time elapsed: 3.934 sec - in org.apache.hadoop.hdfs.server.namenode.TestNameNodeRpcServerMethods
Running org.apache.hadoop.hdfs.server.namenode.TestTransferFsImage
Tests run: 4, Failures: 0, Errors: 0, Skipped: 0, Time elapsed: 8.949 sec - in org.apache.hadoop.hdfs.server.namenode.TestTransferFsImage
Running org.apache.hadoop.hdfs.server.namenode.TestValidateConfigurationSettings
Tests run: 3, Failures: 0, Errors: 0, Skipped: 0, Time elapsed: 3.348 sec - in org.apache.hadoop.hdfs.server.namenode.TestValidateConfigurationSettings
Running org.apache.hadoop.hdfs.server.namenode.TestNameNodeAcl
Tests run: 64, Failures: 0, Errors: 0, Skipped: 0, Time elapsed: 22.729 sec - in org.apache.hadoop.hdfs.server.namenode.TestNameNodeAcl
Running org.apache.hadoop.hdfs.server.namenode.TestNameNodeXAttr
Tests run: 13, Failures: 0, Errors: 0, Skipped: 0, Time elapsed: 11.868 sec - in org.apache.hadoop.hdfs.server.namenode.TestNameNodeXAttr
Running org.apache.hadoop.hdfs.server.namenode.TestMalformedURLs
Tests run: 1, Failures: 0, Errors: 0, Skipped: 0, Time elapsed: 4.054 sec - in org.apache.hadoop.hdfs.server.namenode.TestMalformedURLs
Running org.apache.hadoop.hdfs.server.namenode.TestFSImageWithXAttr
Tests run: 2, Failures: 0, Errors: 0, Skipped: 0, Time elapsed: 40.965 sec - in org.apache.hadoop.hdfs.server.namenode.TestFSImageWithXAttr
Running org.apache.hadoop.hdfs.server.namenode.TestBlockUnderConstruction
Tests run: 2, Failures: 0, Errors: 0, Skipped: 0, Time elapsed: 4.87 sec - in org.apache.hadoop.hdfs.server.namenode.TestBlockUnderConstruction
Running org.apache.hadoop.hdfs.server.namenode.TestReconstructStripedBlocks
Tests run: 4, Failures: 0, Errors: 0, Skipped: 0, Time elapsed: 31.839 sec - in org.apache.hadoop.hdfs.server.namenode.TestReconstructStripedBlocks
Running org.apache.hadoop.hdfs.server.namenode.TestFSPermissionChecker
Tests run: 15, Failures: 0, Errors: 0, Skipped: 0, Time elapsed: 1.928 sec - in org.apache.hadoop.hdfs.server.namenode.TestFSPermissionChecker
Running org.apache.hadoop.hdfs.server.namenode.TestFSImageWithAcl

Results :

Failed tests: 
  TestDirectoryScanner.testThrottling:617 Throttle is too permissive

Tests in error: 
  TestShortCircuitLocalRead.testSmallFileLocalRead:308->doTestShortCircuitRead:241->doTestShortCircuitReadImpl:286->checkFileContent:157
» IndexOutOfBounds
  TestShortCircuitLocalRead.testLocalReadLegacy:316->doTestShortCircuitReadLegacy:235->doTestShortCircuitReadImpl:286->checkFileContent:157
» IndexOutOfBounds
  TestShortCircuitLocalRead.testLocalReadFallback:327->doTestShortCircuitReadLegacy:235->doTestShortCircuitReadImpl:286->checkFileContent:157
» IndexOutOfBounds
  TestDFSStripedOutputStreamWithFailure.testAddBlockWhenNoSufficientParityNumOfNodes:310 »

  TestReadStripedFileWithMissingBlocks.testReadFileWithMissingBlocks:78->readFileWithMissingBlocks:115
» 
  TestDFSRename.testRename:59 » NoClassDefFound org/apache/hadoop/util/PlatformN...
  TestDFSRename.testRenameWithOverwrite:141 » NoClassDefFound Could not initiali...
  TestBlockManager.testNeededReconstructionWhileAppending » Remote org/apache/ha...

Tests run: 1730, Failures: 1, Errors: 7, Skipped: 3

[INFO]                                                                         
[INFO] ------------------------------------------------------------------------
[INFO] Skipping Apache Hadoop HDFS Native Client
[INFO] This project has been banned from the build due to previous failures.
[INFO] ------------------------------------------------------------------------
[INFO]                                                                         
[INFO] ------------------------------------------------------------------------
[INFO] Skipping Apache Hadoop HttpFS
[INFO] This project has been banned from the build due to previous failures.
[INFO] ------------------------------------------------------------------------
[INFO]                                                                         
[INFO] ------------------------------------------------------------------------
[INFO] Skipping Apache Hadoop HDFS BookKeeper Journal
[INFO] This project has been banned from the build due to previous failures.
[INFO] ------------------------------------------------------------------------
[INFO]                                                                         
[INFO] ------------------------------------------------------------------------
[INFO] Skipping Apache Hadoop HDFS-NFS
[INFO] This project has been banned from the build due to previous failures.
[INFO] ------------------------------------------------------------------------
[INFO]                                                                         
[INFO] ------------------------------------------------------------------------
[INFO] Building Apache Hadoop HDFS Project 3.0.0-SNAPSHOT
[INFO] ------------------------------------------------------------------------
[INFO] 
[INFO] --- maven-clean-plugin:2.5:clean (default-clean) @ hadoop-hdfs-project ---
[INFO] Deleting <https://builds.apache.org/job/Hadoop-Hdfs-trunk/ws/hadoop-hdfs-project/target>
[INFO] 
[INFO] --- maven-antrun-plugin:1.7:run (create-testdirs) @ hadoop-hdfs-project ---
[INFO] Executing tasks

main:
    [mkdir] Created dir: <https://builds.apache.org/job/Hadoop-Hdfs-trunk/ws/hadoop-hdfs-project/target/test-dir>
[INFO] Executed tasks
[INFO] 
[INFO] --- maven-source-plugin:2.3:jar-no-fork (hadoop-java-sources) @ hadoop-hdfs-project
---
[INFO] 
[INFO] --- maven-source-plugin:2.3:test-jar-no-fork (hadoop-java-sources) @ hadoop-hdfs-project
---
[INFO] 
[INFO] --- maven-enforcer-plugin:1.3.1:enforce (dist-enforce) @ hadoop-hdfs-project ---
[INFO] 
[INFO] --- maven-site-plugin:3.5:attach-descriptor (attach-descriptor) @ hadoop-hdfs-project
---
[INFO] 
[INFO] --- maven-javadoc-plugin:2.8.1:jar (module-javadocs) @ hadoop-hdfs-project ---
[INFO] Skipping javadoc generation
[INFO] 
[INFO] --- maven-enforcer-plugin:1.3.1:enforce (depcheck) @ hadoop-hdfs-project ---
[INFO] 
[INFO] --- maven-checkstyle-plugin:2.15:checkstyle (default-cli) @ hadoop-hdfs-project ---
[INFO] 
[INFO] --- findbugs-maven-plugin:3.0.0:findbugs (default-cli) @ hadoop-hdfs-project ---
[INFO] ------------------------------------------------------------------------
[INFO] Reactor Summary:
[INFO] 
[INFO] Apache Hadoop HDFS Client ......................... SUCCESS [04:20 min]
[INFO] Apache Hadoop HDFS ................................ FAILURE [  01:57 h]
[INFO] Apache Hadoop HDFS Native Client .................. SKIPPED
[INFO] Apache Hadoop HttpFS .............................. SKIPPED
[INFO] Apache Hadoop HDFS BookKeeper Journal ............. SKIPPED
[INFO] Apache Hadoop HDFS-NFS ............................ SKIPPED
[INFO] Apache Hadoop HDFS Project ........................ SUCCESS [  0.097 s]
[INFO] ------------------------------------------------------------------------
[INFO] BUILD FAILURE
[INFO] ------------------------------------------------------------------------
[INFO] Total time: 02:01 h
[INFO] Finished at: 2016-04-12T14:49:18+00:00
[INFO] Final Memory: 69M/996M
[INFO] ------------------------------------------------------------------------
[ERROR] Failed to execute goal org.apache.maven.plugins:maven-surefire-plugin:2.17:test (default-test)
on project hadoop-hdfs: ExecutionException: java.lang.RuntimeException: The forked VM terminated
without properly saying goodbye. VM crash or System.exit called?
[ERROR] Command was /bin/sh -c cd <https://builds.apache.org/job/Hadoop-Hdfs-trunk/ws/hadoop-hdfs-project/hadoop-hdfs>
&& /home/jenkins/tools/java/jdk1.7.0_55/jre/bin/java -Xmx2048m -XX:MaxPermSize=768m
-XX:+HeapDumpOnOutOfMemoryError -jar <https://builds.apache.org/job/Hadoop-Hdfs-trunk/ws/hadoop-hdfs-project/hadoop-hdfs/target/surefire/surefirebooter373336565875394344.jar>
<https://builds.apache.org/job/Hadoop-Hdfs-trunk/ws/hadoop-hdfs-project/hadoop-hdfs/target/surefire/surefire6869342553129766408tmp>
<https://builds.apache.org/job/Hadoop-Hdfs-trunk/ws/hadoop-hdfs-project/hadoop-hdfs/target/surefire/surefire_1364455785643085575386tmp>
[ERROR] -> [Help 1]
[ERROR] 
[ERROR] To see the full stack trace of the errors, re-run Maven with the -e switch.
[ERROR] Re-run Maven using the -X switch to enable full debug logging.
[ERROR] 
[ERROR] For more information about the errors and possible solutions, please read the following
articles:
[ERROR] [Help 1] http://cwiki.apache.org/confluence/display/MAVEN/MojoFailureException
[ERROR] 
[ERROR] After correcting the problems, you can resume the build with the command
[ERROR]   mvn <goals> -rf :hadoop-hdfs
Build step 'Execute shell' marked build as failure
Archiving artifacts
Recording test results

Mime
View raw message