hadoop-hdfs-dev mailing list archives

Site index · List index
Message view « Date » · « Thread »
Top « Date » · « Thread »
From Apache Jenkins Server <jenk...@builds.apache.org>
Subject Hadoop-Hdfs-trunk-Java8 - Build # 1054 - Still Failing
Date Sat, 02 Apr 2016 02:42:14 GMT
See https://builds.apache.org/job/Hadoop-Hdfs-trunk-Java8/1054/

###################################################################################
########################## LAST 60 LINES OF THE CONSOLE ###########################
[...truncated 6024 lines...]
[INFO] --- maven-antrun-plugin:1.7:run (create-testdirs) @ hadoop-hdfs-project ---
[INFO] Executing tasks

main:
    [mkdir] Created dir: /home/jenkins/jenkins-slave/workspace/Hadoop-Hdfs-trunk-Java8/hadoop-hdfs-project/target/test-dir
[INFO] Executed tasks
[INFO] 
[INFO] --- maven-source-plugin:2.3:jar-no-fork (hadoop-java-sources) @ hadoop-hdfs-project
---
[INFO] 
[INFO] --- maven-source-plugin:2.3:test-jar-no-fork (hadoop-java-sources) @ hadoop-hdfs-project
---
[INFO] 
[INFO] --- maven-enforcer-plugin:1.3.1:enforce (dist-enforce) @ hadoop-hdfs-project ---
[INFO] 
[INFO] --- maven-site-plugin:3.5:attach-descriptor (attach-descriptor) @ hadoop-hdfs-project
---
[INFO] 
[INFO] --- maven-javadoc-plugin:2.8.1:jar (module-javadocs) @ hadoop-hdfs-project ---
[INFO] Not executing Javadoc as the project is not a Java classpath-capable package
[INFO] 
[INFO] --- maven-enforcer-plugin:1.3.1:enforce (depcheck) @ hadoop-hdfs-project ---
[INFO] 
[INFO] --- maven-checkstyle-plugin:2.15:checkstyle (default-cli) @ hadoop-hdfs-project ---
[INFO] 
[INFO] --- findbugs-maven-plugin:3.0.0:findbugs (default-cli) @ hadoop-hdfs-project ---
[INFO] ------------------------------------------------------------------------
[INFO] Reactor Summary:
[INFO] 
[INFO] Apache Hadoop HDFS Client ......................... SUCCESS [04:25 min]
[INFO] Apache Hadoop HDFS ................................ FAILURE [  03:34 h]
[INFO] Apache Hadoop HDFS Native Client .................. SKIPPED
[INFO] Apache Hadoop HttpFS .............................. SKIPPED
[INFO] Apache Hadoop HDFS BookKeeper Journal ............. SKIPPED
[INFO] Apache Hadoop HDFS-NFS ............................ SKIPPED
[INFO] Apache Hadoop HDFS Project ........................ SUCCESS [  0.155 s]
[INFO] ------------------------------------------------------------------------
[INFO] BUILD FAILURE
[INFO] ------------------------------------------------------------------------
[INFO] Total time: 03:38 h
[INFO] Finished at: 2016-04-02T02:42:03+00:00
[INFO] Final Memory: 56M/430M
[INFO] ------------------------------------------------------------------------
[ERROR] Failed to execute goal org.apache.maven.plugins:maven-surefire-plugin:2.17:test (default-test)
on project hadoop-hdfs: There are test failures.
[ERROR] 
[ERROR] Please refer to /home/jenkins/jenkins-slave/workspace/Hadoop-Hdfs-trunk-Java8/hadoop-hdfs-project/hadoop-hdfs/target/surefire-reports
for the individual test results.
[ERROR] -> [Help 1]
[ERROR] 
[ERROR] To see the full stack trace of the errors, re-run Maven with the -e switch.
[ERROR] Re-run Maven using the -X switch to enable full debug logging.
[ERROR] 
[ERROR] For more information about the errors and possible solutions, please read the following
articles:
[ERROR] [Help 1] http://cwiki.apache.org/confluence/display/MAVEN/MojoFailureException
[ERROR] 
[ERROR] After correcting the problems, you can resume the build with the command
[ERROR]   mvn <goals> -rf :hadoop-hdfs
Build step 'Execute shell' marked build as failure
Archiving artifacts
Recording test results
Sending e-mails to: hdfs-dev@hadoop.apache.org
Email was triggered for: Failure - Any
Sending email for trigger: Failure - Any



###################################################################################
############################## FAILED TESTS (if any) ##############################
8 tests failed.
FAILED:  org.apache.hadoop.hdfs.TestLeaseRecovery2.testImmediateRecoveryOfLease

Error Message:
org/apache/hadoop/test/GenericTestUtils

Stack Trace:
java.lang.NoClassDefFoundError: org/apache/hadoop/test/GenericTestUtils
	at java.net.URLClassLoader$1.run(URLClassLoader.java:372)
	at java.net.URLClassLoader$1.run(URLClassLoader.java:361)
	at java.security.AccessController.doPrivileged(Native Method)
	at java.net.URLClassLoader.findClass(URLClassLoader.java:360)
	at java.lang.ClassLoader.loadClass(ClassLoader.java:424)
	at sun.misc.Launcher$AppClassLoader.loadClass(Launcher.java:308)
	at java.lang.ClassLoader.loadClass(ClassLoader.java:357)
	at org.apache.hadoop.hdfs.TestLeaseRecovery2.<init>(TestLeaseRecovery2.java:67)


FAILED:  org.apache.hadoop.hdfs.TestLeaseRecovery2.testHardLeaseRecoveryAfterNameNodeRestart

Error Message:
org/apache/hadoop/test/GenericTestUtils

Stack Trace:
java.lang.NoClassDefFoundError: org/apache/hadoop/test/GenericTestUtils
	at org.apache.hadoop.hdfs.TestLeaseRecovery2.<init>(TestLeaseRecovery2.java:67)


FAILED:  org.apache.hadoop.hdfs.TestLeaseRecovery2.testSoftLeaseRecovery

Error Message:
org/apache/hadoop/test/GenericTestUtils

Stack Trace:
java.lang.NoClassDefFoundError: org/apache/hadoop/test/GenericTestUtils
	at org.apache.hadoop.hdfs.TestLeaseRecovery2.<init>(TestLeaseRecovery2.java:67)


FAILED:  org.apache.hadoop.hdfs.TestLeaseRecovery2.testHardLeaseRecoveryAfterNameNodeRestart2

Error Message:
org/apache/hadoop/test/GenericTestUtils

Stack Trace:
java.lang.NoClassDefFoundError: org/apache/hadoop/test/GenericTestUtils
	at org.apache.hadoop.hdfs.TestLeaseRecovery2.<init>(TestLeaseRecovery2.java:67)


FAILED:  org.apache.hadoop.hdfs.TestLeaseRecovery2.testHardLeaseRecoveryWithRenameAfterNameNodeRestart

Error Message:
org/apache/hadoop/test/GenericTestUtils

Stack Trace:
java.lang.NoClassDefFoundError: org/apache/hadoop/test/GenericTestUtils
	at org.apache.hadoop.hdfs.TestLeaseRecovery2.<init>(TestLeaseRecovery2.java:67)


FAILED:  org.apache.hadoop.hdfs.TestLeaseRecovery2.testLeaseRecoverByAnotherUser

Error Message:
org/apache/hadoop/test/GenericTestUtils

Stack Trace:
java.lang.NoClassDefFoundError: org/apache/hadoop/test/GenericTestUtils
	at org.apache.hadoop.hdfs.TestLeaseRecovery2.<init>(TestLeaseRecovery2.java:67)


FAILED:  org.apache.hadoop.hdfs.TestLeaseRecovery2.testHardLeaseRecovery

Error Message:
org/apache/hadoop/test/GenericTestUtils

Stack Trace:
java.lang.NoClassDefFoundError: org/apache/hadoop/test/GenericTestUtils
	at org.apache.hadoop.hdfs.TestLeaseRecovery2.<init>(TestLeaseRecovery2.java:67)


FAILED:  org.apache.hadoop.TestRefreshCallQueue.testRefresh

Error Message:
org.apache.hadoop.TestRefreshCallQueue$MockCallQueue could not be constructed.

Stack Trace:
java.lang.RuntimeException: org.apache.hadoop.TestRefreshCallQueue$MockCallQueue could not
be constructed.
	at org.apache.hadoop.ipc.CallQueueManager.createCallQueueInstance(CallQueueManager.java:164)
	at org.apache.hadoop.ipc.CallQueueManager.<init>(CallQueueManager.java:70)
	at org.apache.hadoop.ipc.Server.<init>(Server.java:2579)
	at org.apache.hadoop.ipc.RPC$Server.<init>(RPC.java:958)
	at org.apache.hadoop.ipc.ProtobufRpcEngine$Server.<init>(ProtobufRpcEngine.java:535)
	at org.apache.hadoop.ipc.ProtobufRpcEngine.getServer(ProtobufRpcEngine.java:510)
	at org.apache.hadoop.ipc.RPC$Builder.build(RPC.java:800)
	at org.apache.hadoop.hdfs.server.namenode.NameNodeRpcServer.<init>(NameNodeRpcServer.java:430)
	at org.apache.hadoop.hdfs.server.namenode.NameNode.createRpcServer(NameNode.java:759)
	at org.apache.hadoop.hdfs.server.namenode.NameNode.initialize(NameNode.java:701)
	at org.apache.hadoop.hdfs.server.namenode.NameNode.<init>(NameNode.java:900)
	at org.apache.hadoop.hdfs.server.namenode.NameNode.<init>(NameNode.java:879)
	at org.apache.hadoop.hdfs.server.namenode.NameNode.createNameNode(NameNode.java:1596)
	at org.apache.hadoop.hdfs.MiniDFSCluster.createNameNode(MiniDFSCluster.java:1247)
	at org.apache.hadoop.hdfs.MiniDFSCluster.configureNameService(MiniDFSCluster.java:1016)
	at org.apache.hadoop.hdfs.MiniDFSCluster.createNameNodesAndSetConf(MiniDFSCluster.java:891)
	at org.apache.hadoop.hdfs.MiniDFSCluster.initMiniDFSCluster(MiniDFSCluster.java:823)
	at org.apache.hadoop.hdfs.MiniDFSCluster.<init>(MiniDFSCluster.java:482)
	at org.apache.hadoop.hdfs.MiniDFSCluster$Builder.build(MiniDFSCluster.java:441)
	at org.apache.hadoop.TestRefreshCallQueue.setUp(TestRefreshCallQueue.java:71)



Mime
  • Unnamed multipart/mixed (inline, None, 0 bytes)
View raw message