hadoop-hdfs-dev mailing list archives

Site index · List index
Message view « Date » · « Thread »
Top « Date » · « Thread »
From Apache Jenkins Server <jenk...@builds.apache.org>
Subject Hadoop-Hdfs-trunk - Build # 2996 - Still Failing
Date Wed, 06 Apr 2016 01:33:50 GMT
See https://builds.apache.org/job/Hadoop-Hdfs-trunk/2996/

###################################################################################
########################## LAST 60 LINES OF THE CONSOLE ###########################
[...truncated 6654 lines...]
[INFO] --- maven-antrun-plugin:1.7:run (create-testdirs) @ hadoop-hdfs-project ---
[INFO] Executing tasks

main:
    [mkdir] Created dir: /home/jenkins/jenkins-slave/workspace/Hadoop-Hdfs-trunk/hadoop-hdfs-project/target/test-dir
[INFO] Executed tasks
[INFO] 
[INFO] --- maven-source-plugin:2.3:jar-no-fork (hadoop-java-sources) @ hadoop-hdfs-project
---
[INFO] 
[INFO] --- maven-source-plugin:2.3:test-jar-no-fork (hadoop-java-sources) @ hadoop-hdfs-project
---
[INFO] 
[INFO] --- maven-enforcer-plugin:1.3.1:enforce (dist-enforce) @ hadoop-hdfs-project ---
[INFO] 
[INFO] --- maven-site-plugin:3.5:attach-descriptor (attach-descriptor) @ hadoop-hdfs-project
---
[INFO] 
[INFO] --- maven-javadoc-plugin:2.8.1:jar (module-javadocs) @ hadoop-hdfs-project ---
[INFO] Skipping javadoc generation
[INFO] 
[INFO] --- maven-enforcer-plugin:1.3.1:enforce (depcheck) @ hadoop-hdfs-project ---
[INFO] 
[INFO] --- maven-checkstyle-plugin:2.15:checkstyle (default-cli) @ hadoop-hdfs-project ---
[INFO] 
[INFO] --- findbugs-maven-plugin:3.0.0:findbugs (default-cli) @ hadoop-hdfs-project ---
[INFO] ------------------------------------------------------------------------
[INFO] Reactor Summary:
[INFO] 
[INFO] Apache Hadoop HDFS Client ......................... SUCCESS [06:03 min]
[INFO] Apache Hadoop HDFS ................................ FAILURE [  04:33 h]
[INFO] Apache Hadoop HDFS Native Client .................. SKIPPED
[INFO] Apache Hadoop HttpFS .............................. SKIPPED
[INFO] Apache Hadoop HDFS BookKeeper Journal ............. SKIPPED
[INFO] Apache Hadoop HDFS-NFS ............................ SKIPPED
[INFO] Apache Hadoop HDFS Project ........................ SUCCESS [  0.083 s]
[INFO] ------------------------------------------------------------------------
[INFO] BUILD FAILURE
[INFO] ------------------------------------------------------------------------
[INFO] Total time: 04:39 h
[INFO] Finished at: 2016-04-06T01:33:38+00:00
[INFO] Final Memory: 56M/551M
[INFO] ------------------------------------------------------------------------
[ERROR] Failed to execute goal org.apache.maven.plugins:maven-surefire-plugin:2.17:test (default-test)
on project hadoop-hdfs: There are test failures.
[ERROR] 
[ERROR] Please refer to /home/jenkins/jenkins-slave/workspace/Hadoop-Hdfs-trunk/hadoop-hdfs-project/hadoop-hdfs/target/surefire-reports
for the individual test results.
[ERROR] -> [Help 1]
[ERROR] 
[ERROR] To see the full stack trace of the errors, re-run Maven with the -e switch.
[ERROR] Re-run Maven using the -X switch to enable full debug logging.
[ERROR] 
[ERROR] For more information about the errors and possible solutions, please read the following
articles:
[ERROR] [Help 1] http://cwiki.apache.org/confluence/display/MAVEN/MojoFailureException
[ERROR] 
[ERROR] After correcting the problems, you can resume the build with the command
[ERROR]   mvn <goals> -rf :hadoop-hdfs
Build step 'Execute shell' marked build as failure
Archiving artifacts
Recording test results
Sending e-mails to: hdfs-dev@hadoop.apache.org
Email was triggered for: Failure - Any
Sending email for trigger: Failure - Any



###################################################################################
############################## FAILED TESTS (if any) ##############################
21 tests failed.
FAILED:  org.apache.hadoop.hdfs.TestDFSShell.testNoTrashConfig

Error Message:
org/apache/hadoop/fs/Trash

Stack Trace:
java.lang.NoClassDefFoundError: org/apache/hadoop/fs/Trash
	at java.net.URLClassLoader$1.run(URLClassLoader.java:366)
	at java.net.URLClassLoader$1.run(URLClassLoader.java:355)
	at java.security.AccessController.doPrivileged(Native Method)
	at java.net.URLClassLoader.findClass(URLClassLoader.java:354)
	at java.lang.ClassLoader.loadClass(ClassLoader.java:425)
	at sun.misc.Launcher$AppClassLoader.loadClass(Launcher.java:308)
	at java.lang.ClassLoader.loadClass(ClassLoader.java:358)
	at org.apache.hadoop.fs.FsShell.getTrash(FsShell.java:88)
	at org.apache.hadoop.fs.FsShell.getCurrentTrashDir(FsShell.java:121)
	at org.apache.hadoop.hdfs.TestDFSShell.deleteFileUsingTrash(TestDFSShell.java:2601)
	at org.apache.hadoop.hdfs.TestDFSShell.testNoTrashConfig(TestDFSShell.java:3180)


FAILED:  org.apache.hadoop.hdfs.TestDFSShell.testFilePermissions

Error Message:
org/apache/hadoop/fs/permission/ChmodParser

Stack Trace:
java.lang.NoClassDefFoundError: org/apache/hadoop/fs/permission/ChmodParser
	at java.net.URLClassLoader$1.run(URLClassLoader.java:366)
	at java.net.URLClassLoader$1.run(URLClassLoader.java:355)
	at java.security.AccessController.doPrivileged(Native Method)
	at java.net.URLClassLoader.findClass(URLClassLoader.java:354)
	at java.lang.ClassLoader.loadClass(ClassLoader.java:425)
	at sun.misc.Launcher$AppClassLoader.loadClass(Launcher.java:308)
	at java.lang.ClassLoader.loadClass(ClassLoader.java:358)
	at org.apache.hadoop.fs.FsShellPermissions$Chmod.processOptions(FsShellPermissions.java:89)
	at org.apache.hadoop.fs.shell.Command.run(Command.java:165)
	at org.apache.hadoop.fs.FsShell.run(FsShell.java:319)
	at org.apache.hadoop.hdfs.TestDFSShell.runCmd(TestDFSShell.java:1003)
	at org.apache.hadoop.hdfs.TestDFSShell.confirmPermissionChange(TestDFSShell.java:1093)
	at org.apache.hadoop.hdfs.TestDFSShell.testChmod(TestDFSShell.java:1032)
	at org.apache.hadoop.hdfs.TestDFSShell.testFilePermissions(TestDFSShell.java:1119)


FAILED:  org.apache.hadoop.hdfs.TestDFSShell.testText

Error Message:
org/apache/hadoop/fs/shell/Display$TextRecordInputStream

Stack Trace:
java.lang.NoClassDefFoundError: org/apache/hadoop/fs/shell/Display$TextRecordInputStream
	at java.net.URLClassLoader$1.run(URLClassLoader.java:366)
	at java.net.URLClassLoader$1.run(URLClassLoader.java:355)
	at java.security.AccessController.doPrivileged(Native Method)
	at java.net.URLClassLoader.findClass(URLClassLoader.java:354)
	at java.lang.ClassLoader.loadClass(ClassLoader.java:425)
	at sun.misc.Launcher$AppClassLoader.loadClass(Launcher.java:308)
	at java.lang.ClassLoader.loadClass(ClassLoader.java:358)
	at java.lang.Class.getDeclaredConstructors0(Native Method)
	at java.lang.Class.privateGetDeclaredConstructors(Class.java:2493)
	at java.lang.Class.getConstructor0(Class.java:2803)
	at java.lang.Class.getDeclaredConstructor(Class.java:2053)
	at org.apache.hadoop.util.ReflectionUtils.newInstance(ReflectionUtils.java:128)
	at org.apache.hadoop.fs.shell.CommandFactory.getInstance(CommandFactory.java:125)
	at org.apache.hadoop.fs.shell.CommandFactory.getInstance(CommandFactory.java:109)
	at org.apache.hadoop.fs.FsShell.run(FsShell.java:306)
	at org.apache.hadoop.util.ToolRunner.run(ToolRunner.java:76)
	at org.apache.hadoop.util.ToolRunner.run(ToolRunner.java:90)
	at org.apache.hadoop.hdfs.TestDFSShell.textTest(TestDFSShell.java:730)
	at org.apache.hadoop.hdfs.TestDFSShell.testText(TestDFSShell.java:691)


FAILED:  org.apache.hadoop.hdfs.TestDFSShell.testClientConfigRespected

Error Message:
org/apache/hadoop/fs/Trash

Stack Trace:
java.lang.NoClassDefFoundError: org/apache/hadoop/fs/Trash
	at org.apache.hadoop.fs.FsShell.getTrash(FsShell.java:88)
	at org.apache.hadoop.fs.FsShell.getCurrentTrashDir(FsShell.java:121)
	at org.apache.hadoop.hdfs.TestDFSShell.deleteFileUsingTrash(TestDFSShell.java:2601)
	at org.apache.hadoop.hdfs.TestDFSShell.testClientConfigRespected(TestDFSShell.java:3172)


FAILED:  org.apache.hadoop.hdfs.TestDFSShell.testDFSShell

Error Message:
org/apache/hadoop/fs/Trash

Stack Trace:
java.lang.NoClassDefFoundError: org/apache/hadoop/fs/Trash
	at java.net.URLClassLoader$1.run(URLClassLoader.java:366)
	at java.net.URLClassLoader$1.run(URLClassLoader.java:355)
	at java.security.AccessController.doPrivileged(Native Method)
	at java.net.URLClassLoader.findClass(URLClassLoader.java:354)
	at java.lang.ClassLoader.loadClass(ClassLoader.java:425)
	at sun.misc.Launcher$AppClassLoader.loadClass(Launcher.java:308)
	at java.lang.ClassLoader.loadClass(ClassLoader.java:358)
	at org.apache.hadoop.fs.shell.Delete$Rm.moveToTrash(Delete.java:153)
	at org.apache.hadoop.fs.shell.Delete$Rm.processPath(Delete.java:118)
	at org.apache.hadoop.fs.shell.Command.processPaths(Command.java:321)
	at org.apache.hadoop.fs.shell.Command.processPathArgument(Command.java:293)
	at org.apache.hadoop.fs.shell.Command.processArgument(Command.java:275)
	at org.apache.hadoop.fs.shell.Command.processArguments(Command.java:259)
	at org.apache.hadoop.fs.shell.FsCommand.processRawArguments(FsCommand.java:119)
	at org.apache.hadoop.fs.shell.Command.run(Command.java:166)
	at org.apache.hadoop.fs.FsShell.run(FsShell.java:319)
	at org.apache.hadoop.hdfs.TestDFSShell.testDFSShell(TestDFSShell.java:1214)


FAILED:  org.apache.hadoop.hdfs.TestDFSShell.testDu

Error Message:
org/apache/hadoop/fs/shell/FsUsage$TableBuilder

Stack Trace:
java.lang.NoClassDefFoundError: org/apache/hadoop/fs/shell/FsUsage$TableBuilder
	at java.net.URLClassLoader$1.run(URLClassLoader.java:366)
	at java.net.URLClassLoader$1.run(URLClassLoader.java:355)
	at java.security.AccessController.doPrivileged(Native Method)
	at java.net.URLClassLoader.findClass(URLClassLoader.java:354)
	at java.lang.ClassLoader.loadClass(ClassLoader.java:425)
	at sun.misc.Launcher$AppClassLoader.loadClass(Launcher.java:308)
	at java.lang.ClassLoader.loadClass(ClassLoader.java:358)
	at org.apache.hadoop.fs.shell.FsUsage$Du.processArguments(FsUsage.java:137)
	at org.apache.hadoop.fs.shell.FsCommand.processRawArguments(FsCommand.java:119)
	at org.apache.hadoop.fs.shell.Command.run(Command.java:166)
	at org.apache.hadoop.fs.FsShell.run(FsShell.java:319)
	at org.apache.hadoop.hdfs.TestDFSShell.testDu(TestDFSShell.java:245)


FAILED:  org.apache.hadoop.hdfs.TestDFSShell.testSetXAttrCaseSensitivity

Error Message:
org/apache/hadoop/fs/XAttrCodec

Stack Trace:
java.lang.NoClassDefFoundError: org/apache/hadoop/fs/XAttrCodec
	at java.net.URLClassLoader$1.run(URLClassLoader.java:366)
	at java.net.URLClassLoader$1.run(URLClassLoader.java:355)
	at java.security.AccessController.doPrivileged(Native Method)
	at java.net.URLClassLoader.findClass(URLClassLoader.java:354)
	at java.lang.ClassLoader.loadClass(ClassLoader.java:425)
	at sun.misc.Launcher$AppClassLoader.loadClass(Launcher.java:308)
	at java.lang.ClassLoader.loadClass(ClassLoader.java:358)
	at org.apache.hadoop.fs.shell.XAttrCommands$GetfattrCommand.<clinit>(XAttrCommands.java:69)
	at sun.reflect.NativeConstructorAccessorImpl.newInstance0(Native Method)
	at sun.reflect.NativeConstructorAccessorImpl.newInstance(NativeConstructorAccessorImpl.java:57)
	at sun.reflect.DelegatingConstructorAccessorImpl.newInstance(DelegatingConstructorAccessorImpl.java:45)
	at java.lang.reflect.Constructor.newInstance(Constructor.java:526)
	at org.apache.hadoop.util.ReflectionUtils.newInstance(ReflectionUtils.java:132)
	at org.apache.hadoop.fs.shell.CommandFactory.getInstance(CommandFactory.java:125)
	at org.apache.hadoop.fs.shell.CommandFactory.getInstance(CommandFactory.java:109)
	at org.apache.hadoop.fs.FsShell.run(FsShell.java:306)
	at org.apache.hadoop.util.ToolRunner.run(ToolRunner.java:76)
	at org.apache.hadoop.util.ToolRunner.run(ToolRunner.java:90)
	at org.apache.hadoop.hdfs.TestDFSShell.doSetXattr(TestDFSShell.java:2858)
	at org.apache.hadoop.hdfs.TestDFSShell.testSetXAttrCaseSensitivity(TestDFSShell.java:2801)


FAILED:  org.apache.hadoop.hdfs.TestDFSShell.testServerConfigRespectedWithClient

Error Message:
Test resulted in an unexpected exit

Stack Trace:
java.lang.AssertionError: Test resulted in an unexpected exit
	at org.apache.hadoop.hdfs.MiniDFSCluster.shutdown(MiniDFSCluster.java:1895)
	at org.apache.hadoop.hdfs.MiniDFSCluster.shutdown(MiniDFSCluster.java:1882)
	at org.apache.hadoop.hdfs.MiniDFSCluster.shutdown(MiniDFSCluster.java:1875)
	at org.apache.hadoop.hdfs.MiniDFSCluster.initMiniDFSCluster(MiniDFSCluster.java:854)
	at org.apache.hadoop.hdfs.MiniDFSCluster.<init>(MiniDFSCluster.java:482)
	at org.apache.hadoop.hdfs.MiniDFSCluster$Builder.build(MiniDFSCluster.java:441)
	at org.apache.hadoop.hdfs.TestDFSShell.deleteFileUsingTrash(TestDFSShell.java:2577)
	at org.apache.hadoop.hdfs.TestDFSShell.testServerConfigRespectedWithClient(TestDFSShell.java:3163)


FAILED:  org.apache.hadoop.hdfs.TestDFSShell.testServerConfigRespected

Error Message:
Test resulted in an unexpected exit

Stack Trace:
java.lang.AssertionError: Test resulted in an unexpected exit
	at org.apache.hadoop.hdfs.MiniDFSCluster.shutdown(MiniDFSCluster.java:1895)
	at org.apache.hadoop.hdfs.MiniDFSCluster.shutdown(MiniDFSCluster.java:1882)
	at org.apache.hadoop.hdfs.MiniDFSCluster.shutdown(MiniDFSCluster.java:1875)
	at org.apache.hadoop.hdfs.MiniDFSCluster.initMiniDFSCluster(MiniDFSCluster.java:854)
	at org.apache.hadoop.hdfs.MiniDFSCluster.<init>(MiniDFSCluster.java:482)
	at org.apache.hadoop.hdfs.MiniDFSCluster$Builder.build(MiniDFSCluster.java:441)
	at org.apache.hadoop.hdfs.TestDFSShell.deleteFileUsingTrash(TestDFSShell.java:2577)
	at org.apache.hadoop.hdfs.TestDFSShell.testServerConfigRespected(TestDFSShell.java:3154)


FAILED:  org.apache.hadoop.hdfs.TestDFSShell.testChmodReserved

Error Message:
org/apache/hadoop/fs/permission/ChmodParser

Stack Trace:
java.lang.NoClassDefFoundError: org/apache/hadoop/fs/permission/ChmodParser
	at org.apache.hadoop.fs.FsShellPermissions$Chmod.processOptions(FsShellPermissions.java:89)
	at org.apache.hadoop.fs.shell.Command.run(Command.java:165)
	at org.apache.hadoop.fs.FsShell.run(FsShell.java:319)
	at org.apache.hadoop.hdfs.TestDFSShell.runCmd(TestDFSShell.java:1003)
	at org.apache.hadoop.hdfs.TestDFSShell.testChmodReserved(TestDFSShell.java:3314)


FAILED:  org.apache.hadoop.hdfs.TestDFSShell.testSetXAttrPermissionAsDifferentOwner

Error Message:
org/apache/hadoop/fs/permission/ChmodParser

Stack Trace:
java.lang.NoClassDefFoundError: org/apache/hadoop/fs/permission/ChmodParser
	at org.apache.hadoop.fs.FsShellPermissions$Chmod.processOptions(FsShellPermissions.java:89)
	at org.apache.hadoop.fs.shell.Command.run(Command.java:165)
	at org.apache.hadoop.fs.FsShell.run(FsShell.java:319)
	at org.apache.hadoop.util.ToolRunner.run(ToolRunner.java:76)
	at org.apache.hadoop.util.ToolRunner.run(ToolRunner.java:90)
	at org.apache.hadoop.hdfs.TestDFSShell$9.run(TestDFSShell.java:2948)
	at java.security.AccessController.doPrivileged(Native Method)
	at javax.security.auth.Subject.doAs(Subject.java:415)
	at org.apache.hadoop.security.UserGroupInformation.doAs(UserGroupInformation.java:1742)
	at org.apache.hadoop.hdfs.TestDFSShell.testSetXAttrPermissionAsDifferentOwner(TestDFSShell.java:2944)


FAILED:  org.apache.hadoop.hdfs.TestDFSShell.testErrOutPut

Error Message:
org/apache/hadoop/fs/shell/FsUsage$TableBuilder

Stack Trace:
java.lang.NoClassDefFoundError: org/apache/hadoop/fs/shell/FsUsage$TableBuilder
	at org.apache.hadoop.fs.shell.FsUsage$Du.processArguments(FsUsage.java:137)
	at org.apache.hadoop.fs.shell.FsCommand.processRawArguments(FsCommand.java:119)
	at org.apache.hadoop.fs.shell.Command.run(Command.java:166)
	at org.apache.hadoop.fs.FsShell.run(FsShell.java:319)
	at org.apache.hadoop.util.ToolRunner.run(ToolRunner.java:76)
	at org.apache.hadoop.util.ToolRunner.run(ToolRunner.java:90)
	at org.apache.hadoop.hdfs.TestDFSShell.testErrOutPut(TestDFSShell.java:454)


FAILED:  org.apache.hadoop.hdfs.TestDFSShell.testURIPaths

Error Message:
org/apache/hadoop/fs/Trash

Stack Trace:
java.lang.NoClassDefFoundError: org/apache/hadoop/fs/Trash
	at org.apache.hadoop.fs.shell.Delete$Rm.moveToTrash(Delete.java:153)
	at org.apache.hadoop.fs.shell.Delete$Rm.processPath(Delete.java:118)
	at org.apache.hadoop.fs.shell.Command.processPaths(Command.java:321)
	at org.apache.hadoop.fs.shell.Command.processPathArgument(Command.java:293)
	at org.apache.hadoop.fs.shell.Command.processArgument(Command.java:275)
	at org.apache.hadoop.fs.shell.Command.processArguments(Command.java:259)
	at org.apache.hadoop.fs.shell.FsCommand.processRawArguments(FsCommand.java:119)
	at org.apache.hadoop.fs.shell.Command.run(Command.java:166)
	at org.apache.hadoop.fs.FsShell.run(FsShell.java:319)
	at org.apache.hadoop.util.ToolRunner.run(ToolRunner.java:76)
	at org.apache.hadoop.util.ToolRunner.run(ToolRunner.java:90)
	at org.apache.hadoop.hdfs.TestDFSShell.testURIPaths(TestDFSShell.java:620)


FAILED:  org.apache.hadoop.hdfs.TestDFSShell.testGetFAttrErrors

Error Message:
org/apache/hadoop/fs/XAttrCodec

Stack Trace:
java.lang.NoClassDefFoundError: org/apache/hadoop/fs/XAttrCodec
	at java.net.URLClassLoader$1.run(URLClassLoader.java:366)
	at java.net.URLClassLoader$1.run(URLClassLoader.java:355)
	at java.security.AccessController.doPrivileged(Native Method)
	at java.net.URLClassLoader.findClass(URLClassLoader.java:354)
	at java.lang.ClassLoader.loadClass(ClassLoader.java:425)
	at sun.misc.Launcher$AppClassLoader.loadClass(Launcher.java:308)
	at java.lang.ClassLoader.loadClass(ClassLoader.java:358)
	at org.apache.hadoop.fs.shell.XAttrCommands$SetfattrCommand.processOptions(XAttrCommands.java:164)
	at org.apache.hadoop.fs.shell.Command.run(Command.java:165)
	at org.apache.hadoop.fs.FsShell.run(FsShell.java:319)
	at org.apache.hadoop.util.ToolRunner.run(ToolRunner.java:76)
	at org.apache.hadoop.util.ToolRunner.run(ToolRunner.java:90)
	at org.apache.hadoop.hdfs.TestDFSShell.testGetFAttrErrors(TestDFSShell.java:3109)


FAILED:  org.apache.hadoop.hdfs.TestDFSShell.testSetXAttrPermission

Error Message:
org/apache/hadoop/fs/XAttrCodec

Stack Trace:
java.lang.NoClassDefFoundError: org/apache/hadoop/fs/XAttrCodec
	at org.apache.hadoop.fs.shell.XAttrCommands$SetfattrCommand.processOptions(XAttrCommands.java:164)
	at org.apache.hadoop.fs.shell.Command.run(Command.java:165)
	at org.apache.hadoop.fs.FsShell.run(FsShell.java:319)
	at org.apache.hadoop.util.ToolRunner.run(ToolRunner.java:76)
	at org.apache.hadoop.util.ToolRunner.run(ToolRunner.java:90)
	at org.apache.hadoop.hdfs.TestDFSShell$6.run(TestDFSShell.java:2732)
	at java.security.AccessController.doPrivileged(Native Method)
	at javax.security.auth.Subject.doAs(Subject.java:415)
	at org.apache.hadoop.security.UserGroupInformation.doAs(UserGroupInformation.java:1742)
	at org.apache.hadoop.hdfs.TestDFSShell.testSetXAttrPermission(TestDFSShell.java:2729)


FAILED:  org.apache.hadoop.hdfs.server.blockmanagement.TestRBWBlockInvalidation.testBlockInvalidationWhenRBWReplicaMissedInDN

Error Message:
test timed out after 600000 milliseconds

Stack Trace:
java.lang.Exception: test timed out after 600000 milliseconds
	at java.lang.Thread.sleep(Native Method)
	at org.apache.hadoop.hdfs.server.blockmanagement.TestRBWBlockInvalidation.testBlockInvalidationWhenRBWReplicaMissedInDN(TestRBWBlockInvalidation.java:121)


FAILED:  org.apache.hadoop.hdfs.server.datanode.fsdataset.impl.TestSpaceReservation.testTmpSpaceReserve

Error Message:
Wrong reserve space for Tmp  expected:<200> but was:<1000>

Stack Trace:
java.lang.AssertionError: Wrong reserve space for Tmp  expected:<200> but was:<1000>
	at org.junit.Assert.fail(Assert.java:88)
	at org.junit.Assert.failNotEquals(Assert.java:743)
	at org.junit.Assert.assertEquals(Assert.java:118)
	at org.junit.Assert.assertEquals(Assert.java:555)
	at org.apache.hadoop.hdfs.server.datanode.fsdataset.impl.TestSpaceReservation.testTmpSpaceReserve(TestSpaceReservation.java:454)


FAILED:  org.apache.hadoop.hdfs.server.namenode.TestEditLog.testBatchedSyncWithClosedLogs[1]

Error Message:
logging edit without syncing should do not affect txid expected:<1> but was:<2>

Stack Trace:
java.lang.AssertionError: logging edit without syncing should do not affect txid expected:<1>
but was:<2>
	at org.junit.Assert.fail(Assert.java:88)
	at org.junit.Assert.failNotEquals(Assert.java:743)
	at org.junit.Assert.assertEquals(Assert.java:118)
	at org.junit.Assert.assertEquals(Assert.java:555)
	at org.apache.hadoop.hdfs.server.namenode.TestEditLog.testBatchedSyncWithClosedLogs(TestEditLog.java:594)


FAILED:  org.apache.hadoop.hdfs.server.namenode.TestReconstructStripedBlocks.testCountLiveReplicas

Error Message:
null

Stack Trace:
java.lang.AssertionError: null
	at org.junit.Assert.fail(Assert.java:86)
	at org.junit.Assert.assertTrue(Assert.java:41)
	at org.junit.Assert.assertTrue(Assert.java:52)
	at org.apache.hadoop.hdfs.server.namenode.TestReconstructStripedBlocks.testCountLiveReplicas(TestReconstructStripedBlocks.java:324)


FAILED:  org.apache.hadoop.metrics2.sink.TestRollingFileSystemSinkWithSecureHdfs.testWithSecureHDFS

Error Message:
Failed on local exception: java.io.IOException: javax.security.sasl.SaslException: GSS initiate
failed [Caused by GSSException: No valid credentials provided (Mechanism level: Cannot get
a KDC reply)]; Host Details : local host is: "asf909.gq1.ygridcore.net/67.195.81.153"; destination
host is: "localhost":47566; 

Stack Trace:
java.io.IOException: Failed on local exception: java.io.IOException: javax.security.sasl.SaslException:
GSS initiate failed [Caused by GSSException: No valid credentials provided (Mechanism level:
Cannot get a KDC reply)]; Host Details : local host is: "asf909.gq1.ygridcore.net/67.195.81.153";
destination host is: "localhost":47566; 
	at sun.security.krb5.KdcComm.send(KdcComm.java:250)
	at sun.security.krb5.KdcComm.send(KdcComm.java:191)
	at sun.security.krb5.KrbTgsReq.send(KrbTgsReq.java:187)
	at sun.security.krb5.KrbTgsReq.sendAndGetCreds(KrbTgsReq.java:202)
	at sun.security.krb5.internal.CredentialsUtil.serviceCreds(CredentialsUtil.java:311)
	at sun.security.krb5.internal.CredentialsUtil.acquireServiceCreds(CredentialsUtil.java:115)
	at sun.security.krb5.Credentials.acquireServiceCreds(Credentials.java:449)
	at sun.security.jgss.krb5.Krb5Context.initSecContext(Krb5Context.java:641)
	at sun.security.jgss.GSSContextImpl.initSecContext(GSSContextImpl.java:248)
	at sun.security.jgss.GSSContextImpl.initSecContext(GSSContextImpl.java:179)
	at com.sun.security.sasl.gsskerb.GssKrb5Client.evaluateChallenge(GssKrb5Client.java:193)
	at org.apache.hadoop.security.SaslRpcClient.saslConnect(SaslRpcClient.java:411)
	at org.apache.hadoop.ipc.Client$Connection.setupSaslConnection(Client.java:597)
	at org.apache.hadoop.ipc.Client$Connection.access$2000(Client.java:397)
	at org.apache.hadoop.ipc.Client$Connection$2.run(Client.java:779)
	at org.apache.hadoop.ipc.Client$Connection$2.run(Client.java:775)
	at java.security.AccessController.doPrivileged(Native Method)
	at javax.security.auth.Subject.doAs(Subject.java:415)
	at org.apache.hadoop.security.UserGroupInformation.doAs(UserGroupInformation.java:1742)
	at org.apache.hadoop.ipc.Client$Connection.setupIOstreams(Client.java:774)
	at org.apache.hadoop.ipc.Client$Connection.access$3000(Client.java:397)
	at org.apache.hadoop.ipc.Client.getConnection(Client.java:1442)
	at org.apache.hadoop.ipc.Client.call(Client.java:1357)
	at org.apache.hadoop.ipc.Client.call(Client.java:1335)
	at org.apache.hadoop.ipc.ProtobufRpcEngine$Invoker.invoke(ProtobufRpcEngine.java:230)
	at com.sun.proxy.$Proxy25.mkdirs(Unknown Source)
	at org.apache.hadoop.hdfs.protocolPB.ClientNamenodeProtocolTranslatorPB.mkdirs(ClientNamenodeProtocolTranslatorPB.java:536)
	at sun.reflect.NativeMethodAccessorImpl.invoke0(Native Method)
	at sun.reflect.NativeMethodAccessorImpl.invoke(NativeMethodAccessorImpl.java:57)
	at sun.reflect.DelegatingMethodAccessorImpl.invoke(DelegatingMethodAccessorImpl.java:43)
	at java.lang.reflect.Method.invoke(Method.java:606)
	at org.apache.hadoop.io.retry.RetryInvocationHandler.invokeMethod(RetryInvocationHandler.java:257)
	at org.apache.hadoop.io.retry.RetryInvocationHandler.invoke(RetryInvocationHandler.java:103)
	at com.sun.proxy.$Proxy26.mkdirs(Unknown Source)
	at org.apache.hadoop.hdfs.DFSClient.primitiveMkdir(DFSClient.java:2302)
	at org.apache.hadoop.hdfs.DFSClient.mkdirs(DFSClient.java:2277)
	at org.apache.hadoop.hdfs.DistributedFileSystem$24.doCall(DistributedFileSystem.java:1079)
	at org.apache.hadoop.hdfs.DistributedFileSystem$24.doCall(DistributedFileSystem.java:1076)
	at org.apache.hadoop.fs.FileSystemLinkResolver.resolve(FileSystemLinkResolver.java:81)
	at org.apache.hadoop.hdfs.DistributedFileSystem.mkdirsInternal(DistributedFileSystem.java:1076)
	at org.apache.hadoop.hdfs.DistributedFileSystem.mkdirs(DistributedFileSystem.java:1069)
	at org.apache.hadoop.fs.FileSystem.mkdirs(FileSystem.java:1909)
	at org.apache.hadoop.metrics2.sink.TestRollingFileSystemSinkWithSecureHdfs.createDirectoriesSecurely(TestRollingFileSystemSinkWithSecureHdfs.java:206)
	at org.apache.hadoop.metrics2.sink.TestRollingFileSystemSinkWithSecureHdfs.testWithSecureHDFS(TestRollingFileSystemSinkWithSecureHdfs.java:95)


FAILED:  org.apache.hadoop.hdfs.server.blockmanagement.TestBlockManager.testBlockReportQueueing

Error Message:
null

Stack Trace:
java.lang.AssertionError: null
	at org.junit.Assert.fail(Assert.java:86)
	at org.junit.Assert.assertTrue(Assert.java:41)
	at org.junit.Assert.assertTrue(Assert.java:52)
	at org.apache.hadoop.hdfs.server.blockmanagement.TestBlockManager.testBlockReportQueueing(TestBlockManager.java:1051)



Mime
  • Unnamed multipart/mixed (inline, None, 0 bytes)
View raw message