hadoop-hdfs-dev mailing list archives

Site index · List index
Message view « Date » · « Thread »
Top « Date » · « Thread »
From Apache Jenkins Server <jenk...@builds.apache.org>
Subject Hadoop-Hdfs-trunk - Build # 3024 - Still Failing
Date Wed, 13 Apr 2016 15:37:22 GMT
See https://builds.apache.org/job/Hadoop-Hdfs-trunk/3024/

###################################################################################
########################## LAST 60 LINES OF THE CONSOLE ###########################
[...truncated 27255 lines...]
[INFO] --- maven-clean-plugin:2.5:clean (default-clean) @ hadoop-hdfs-project ---
[INFO] Deleting /home/jenkins/jenkins-slave/workspace/Hadoop-Hdfs-trunk/hadoop-hdfs-project/target
[INFO] 
[INFO] --- maven-antrun-plugin:1.7:run (create-testdirs) @ hadoop-hdfs-project ---
[INFO] Executing tasks

main:
    [mkdir] Created dir: /home/jenkins/jenkins-slave/workspace/Hadoop-Hdfs-trunk/hadoop-hdfs-project/target/test-dir
[INFO] Executed tasks
[INFO] 
[INFO] --- maven-source-plugin:2.3:jar-no-fork (hadoop-java-sources) @ hadoop-hdfs-project
---
[INFO] 
[INFO] --- maven-source-plugin:2.3:test-jar-no-fork (hadoop-java-sources) @ hadoop-hdfs-project
---
[INFO] 
[INFO] --- maven-enforcer-plugin:1.3.1:enforce (dist-enforce) @ hadoop-hdfs-project ---
[INFO] 
[INFO] --- maven-site-plugin:3.5:attach-descriptor (attach-descriptor) @ hadoop-hdfs-project
---
[INFO] 
[INFO] --- maven-javadoc-plugin:2.8.1:jar (module-javadocs) @ hadoop-hdfs-project ---
[INFO] Skipping javadoc generation
[INFO] 
[INFO] --- maven-enforcer-plugin:1.3.1:enforce (depcheck) @ hadoop-hdfs-project ---
[INFO] 
[INFO] --- maven-checkstyle-plugin:2.15:checkstyle (default-cli) @ hadoop-hdfs-project ---
[INFO] 
[INFO] --- findbugs-maven-plugin:3.0.0:findbugs (default-cli) @ hadoop-hdfs-project ---
[INFO] ------------------------------------------------------------------------
[INFO] Reactor Summary:
[INFO] 
[INFO] Apache Hadoop HDFS Client ......................... SUCCESS [03:57 min]
[INFO] Apache Hadoop HDFS ................................ FAILURE [  04:00 h]
[INFO] Apache Hadoop HDFS Native Client .................. SKIPPED
[INFO] Apache Hadoop HttpFS .............................. SKIPPED
[INFO] Apache Hadoop HDFS BookKeeper Journal ............. SKIPPED
[INFO] Apache Hadoop HDFS-NFS ............................ SKIPPED
[INFO] Apache Hadoop HDFS Project ........................ SUCCESS [  0.070 s]
[INFO] ------------------------------------------------------------------------
[INFO] BUILD FAILURE
[INFO] ------------------------------------------------------------------------
[INFO] Total time: 04:04 h
[INFO] Finished at: 2016-04-13T15:37:11+00:00
[INFO] Final Memory: 59M/541M
[INFO] ------------------------------------------------------------------------
[ERROR] Failed to execute goal org.apache.maven.plugins:maven-surefire-plugin:2.17:test (default-test)
on project hadoop-hdfs: There was a timeout or other error in the fork -> [Help 1]
[ERROR] 
[ERROR] To see the full stack trace of the errors, re-run Maven with the -e switch.
[ERROR] Re-run Maven using the -X switch to enable full debug logging.
[ERROR] 
[ERROR] For more information about the errors and possible solutions, please read the following
articles:
[ERROR] [Help 1] http://cwiki.apache.org/confluence/display/MAVEN/MojoFailureException
[ERROR] 
[ERROR] After correcting the problems, you can resume the build with the command
[ERROR]   mvn <goals> -rf :hadoop-hdfs
Build step 'Execute shell' marked build as failure
Archiving artifacts
Recording test results
Sending e-mails to: hdfs-dev@hadoop.apache.org
Email was triggered for: Failure - Any
Sending email for trigger: Failure - Any



###################################################################################
############################## FAILED TESTS (if any) ##############################
16 tests failed.
FAILED:  org.apache.hadoop.hdfs.TestDFSStripedOutputStreamWithFailure.testBlockTokenExpired

Error Message:
Got error, status=ERROR, status message opReadBlock BP-1001553257-67.195.81.148-1460553603497:blk_-9223372036854775792_1002
received exception java.io.IOException: BlockId -9223372036854775792 is not valid., for OP_READ_BLOCK,
self=/127.0.0.1:36118, remote=/127.0.0.1:48382, for file /127.0.0.1:48382:-9223372036854775792,
for pool BP-1001553257-67.195.81.148-1460553603497 block -9223372036854775792_1002

Stack Trace:
java.io.IOException: Got error, status=ERROR, status message opReadBlock BP-1001553257-67.195.81.148-1460553603497:blk_-9223372036854775792_1002
received exception java.io.IOException: BlockId -9223372036854775792 is not valid., for OP_READ_BLOCK,
self=/127.0.0.1:36118, remote=/127.0.0.1:48382, for file /127.0.0.1:48382:-9223372036854775792,
for pool BP-1001553257-67.195.81.148-1460553603497 block -9223372036854775792_1002
	at org.apache.hadoop.hdfs.protocol.datatransfer.DataTransferProtoUtil.checkBlockOpStatus(DataTransferProtoUtil.java:118)
	at org.apache.hadoop.hdfs.RemoteBlockReader2.checkSuccess(RemoteBlockReader2.java:443)
	at org.apache.hadoop.hdfs.RemoteBlockReader2.newBlockReader(RemoteBlockReader2.java:411)
	at org.apache.hadoop.hdfs.BlockReaderFactory.getRemoteBlockReader(BlockReaderFactory.java:846)
	at org.apache.hadoop.hdfs.BlockReaderFactory.getRemoteBlockReaderFromTcp(BlockReaderFactory.java:735)
	at org.apache.hadoop.hdfs.BlockReaderFactory.build(BlockReaderFactory.java:377)
	at org.apache.hadoop.hdfs.BlockReaderTestUtil.getBlockReader(BlockReaderTestUtil.java:181)
	at org.apache.hadoop.hdfs.StripedFileTestUtil.checkData(StripedFileTestUtil.java:440)
	at org.apache.hadoop.hdfs.TestDFSStripedOutputStreamWithFailure.runTest(TestDFSStripedOutputStreamWithFailure.java:436)
	at org.apache.hadoop.hdfs.TestDFSStripedOutputStreamWithFailure.testBlockTokenExpired(TestDFSStripedOutputStreamWithFailure.java:238)


FAILED:  org.apache.hadoop.hdfs.TestDFSStripedOutputStreamWithFailure120.test1

Error Message:
failed, dn=5, length=2621439java.lang.ClassCastException: org.apache.hadoop.hdfs.DFSOutputStream
cannot be cast to org.apache.hadoop.hdfs.DFSStripedOutputStream
 at org.apache.hadoop.hdfs.TestDFSStripedOutputStreamWithFailure.runTest(TestDFSStripedOutputStreamWithFailure.java:389)
 at org.apache.hadoop.hdfs.TestDFSStripedOutputStreamWithFailure.runTest(TestDFSStripedOutputStreamWithFailure.java:322)
 at org.apache.hadoop.hdfs.TestDFSStripedOutputStreamWithFailure$TestBase.run(TestDFSStripedOutputStreamWithFailure.java:527)
 at org.apache.hadoop.hdfs.TestDFSStripedOutputStreamWithFailure$TestBase.test1(TestDFSStripedOutputStreamWithFailure.java:531)
 at sun.reflect.NativeMethodAccessorImpl.invoke0(Native Method)
 at sun.reflect.NativeMethodAccessorImpl.invoke(NativeMethodAccessorImpl.java:57)
 at sun.reflect.DelegatingMethodAccessorImpl.invoke(DelegatingMethodAccessorImpl.java:43)
 at java.lang.reflect.Method.invoke(Method.java:606)
 at org.junit.runners.model.FrameworkMethod$1.runReflectiveCall(FrameworkMethod.java:47)
 at org.junit.internal.runners.model.ReflectiveCallable.run(ReflectiveCallable.java:12)
 at org.junit.runners.model.FrameworkMethod.invokeExplosively(FrameworkMethod.java:44)
 at org.junit.internal.runners.statements.InvokeMethod.evaluate(InvokeMethod.java:17)
 at org.junit.internal.runners.statements.FailOnTimeout$StatementThread.run(FailOnTimeout.java:74)


Stack Trace:
java.lang.AssertionError: failed, dn=5, length=2621439java.lang.ClassCastException: org.apache.hadoop.hdfs.DFSOutputStream
cannot be cast to org.apache.hadoop.hdfs.DFSStripedOutputStream
	at org.apache.hadoop.hdfs.TestDFSStripedOutputStreamWithFailure.runTest(TestDFSStripedOutputStreamWithFailure.java:389)
	at org.apache.hadoop.hdfs.TestDFSStripedOutputStreamWithFailure.runTest(TestDFSStripedOutputStreamWithFailure.java:322)
	at org.apache.hadoop.hdfs.TestDFSStripedOutputStreamWithFailure$TestBase.run(TestDFSStripedOutputStreamWithFailure.java:527)
	at org.apache.hadoop.hdfs.TestDFSStripedOutputStreamWithFailure$TestBase.test1(TestDFSStripedOutputStreamWithFailure.java:531)
	at sun.reflect.NativeMethodAccessorImpl.invoke0(Native Method)
	at sun.reflect.NativeMethodAccessorImpl.invoke(NativeMethodAccessorImpl.java:57)
	at sun.reflect.DelegatingMethodAccessorImpl.invoke(DelegatingMethodAccessorImpl.java:43)
	at java.lang.reflect.Method.invoke(Method.java:606)
	at org.junit.runners.model.FrameworkMethod$1.runReflectiveCall(FrameworkMethod.java:47)
	at org.junit.internal.runners.model.ReflectiveCallable.run(ReflectiveCallable.java:12)
	at org.junit.runners.model.FrameworkMethod.invokeExplosively(FrameworkMethod.java:44)
	at org.junit.internal.runners.statements.InvokeMethod.evaluate(InvokeMethod.java:17)
	at org.junit.internal.runners.statements.FailOnTimeout$StatementThread.run(FailOnTimeout.java:74)

	at org.junit.Assert.fail(Assert.java:88)
	at org.apache.hadoop.hdfs.TestDFSStripedOutputStreamWithFailure.runTest(TestDFSStripedOutputStreamWithFailure.java:327)
	at org.apache.hadoop.hdfs.TestDFSStripedOutputStreamWithFailure$TestBase.run(TestDFSStripedOutputStreamWithFailure.java:527)
	at org.apache.hadoop.hdfs.TestDFSStripedOutputStreamWithFailure$TestBase.test1(TestDFSStripedOutputStreamWithFailure.java:531)
	at sun.reflect.NativeMethodAccessorImpl.invoke0(Native Method)
	at sun.reflect.NativeMethodAccessorImpl.invoke(NativeMethodAccessorImpl.java:57)
	at sun.reflect.DelegatingMethodAccessorImpl.invoke(DelegatingMethodAccessorImpl.java:43)
	at java.lang.reflect.Method.invoke(Method.java:606)
	at org.junit.runners.model.FrameworkMethod$1.runReflectiveCall(FrameworkMethod.java:47)
	at org.junit.internal.runners.model.ReflectiveCallable.run(ReflectiveCallable.java:12)
	at org.junit.runners.model.FrameworkMethod.invokeExplosively(FrameworkMethod.java:44)
	at org.junit.internal.runners.statements.InvokeMethod.evaluate(InvokeMethod.java:17)
	at org.junit.internal.runners.statements.FailOnTimeout$StatementThread.run(FailOnTimeout.java:74)


FAILED:  org.apache.hadoop.hdfs.TestParallelUnixDomainRead.testParallelReadByteBuffer

Error Message:
Check log for errors

Stack Trace:
java.lang.AssertionError: Check log for errors
	at org.junit.Assert.fail(Assert.java:88)
	at org.apache.hadoop.hdfs.TestParallelReadUtil.runTestWorkload(TestParallelReadUtil.java:382)
	at org.apache.hadoop.hdfs.TestParallelReadUtil.testParallelReadByteBuffer(TestParallelReadUtil.java:410)
	at sun.reflect.NativeMethodAccessorImpl.invoke0(Native Method)
	at sun.reflect.NativeMethodAccessorImpl.invoke(NativeMethodAccessorImpl.java:57)
	at sun.reflect.DelegatingMethodAccessorImpl.invoke(DelegatingMethodAccessorImpl.java:43)
	at java.lang.reflect.Method.invoke(Method.java:606)
	at org.junit.runners.model.FrameworkMethod$1.runReflectiveCall(FrameworkMethod.java:47)
	at org.junit.internal.runners.model.ReflectiveCallable.run(ReflectiveCallable.java:12)
	at org.junit.runners.model.FrameworkMethod.invokeExplosively(FrameworkMethod.java:44)
	at org.junit.internal.runners.statements.InvokeMethod.evaluate(InvokeMethod.java:17)
	at org.junit.internal.runners.statements.RunBefores.evaluate(RunBefores.java:26)
	at org.junit.runners.ParentRunner.runLeaf(ParentRunner.java:271)
	at org.junit.runners.BlockJUnit4ClassRunner.runChild(BlockJUnit4ClassRunner.java:70)
	at org.junit.runners.BlockJUnit4ClassRunner.runChild(BlockJUnit4ClassRunner.java:50)
	at org.junit.runners.ParentRunner$3.run(ParentRunner.java:238)
	at org.junit.runners.ParentRunner$1.schedule(ParentRunner.java:63)
	at org.junit.runners.ParentRunner.runChildren(ParentRunner.java:236)
	at org.junit.runners.ParentRunner.access$000(ParentRunner.java:53)
	at org.junit.runners.ParentRunner$2.evaluate(ParentRunner.java:229)
	at org.junit.internal.runners.statements.RunBefores.evaluate(RunBefores.java:26)
	at org.junit.internal.runners.statements.RunAfters.evaluate(RunAfters.java:27)
	at org.junit.runners.ParentRunner.run(ParentRunner.java:309)
	at org.apache.maven.surefire.junit4.JUnit4Provider.execute(JUnit4Provider.java:264)
	at org.apache.maven.surefire.junit4.JUnit4Provider.executeTestSet(JUnit4Provider.java:153)
	at org.apache.maven.surefire.junit4.JUnit4Provider.invoke(JUnit4Provider.java:124)
	at org.apache.maven.surefire.booter.ForkedBooter.invokeProviderInSameClassLoader(ForkedBooter.java:200)
	at org.apache.maven.surefire.booter.ForkedBooter.runSuitesInProcess(ForkedBooter.java:153)
	at org.apache.maven.surefire.booter.ForkedBooter.main(ForkedBooter.java:103)


FAILED:  org.apache.hadoop.hdfs.TestParallelUnixDomainRead.testParallelReadMixed

Error Message:
Check log for errors

Stack Trace:
java.lang.AssertionError: Check log for errors
	at org.junit.Assert.fail(Assert.java:88)
	at org.apache.hadoop.hdfs.TestParallelReadUtil.runTestWorkload(TestParallelReadUtil.java:382)
	at org.apache.hadoop.hdfs.TestParallelReadUtil.testParallelReadMixed(TestParallelReadUtil.java:415)
	at sun.reflect.NativeMethodAccessorImpl.invoke0(Native Method)
	at sun.reflect.NativeMethodAccessorImpl.invoke(NativeMethodAccessorImpl.java:57)
	at sun.reflect.DelegatingMethodAccessorImpl.invoke(DelegatingMethodAccessorImpl.java:43)
	at java.lang.reflect.Method.invoke(Method.java:606)
	at org.junit.runners.model.FrameworkMethod$1.runReflectiveCall(FrameworkMethod.java:47)
	at org.junit.internal.runners.model.ReflectiveCallable.run(ReflectiveCallable.java:12)
	at org.junit.runners.model.FrameworkMethod.invokeExplosively(FrameworkMethod.java:44)
	at org.junit.internal.runners.statements.InvokeMethod.evaluate(InvokeMethod.java:17)
	at org.junit.internal.runners.statements.RunBefores.evaluate(RunBefores.java:26)
	at org.junit.runners.ParentRunner.runLeaf(ParentRunner.java:271)
	at org.junit.runners.BlockJUnit4ClassRunner.runChild(BlockJUnit4ClassRunner.java:70)
	at org.junit.runners.BlockJUnit4ClassRunner.runChild(BlockJUnit4ClassRunner.java:50)
	at org.junit.runners.ParentRunner$3.run(ParentRunner.java:238)
	at org.junit.runners.ParentRunner$1.schedule(ParentRunner.java:63)
	at org.junit.runners.ParentRunner.runChildren(ParentRunner.java:236)
	at org.junit.runners.ParentRunner.access$000(ParentRunner.java:53)
	at org.junit.runners.ParentRunner$2.evaluate(ParentRunner.java:229)
	at org.junit.internal.runners.statements.RunBefores.evaluate(RunBefores.java:26)
	at org.junit.internal.runners.statements.RunAfters.evaluate(RunAfters.java:27)
	at org.junit.runners.ParentRunner.run(ParentRunner.java:309)
	at org.apache.maven.surefire.junit4.JUnit4Provider.execute(JUnit4Provider.java:264)
	at org.apache.maven.surefire.junit4.JUnit4Provider.executeTestSet(JUnit4Provider.java:153)
	at org.apache.maven.surefire.junit4.JUnit4Provider.invoke(JUnit4Provider.java:124)
	at org.apache.maven.surefire.booter.ForkedBooter.invokeProviderInSameClassLoader(ForkedBooter.java:200)
	at org.apache.maven.surefire.booter.ForkedBooter.runSuitesInProcess(ForkedBooter.java:153)
	at org.apache.maven.surefire.booter.ForkedBooter.main(ForkedBooter.java:103)


FAILED:  org.apache.hadoop.hdfs.TestParallelUnixDomainRead.testParallelNoChecksums

Error Message:
Check log for errors

Stack Trace:
java.lang.AssertionError: Check log for errors
	at org.junit.Assert.fail(Assert.java:88)
	at org.apache.hadoop.hdfs.TestParallelReadUtil.runTestWorkload(TestParallelReadUtil.java:382)
	at org.apache.hadoop.hdfs.TestParallelReadUtil.testParallelNoChecksums(TestParallelReadUtil.java:421)
	at sun.reflect.NativeMethodAccessorImpl.invoke0(Native Method)
	at sun.reflect.NativeMethodAccessorImpl.invoke(NativeMethodAccessorImpl.java:57)
	at sun.reflect.DelegatingMethodAccessorImpl.invoke(DelegatingMethodAccessorImpl.java:43)
	at java.lang.reflect.Method.invoke(Method.java:606)
	at org.junit.runners.model.FrameworkMethod$1.runReflectiveCall(FrameworkMethod.java:47)
	at org.junit.internal.runners.model.ReflectiveCallable.run(ReflectiveCallable.java:12)
	at org.junit.runners.model.FrameworkMethod.invokeExplosively(FrameworkMethod.java:44)
	at org.junit.internal.runners.statements.InvokeMethod.evaluate(InvokeMethod.java:17)
	at org.junit.internal.runners.statements.RunBefores.evaluate(RunBefores.java:26)
	at org.junit.runners.ParentRunner.runLeaf(ParentRunner.java:271)
	at org.junit.runners.BlockJUnit4ClassRunner.runChild(BlockJUnit4ClassRunner.java:70)
	at org.junit.runners.BlockJUnit4ClassRunner.runChild(BlockJUnit4ClassRunner.java:50)
	at org.junit.runners.ParentRunner$3.run(ParentRunner.java:238)
	at org.junit.runners.ParentRunner$1.schedule(ParentRunner.java:63)
	at org.junit.runners.ParentRunner.runChildren(ParentRunner.java:236)
	at org.junit.runners.ParentRunner.access$000(ParentRunner.java:53)
	at org.junit.runners.ParentRunner$2.evaluate(ParentRunner.java:229)
	at org.junit.internal.runners.statements.RunBefores.evaluate(RunBefores.java:26)
	at org.junit.internal.runners.statements.RunAfters.evaluate(RunAfters.java:27)
	at org.junit.runners.ParentRunner.run(ParentRunner.java:309)
	at org.apache.maven.surefire.junit4.JUnit4Provider.execute(JUnit4Provider.java:264)
	at org.apache.maven.surefire.junit4.JUnit4Provider.executeTestSet(JUnit4Provider.java:153)
	at org.apache.maven.surefire.junit4.JUnit4Provider.invoke(JUnit4Provider.java:124)
	at org.apache.maven.surefire.booter.ForkedBooter.invokeProviderInSameClassLoader(ForkedBooter.java:200)
	at org.apache.maven.surefire.booter.ForkedBooter.runSuitesInProcess(ForkedBooter.java:153)
	at org.apache.maven.surefire.booter.ForkedBooter.main(ForkedBooter.java:103)


FAILED:  org.apache.hadoop.hdfs.TestParallelUnixDomainRead.testParallelReadCopying

Error Message:
Check log for errors

Stack Trace:
java.lang.AssertionError: Check log for errors
	at org.junit.Assert.fail(Assert.java:88)
	at org.apache.hadoop.hdfs.TestParallelReadUtil.runTestWorkload(TestParallelReadUtil.java:382)
	at org.apache.hadoop.hdfs.TestParallelReadUtil.testParallelReadCopying(TestParallelReadUtil.java:405)
	at sun.reflect.NativeMethodAccessorImpl.invoke0(Native Method)
	at sun.reflect.NativeMethodAccessorImpl.invoke(NativeMethodAccessorImpl.java:57)
	at sun.reflect.DelegatingMethodAccessorImpl.invoke(DelegatingMethodAccessorImpl.java:43)
	at java.lang.reflect.Method.invoke(Method.java:606)
	at org.junit.runners.model.FrameworkMethod$1.runReflectiveCall(FrameworkMethod.java:47)
	at org.junit.internal.runners.model.ReflectiveCallable.run(ReflectiveCallable.java:12)
	at org.junit.runners.model.FrameworkMethod.invokeExplosively(FrameworkMethod.java:44)
	at org.junit.internal.runners.statements.InvokeMethod.evaluate(InvokeMethod.java:17)
	at org.junit.internal.runners.statements.RunBefores.evaluate(RunBefores.java:26)
	at org.junit.runners.ParentRunner.runLeaf(ParentRunner.java:271)
	at org.junit.runners.BlockJUnit4ClassRunner.runChild(BlockJUnit4ClassRunner.java:70)
	at org.junit.runners.BlockJUnit4ClassRunner.runChild(BlockJUnit4ClassRunner.java:50)
	at org.junit.runners.ParentRunner$3.run(ParentRunner.java:238)
	at org.junit.runners.ParentRunner$1.schedule(ParentRunner.java:63)
	at org.junit.runners.ParentRunner.runChildren(ParentRunner.java:236)
	at org.junit.runners.ParentRunner.access$000(ParentRunner.java:53)
	at org.junit.runners.ParentRunner$2.evaluate(ParentRunner.java:229)
	at org.junit.internal.runners.statements.RunBefores.evaluate(RunBefores.java:26)
	at org.junit.internal.runners.statements.RunAfters.evaluate(RunAfters.java:27)
	at org.junit.runners.ParentRunner.run(ParentRunner.java:309)
	at org.apache.maven.surefire.junit4.JUnit4Provider.execute(JUnit4Provider.java:264)
	at org.apache.maven.surefire.junit4.JUnit4Provider.executeTestSet(JUnit4Provider.java:153)
	at org.apache.maven.surefire.junit4.JUnit4Provider.invoke(JUnit4Provider.java:124)
	at org.apache.maven.surefire.booter.ForkedBooter.invokeProviderInSameClassLoader(ForkedBooter.java:200)
	at org.apache.maven.surefire.booter.ForkedBooter.runSuitesInProcess(ForkedBooter.java:153)
	at org.apache.maven.surefire.booter.ForkedBooter.main(ForkedBooter.java:103)


FAILED:  org.apache.hadoop.hdfs.TestReadWhileWriting.pipeline_02_03

Error Message:
Cannot remove data directory: /home/jenkins/jenkins-slave/workspace/Hadoop-Hdfs-trunk/hadoop-hdfs-project/hadoop-hdfs/target/test/data/dfs/datapath
'/home/jenkins/jenkins-slave/workspace/Hadoop-Hdfs-trunk/hadoop-hdfs-project/hadoop-hdfs/target/test/data/dfs/data':

 absolute:/home/jenkins/jenkins-slave/workspace/Hadoop-Hdfs-trunk/hadoop-hdfs-project/hadoop-hdfs/target/test/data/dfs/data
 permissions: drwx
path '/home/jenkins/jenkins-slave/workspace/Hadoop-Hdfs-trunk/hadoop-hdfs-project/hadoop-hdfs/target/test/data/dfs':

 absolute:/home/jenkins/jenkins-slave/workspace/Hadoop-Hdfs-trunk/hadoop-hdfs-project/hadoop-hdfs/target/test/data/dfs
 permissions: drwx
path '/home/jenkins/jenkins-slave/workspace/Hadoop-Hdfs-trunk/hadoop-hdfs-project/hadoop-hdfs/target/test/data':

 absolute:/home/jenkins/jenkins-slave/workspace/Hadoop-Hdfs-trunk/hadoop-hdfs-project/hadoop-hdfs/target/test/data
 permissions: drwx
path '/home/jenkins/jenkins-slave/workspace/Hadoop-Hdfs-trunk/hadoop-hdfs-project/hadoop-hdfs/target/test':

 absolute:/home/jenkins/jenkins-slave/workspace/Hadoop-Hdfs-trunk/hadoop-hdfs-project/hadoop-hdfs/target/test
 permissions: drwx
path '/home/jenkins/jenkins-slave/workspace/Hadoop-Hdfs-trunk/hadoop-hdfs-project/hadoop-hdfs/target':

 absolute:/home/jenkins/jenkins-slave/workspace/Hadoop-Hdfs-trunk/hadoop-hdfs-project/hadoop-hdfs/target
 permissions: drwx
path '/home/jenkins/jenkins-slave/workspace/Hadoop-Hdfs-trunk/hadoop-hdfs-project/hadoop-hdfs':

 absolute:/home/jenkins/jenkins-slave/workspace/Hadoop-Hdfs-trunk/hadoop-hdfs-project/hadoop-hdfs
 permissions: drwx
path '/home/jenkins/jenkins-slave/workspace/Hadoop-Hdfs-trunk/hadoop-hdfs-project': 
 absolute:/home/jenkins/jenkins-slave/workspace/Hadoop-Hdfs-trunk/hadoop-hdfs-project
 permissions: drwx
path '/home/jenkins/jenkins-slave/workspace/Hadoop-Hdfs-trunk': 
 absolute:/home/jenkins/jenkins-slave/workspace/Hadoop-Hdfs-trunk
 permissions: drwx
path '/home/jenkins/jenkins-slave/workspace': 
 absolute:/home/jenkins/jenkins-slave/workspace
 permissions: drwx
path '/home/jenkins/jenkins-slave': 
 absolute:/home/jenkins/jenkins-slave
 permissions: drwx
path '/home/jenkins': 
 absolute:/home/jenkins
 permissions: drwx
path '/home': 
 absolute:/home
 permissions: dr-x
path '/': 
 absolute:/
 permissions: dr-x


Stack Trace:
java.io.IOException: Cannot remove data directory: /home/jenkins/jenkins-slave/workspace/Hadoop-Hdfs-trunk/hadoop-hdfs-project/hadoop-hdfs/target/test/data/dfs/datapath
'/home/jenkins/jenkins-slave/workspace/Hadoop-Hdfs-trunk/hadoop-hdfs-project/hadoop-hdfs/target/test/data/dfs/data':

	absolute:/home/jenkins/jenkins-slave/workspace/Hadoop-Hdfs-trunk/hadoop-hdfs-project/hadoop-hdfs/target/test/data/dfs/data
	permissions: drwx
path '/home/jenkins/jenkins-slave/workspace/Hadoop-Hdfs-trunk/hadoop-hdfs-project/hadoop-hdfs/target/test/data/dfs':

	absolute:/home/jenkins/jenkins-slave/workspace/Hadoop-Hdfs-trunk/hadoop-hdfs-project/hadoop-hdfs/target/test/data/dfs
	permissions: drwx
path '/home/jenkins/jenkins-slave/workspace/Hadoop-Hdfs-trunk/hadoop-hdfs-project/hadoop-hdfs/target/test/data':

	absolute:/home/jenkins/jenkins-slave/workspace/Hadoop-Hdfs-trunk/hadoop-hdfs-project/hadoop-hdfs/target/test/data
	permissions: drwx
path '/home/jenkins/jenkins-slave/workspace/Hadoop-Hdfs-trunk/hadoop-hdfs-project/hadoop-hdfs/target/test':

	absolute:/home/jenkins/jenkins-slave/workspace/Hadoop-Hdfs-trunk/hadoop-hdfs-project/hadoop-hdfs/target/test
	permissions: drwx
path '/home/jenkins/jenkins-slave/workspace/Hadoop-Hdfs-trunk/hadoop-hdfs-project/hadoop-hdfs/target':

	absolute:/home/jenkins/jenkins-slave/workspace/Hadoop-Hdfs-trunk/hadoop-hdfs-project/hadoop-hdfs/target
	permissions: drwx
path '/home/jenkins/jenkins-slave/workspace/Hadoop-Hdfs-trunk/hadoop-hdfs-project/hadoop-hdfs':

	absolute:/home/jenkins/jenkins-slave/workspace/Hadoop-Hdfs-trunk/hadoop-hdfs-project/hadoop-hdfs
	permissions: drwx
path '/home/jenkins/jenkins-slave/workspace/Hadoop-Hdfs-trunk/hadoop-hdfs-project': 
	absolute:/home/jenkins/jenkins-slave/workspace/Hadoop-Hdfs-trunk/hadoop-hdfs-project
	permissions: drwx
path '/home/jenkins/jenkins-slave/workspace/Hadoop-Hdfs-trunk': 
	absolute:/home/jenkins/jenkins-slave/workspace/Hadoop-Hdfs-trunk
	permissions: drwx
path '/home/jenkins/jenkins-slave/workspace': 
	absolute:/home/jenkins/jenkins-slave/workspace
	permissions: drwx
path '/home/jenkins/jenkins-slave': 
	absolute:/home/jenkins/jenkins-slave
	permissions: drwx
path '/home/jenkins': 
	absolute:/home/jenkins
	permissions: drwx
path '/home': 
	absolute:/home
	permissions: dr-x
path '/': 
	absolute:/
	permissions: dr-x

	at org.apache.hadoop.hdfs.MiniDFSCluster.initMiniDFSCluster(MiniDFSCluster.java:834)
	at org.apache.hadoop.hdfs.MiniDFSCluster.<init>(MiniDFSCluster.java:482)
	at org.apache.hadoop.hdfs.MiniDFSCluster$Builder.build(MiniDFSCluster.java:441)
	at org.apache.hadoop.hdfs.TestReadWhileWriting.pipeline_02_03(TestReadWhileWriting.java:61)


FAILED:  org.apache.hadoop.hdfs.tools.TestDFSAdminWithHA.testSetNegativeBalancerBandwidth

Error Message:
Cannot lock storage /home/jenkins/jenkins-slave/workspace/Hadoop-Hdfs-trunk/hadoop-hdfs-project/hadoop-hdfs/target/test/data/dfs/name-0-1.
The directory is already locked

Stack Trace:
java.io.IOException: Cannot lock storage /home/jenkins/jenkins-slave/workspace/Hadoop-Hdfs-trunk/hadoop-hdfs-project/hadoop-hdfs/target/test/data/dfs/name-0-1.
The directory is already locked
	at org.apache.hadoop.hdfs.server.common.Storage$StorageDirectory.lock(Storage.java:699)
	at org.apache.hadoop.hdfs.server.common.Storage$StorageDirectory.analyzeStorage(Storage.java:514)
	at org.apache.hadoop.hdfs.server.namenode.FSImage.recoverStorageDirs(FSImage.java:318)
	at org.apache.hadoop.hdfs.server.namenode.FSImage.recoverTransitionRead(FSImage.java:211)
	at org.apache.hadoop.hdfs.server.namenode.FSNamesystem.loadFSImage(FSNamesystem.java:958)
	at org.apache.hadoop.hdfs.server.namenode.FSNamesystem.loadFromDisk(FSNamesystem.java:658)
	at org.apache.hadoop.hdfs.server.namenode.NameNode.loadNamesystem(NameNode.java:637)
	at org.apache.hadoop.hdfs.server.namenode.NameNode.initialize(NameNode.java:699)
	at org.apache.hadoop.hdfs.server.namenode.NameNode.<init>(NameNode.java:900)
	at org.apache.hadoop.hdfs.server.namenode.NameNode.<init>(NameNode.java:879)
	at org.apache.hadoop.hdfs.server.namenode.NameNode.createNameNode(NameNode.java:1596)
	at org.apache.hadoop.hdfs.MiniDFSCluster.restartNameNode(MiniDFSCluster.java:2020)
	at org.apache.hadoop.hdfs.MiniDFSCluster.restartNameNodes(MiniDFSCluster.java:1975)
	at org.apache.hadoop.hdfs.qjournal.MiniQJMHACluster.<init>(MiniQJMHACluster.java:127)
	at org.apache.hadoop.hdfs.qjournal.MiniQJMHACluster.<init>(MiniQJMHACluster.java:37)
	at org.apache.hadoop.hdfs.qjournal.MiniQJMHACluster$Builder.build(MiniQJMHACluster.java:64)
	at org.apache.hadoop.hdfs.tools.TestDFSAdminWithHA.setUpHaCluster(TestDFSAdminWithHA.java:84)
	at org.apache.hadoop.hdfs.tools.TestDFSAdminWithHA.testSetNegativeBalancerBandwidth(TestDFSAdminWithHA.java:198)


FAILED:  org.apache.hadoop.hdfs.tools.offlineEditsViewer.TestOfflineEditsViewer.testRecoveryMode

Error Message:
File /file_concat_target could only be replicated to 0 nodes instead of minReplication (=1).
 There are 1 datanode(s) running and 1 node(s) are excluded in this operation.
 at org.apache.hadoop.hdfs.server.blockmanagement.BlockManager.chooseTarget4NewBlock(BlockManager.java:1764)
 at org.apache.hadoop.hdfs.server.namenode.FSDirWriteFileOp.chooseTargetForNewBlock(FSDirWriteFileOp.java:302)
 at org.apache.hadoop.hdfs.server.namenode.FSNamesystem.getAdditionalBlock(FSNamesystem.java:2464)
 at org.apache.hadoop.hdfs.server.namenode.NameNodeRpcServer.addBlock(NameNodeRpcServer.java:839)
 at org.apache.hadoop.hdfs.protocolPB.ClientNamenodeProtocolServerSideTranslatorPB.addBlock(ClientNamenodeProtocolServerSideTranslatorPB.java:508)
 at org.apache.hadoop.hdfs.protocol.proto.ClientNamenodeProtocolProtos$ClientNamenodeProtocol$2.callBlockingMethod(ClientNamenodeProtocolProtos.java)
 at org.apache.hadoop.ipc.ProtobufRpcEngine$Server$ProtoBufRpcInvoker.call(ProtobufRpcEngine.java:637)
 at org.apache.hadoop.ipc.RPC$Server.call(RPC.java:989)
 at org.apache.hadoop.ipc.Server$Handler$1.run(Server.java:2422)
 at org.apache.hadoop.ipc.Server$Handler$1.run(Server.java:2418)
 at java.security.AccessController.doPrivileged(Native Method)
 at javax.security.auth.Subject.doAs(Subject.java:415)
 at org.apache.hadoop.security.UserGroupInformation.doAs(UserGroupInformation.java:1742)
 at org.apache.hadoop.ipc.Server$Handler.run(Server.java:2416)


Stack Trace:
org.apache.hadoop.ipc.RemoteException: File /file_concat_target could only be replicated to
0 nodes instead of minReplication (=1).  There are 1 datanode(s) running and 1 node(s) are
excluded in this operation.
	at org.apache.hadoop.hdfs.server.blockmanagement.BlockManager.chooseTarget4NewBlock(BlockManager.java:1764)
	at org.apache.hadoop.hdfs.server.namenode.FSDirWriteFileOp.chooseTargetForNewBlock(FSDirWriteFileOp.java:302)
	at org.apache.hadoop.hdfs.server.namenode.FSNamesystem.getAdditionalBlock(FSNamesystem.java:2464)
	at org.apache.hadoop.hdfs.server.namenode.NameNodeRpcServer.addBlock(NameNodeRpcServer.java:839)
	at org.apache.hadoop.hdfs.protocolPB.ClientNamenodeProtocolServerSideTranslatorPB.addBlock(ClientNamenodeProtocolServerSideTranslatorPB.java:508)
	at org.apache.hadoop.hdfs.protocol.proto.ClientNamenodeProtocolProtos$ClientNamenodeProtocol$2.callBlockingMethod(ClientNamenodeProtocolProtos.java)
	at org.apache.hadoop.ipc.ProtobufRpcEngine$Server$ProtoBufRpcInvoker.call(ProtobufRpcEngine.java:637)
	at org.apache.hadoop.ipc.RPC$Server.call(RPC.java:989)
	at org.apache.hadoop.ipc.Server$Handler$1.run(Server.java:2422)
	at org.apache.hadoop.ipc.Server$Handler$1.run(Server.java:2418)
	at java.security.AccessController.doPrivileged(Native Method)
	at javax.security.auth.Subject.doAs(Subject.java:415)
	at org.apache.hadoop.security.UserGroupInformation.doAs(UserGroupInformation.java:1742)
	at org.apache.hadoop.ipc.Server$Handler.run(Server.java:2416)

	at org.apache.hadoop.ipc.Client.getRpcResponse(Client.java:1442)
	at org.apache.hadoop.ipc.Client.call(Client.java:1401)
	at org.apache.hadoop.ipc.Client.call(Client.java:1351)
	at org.apache.hadoop.ipc.ProtobufRpcEngine$Invoker.invoke(ProtobufRpcEngine.java:230)
	at com.sun.proxy.$Proxy24.addBlock(Unknown Source)
	at org.apache.hadoop.hdfs.protocolPB.ClientNamenodeProtocolTranslatorPB.addBlock(ClientNamenodeProtocolTranslatorPB.java:407)
	at sun.reflect.NativeMethodAccessorImpl.invoke0(Native Method)
	at sun.reflect.NativeMethodAccessorImpl.invoke(NativeMethodAccessorImpl.java:57)
	at sun.reflect.DelegatingMethodAccessorImpl.invoke(DelegatingMethodAccessorImpl.java:43)
	at java.lang.reflect.Method.invoke(Method.java:606)
	at org.apache.hadoop.io.retry.RetryInvocationHandler.invokeMethod(RetryInvocationHandler.java:257)
	at org.apache.hadoop.io.retry.RetryInvocationHandler.invoke(RetryInvocationHandler.java:103)
	at com.sun.proxy.$Proxy25.addBlock(Unknown Source)
	at org.apache.hadoop.hdfs.DFSOutputStream.addBlock(DFSOutputStream.java:926)
	at org.apache.hadoop.hdfs.DataStreamer.locateFollowingBlock(DataStreamer.java:1681)
	at org.apache.hadoop.hdfs.DataStreamer.nextBlockOutputStream(DataStreamer.java:1491)
	at org.apache.hadoop.hdfs.DataStreamer.run(DataStreamer.java:595)


FAILED:  org.apache.hadoop.hdfs.TestBlockReaderFactory.testShortCircuitCacheTemporaryFailure

Error Message:
Cannot lock storage /home/jenkins/jenkins-slave/workspace/Hadoop-Hdfs-trunk/hadoop-hdfs-project/hadoop-hdfs/target/test/data/dfs/name-0-1.
The directory is already locked

Stack Trace:
java.io.IOException: Cannot lock storage /home/jenkins/jenkins-slave/workspace/Hadoop-Hdfs-trunk/hadoop-hdfs-project/hadoop-hdfs/target/test/data/dfs/name-0-1.
The directory is already locked
	at org.apache.hadoop.hdfs.server.common.Storage$StorageDirectory.lock(Storage.java:699)
	at org.apache.hadoop.hdfs.server.common.Storage$StorageDirectory.analyzeStorage(Storage.java:514)
	at org.apache.hadoop.hdfs.server.namenode.FSImage.recoverStorageDirs(FSImage.java:318)
	at org.apache.hadoop.hdfs.server.namenode.FSImage.recoverTransitionRead(FSImage.java:211)
	at org.apache.hadoop.hdfs.server.namenode.FSNamesystem.loadFSImage(FSNamesystem.java:958)
	at org.apache.hadoop.hdfs.server.namenode.FSNamesystem.loadFromDisk(FSNamesystem.java:658)
	at org.apache.hadoop.hdfs.server.namenode.NameNode.loadNamesystem(NameNode.java:637)
	at org.apache.hadoop.hdfs.server.namenode.NameNode.initialize(NameNode.java:699)
	at org.apache.hadoop.hdfs.server.namenode.NameNode.<init>(NameNode.java:900)
	at org.apache.hadoop.hdfs.server.namenode.NameNode.<init>(NameNode.java:879)
	at org.apache.hadoop.hdfs.server.namenode.NameNode.createNameNode(NameNode.java:1596)
	at org.apache.hadoop.hdfs.MiniDFSCluster.createNameNode(MiniDFSCluster.java:1247)
	at org.apache.hadoop.hdfs.MiniDFSCluster.configureNameService(MiniDFSCluster.java:1016)
	at org.apache.hadoop.hdfs.MiniDFSCluster.createNameNodesAndSetConf(MiniDFSCluster.java:891)
	at org.apache.hadoop.hdfs.MiniDFSCluster.initMiniDFSCluster(MiniDFSCluster.java:823)
	at org.apache.hadoop.hdfs.MiniDFSCluster.<init>(MiniDFSCluster.java:482)
	at org.apache.hadoop.hdfs.MiniDFSCluster$Builder.build(MiniDFSCluster.java:441)
	at org.apache.hadoop.hdfs.TestBlockReaderFactory.testShortCircuitCacheTemporaryFailure(TestBlockReaderFactory.java:230)


FAILED:  org.apache.hadoop.hdfs.TestBlockReaderFactory.testShortCircuitReadFromServerWithoutShm

Error Message:
Timed out waiting for Mini HDFS Cluster to start

Stack Trace:
java.io.IOException: Timed out waiting for Mini HDFS Cluster to start
	at org.apache.hadoop.hdfs.MiniDFSCluster.waitClusterUp(MiniDFSCluster.java:1345)
	at org.apache.hadoop.hdfs.MiniDFSCluster.initMiniDFSCluster(MiniDFSCluster.java:848)
	at org.apache.hadoop.hdfs.MiniDFSCluster.<init>(MiniDFSCluster.java:482)
	at org.apache.hadoop.hdfs.MiniDFSCluster$Builder.build(MiniDFSCluster.java:441)
	at org.apache.hadoop.hdfs.TestBlockReaderFactory.testShortCircuitReadFromServerWithoutShm(TestBlockReaderFactory.java:313)


FAILED:  org.apache.hadoop.hdfs.TestDFSStripedOutputStreamWithFailure.testAddBlockWhenNoSufficientParityNumOfNodes

Error Message:
test timed out after 90000 milliseconds

Stack Trace:
java.lang.Exception: test timed out after 90000 milliseconds
	at java.io.DataInputStream.read(DataInputStream.java:149)
	at org.apache.hadoop.hdfs.StripedFileTestUtil.readAll(StripedFileTestUtil.java:91)
	at org.apache.hadoop.hdfs.StripedFileTestUtil.assertSeekAndRead(StripedFileTestUtil.java:218)
	at org.apache.hadoop.hdfs.StripedFileTestUtil.verifySeek(StripedFileTestUtil.java:176)
	at org.apache.hadoop.hdfs.TestDFSStripedOutputStreamWithFailure.testAddBlockWhenNoSufficientParityNumOfNodes(TestDFSStripedOutputStreamWithFailure.java:310)


FAILED:  org.apache.hadoop.hdfs.TestReadStripedFileWithMissingBlocks.testReadFileWithMissingBlocks

Error Message:
test timed out after 300000 milliseconds

Stack Trace:
java.lang.Exception: test timed out after 300000 milliseconds
	at java.io.DataInputStream.read(DataInputStream.java:149)
	at org.apache.hadoop.hdfs.StripedFileTestUtil.readAll(StripedFileTestUtil.java:91)
	at org.apache.hadoop.hdfs.StripedFileTestUtil.assertSeekAndRead(StripedFileTestUtil.java:218)
	at org.apache.hadoop.hdfs.StripedFileTestUtil.verifySeek(StripedFileTestUtil.java:176)
	at org.apache.hadoop.hdfs.TestReadStripedFileWithMissingBlocks.readFileWithMissingBlocks(TestReadStripedFileWithMissingBlocks.java:115)
	at org.apache.hadoop.hdfs.TestReadStripedFileWithMissingBlocks.testReadFileWithMissingBlocks(TestReadStripedFileWithMissingBlocks.java:78)


FAILED:  org.apache.hadoop.hdfs.shortcircuit.TestShortCircuitLocalRead.testSmallFileLocalRead

Error Message:
Requested more bytes than destination buffer size

Stack Trace:
java.lang.IndexOutOfBoundsException: Requested more bytes than destination buffer size
	at org.apache.hadoop.fs.FSInputStream.validatePositionedReadArgs(FSInputStream.java:107)
	at org.apache.hadoop.hdfs.DFSInputStream.read(DFSInputStream.java:975)
	at java.io.DataInputStream.read(DataInputStream.java:149)
	at org.apache.hadoop.hdfs.shortcircuit.TestShortCircuitLocalRead.checkFileContent(TestShortCircuitLocalRead.java:157)
	at org.apache.hadoop.hdfs.shortcircuit.TestShortCircuitLocalRead.doTestShortCircuitReadImpl(TestShortCircuitLocalRead.java:286)
	at org.apache.hadoop.hdfs.shortcircuit.TestShortCircuitLocalRead.doTestShortCircuitRead(TestShortCircuitLocalRead.java:241)
	at org.apache.hadoop.hdfs.shortcircuit.TestShortCircuitLocalRead.testSmallFileLocalRead(TestShortCircuitLocalRead.java:308)


FAILED:  org.apache.hadoop.hdfs.shortcircuit.TestShortCircuitLocalRead.testLocalReadLegacy

Error Message:
Requested more bytes than destination buffer size

Stack Trace:
java.lang.IndexOutOfBoundsException: Requested more bytes than destination buffer size
	at org.apache.hadoop.fs.FSInputStream.validatePositionedReadArgs(FSInputStream.java:107)
	at org.apache.hadoop.hdfs.DFSInputStream.read(DFSInputStream.java:975)
	at java.io.DataInputStream.read(DataInputStream.java:149)
	at org.apache.hadoop.hdfs.shortcircuit.TestShortCircuitLocalRead.checkFileContent(TestShortCircuitLocalRead.java:157)
	at org.apache.hadoop.hdfs.shortcircuit.TestShortCircuitLocalRead.doTestShortCircuitReadImpl(TestShortCircuitLocalRead.java:286)
	at org.apache.hadoop.hdfs.shortcircuit.TestShortCircuitLocalRead.doTestShortCircuitReadLegacy(TestShortCircuitLocalRead.java:235)
	at org.apache.hadoop.hdfs.shortcircuit.TestShortCircuitLocalRead.testLocalReadLegacy(TestShortCircuitLocalRead.java:316)


FAILED:  org.apache.hadoop.hdfs.shortcircuit.TestShortCircuitLocalRead.testLocalReadFallback

Error Message:
Requested more bytes than destination buffer size

Stack Trace:
java.lang.IndexOutOfBoundsException: Requested more bytes than destination buffer size
	at org.apache.hadoop.fs.FSInputStream.validatePositionedReadArgs(FSInputStream.java:107)
	at org.apache.hadoop.hdfs.DFSInputStream.read(DFSInputStream.java:975)
	at java.io.DataInputStream.read(DataInputStream.java:149)
	at org.apache.hadoop.hdfs.shortcircuit.TestShortCircuitLocalRead.checkFileContent(TestShortCircuitLocalRead.java:157)
	at org.apache.hadoop.hdfs.shortcircuit.TestShortCircuitLocalRead.doTestShortCircuitReadImpl(TestShortCircuitLocalRead.java:286)
	at org.apache.hadoop.hdfs.shortcircuit.TestShortCircuitLocalRead.doTestShortCircuitReadLegacy(TestShortCircuitLocalRead.java:235)
	at org.apache.hadoop.hdfs.shortcircuit.TestShortCircuitLocalRead.testLocalReadFallback(TestShortCircuitLocalRead.java:327)



Mime
  • Unnamed multipart/mixed (inline, None, 0 bytes)
View raw message