hadoop-hdfs-dev mailing list archives

Site index · List index
Message view « Date » · « Thread »
Top « Date » · « Thread »
From Apache Jenkins Server <jenk...@builds.apache.org>
Subject Hadoop-Hdfs-trunk - Build # 3080 - Still Failing
Date Fri, 29 Apr 2016 08:29:16 GMT
See https://builds.apache.org/job/Hadoop-Hdfs-trunk/3080/

###################################################################################
########################## LAST 60 LINES OF THE CONSOLE ###########################
[...truncated 8808 lines...]
[INFO] --- maven-clean-plugin:2.5:clean (default-clean) @ hadoop-hdfs-project ---
[INFO] Deleting /home/jenkins/jenkins-slave/workspace/Hadoop-Hdfs-trunk/hadoop-hdfs-project/target
[INFO] 
[INFO] --- maven-antrun-plugin:1.7:run (create-testdirs) @ hadoop-hdfs-project ---
[INFO] Executing tasks

main:
    [mkdir] Created dir: /home/jenkins/jenkins-slave/workspace/Hadoop-Hdfs-trunk/hadoop-hdfs-project/target/test-dir
[INFO] Executed tasks
[INFO] 
[INFO] --- maven-source-plugin:2.3:jar-no-fork (hadoop-java-sources) @ hadoop-hdfs-project
---
[INFO] 
[INFO] --- maven-source-plugin:2.3:test-jar-no-fork (hadoop-java-sources) @ hadoop-hdfs-project
---
[INFO] 
[INFO] --- maven-enforcer-plugin:1.3.1:enforce (dist-enforce) @ hadoop-hdfs-project ---
[INFO] 
[INFO] --- maven-site-plugin:3.5:attach-descriptor (attach-descriptor) @ hadoop-hdfs-project
---
[INFO] 
[INFO] --- maven-javadoc-plugin:2.8.1:jar (module-javadocs) @ hadoop-hdfs-project ---
[INFO] Skipping javadoc generation
[INFO] 
[INFO] --- maven-enforcer-plugin:1.3.1:enforce (depcheck) @ hadoop-hdfs-project ---
[INFO] 
[INFO] --- maven-checkstyle-plugin:2.15:checkstyle (default-cli) @ hadoop-hdfs-project ---
[INFO] 
[INFO] --- findbugs-maven-plugin:3.0.0:findbugs (default-cli) @ hadoop-hdfs-project ---
[INFO] ------------------------------------------------------------------------
[INFO] Reactor Summary:
[INFO] 
[INFO] Apache Hadoop HDFS Client ......................... SUCCESS [04:28 min]
[INFO] Apache Hadoop HDFS ................................ FAILURE [  01:49 h]
[INFO] Apache Hadoop HDFS Native Client .................. SKIPPED
[INFO] Apache Hadoop HttpFS .............................. SKIPPED
[INFO] Apache Hadoop HDFS BookKeeper Journal ............. SKIPPED
[INFO] Apache Hadoop HDFS-NFS ............................ SKIPPED
[INFO] Apache Hadoop HDFS Project ........................ SUCCESS [  0.129 s]
[INFO] ------------------------------------------------------------------------
[INFO] BUILD FAILURE
[INFO] ------------------------------------------------------------------------
[INFO] Total time: 01:54 h
[INFO] Finished at: 2016-04-29T08:29:01+00:00
[INFO] Final Memory: 59M/906M
[INFO] ------------------------------------------------------------------------
[ERROR] Failed to execute goal org.apache.maven.plugins:maven-surefire-plugin:2.17:test (default-test)
on project hadoop-hdfs: ExecutionException: java.lang.RuntimeException: java.lang.RuntimeException:
java.io.IOException: Stream Closed -> [Help 1]
[ERROR] 
[ERROR] To see the full stack trace of the errors, re-run Maven with the -e switch.
[ERROR] Re-run Maven using the -X switch to enable full debug logging.
[ERROR] 
[ERROR] For more information about the errors and possible solutions, please read the following
articles:
[ERROR] [Help 1] http://cwiki.apache.org/confluence/display/MAVEN/MojoFailureException
[ERROR] 
[ERROR] After correcting the problems, you can resume the build with the command
[ERROR]   mvn <goals> -rf :hadoop-hdfs
Build step 'Execute shell' marked build as failure
Archiving artifacts
Recording test results
Sending e-mails to: hdfs-dev@hadoop.apache.org
Email was triggered for: Failure - Any
Sending email for trigger: Failure - Any



###################################################################################
############################## FAILED TESTS (if any) ##############################
6 tests failed.
FAILED:  org.apache.hadoop.hdfs.TestEncryptionZones.testStartFileRetry

Error Message:
test timed out after 120000 milliseconds

Stack Trace:
java.lang.Exception: test timed out after 120000 milliseconds
	at sun.misc.Unsafe.park(Native Method)
	at java.util.concurrent.locks.LockSupport.park(LockSupport.java:186)
	at java.util.concurrent.locks.AbstractQueuedSynchronizer.parkAndCheckInterrupt(AbstractQueuedSynchronizer.java:834)
	at java.util.concurrent.locks.AbstractQueuedSynchronizer.doAcquireSharedInterruptibly(AbstractQueuedSynchronizer.java:994)
	at java.util.concurrent.locks.AbstractQueuedSynchronizer.acquireSharedInterruptibly(AbstractQueuedSynchronizer.java:1303)
	at java.util.concurrent.CountDownLatch.await(CountDownLatch.java:236)
	at org.apache.hadoop.hdfs.TestEncryptionZones.testStartFileRetry(TestEncryptionZones.java:1067)


FAILED:  org.apache.hadoop.hdfs.TestSafeModeWithStripedFile.testStripedFile0

Error Message:
null

Stack Trace:
java.lang.AssertionError: null
	at org.junit.Assert.fail(Assert.java:86)
	at org.junit.Assert.assertTrue(Assert.java:41)
	at org.junit.Assert.assertFalse(Assert.java:64)
	at org.junit.Assert.assertFalse(Assert.java:74)
	at org.apache.hadoop.hdfs.TestSafeModeWithStripedFile.doTest(TestSafeModeWithStripedFile.java:156)
	at org.apache.hadoop.hdfs.TestSafeModeWithStripedFile.testStripedFile0(TestSafeModeWithStripedFile.java:76)


FAILED:  org.apache.hadoop.hdfs.qjournal.TestSecureNNWithQJM.testSecureMode

Error Message:
test timed out after 30000 milliseconds

Stack Trace:
java.lang.Exception: test timed out after 30000 milliseconds
	at java.lang.Thread.sleep(Native Method)
	at org.mortbay.thread.QueuedThreadPool.doStop(QueuedThreadPool.java:435)
	at org.mortbay.component.AbstractLifeCycle.stop(AbstractLifeCycle.java:76)
	at org.mortbay.jetty.Server.doStop(Server.java:291)
	at org.mortbay.component.AbstractLifeCycle.stop(AbstractLifeCycle.java:76)
	at org.apache.hadoop.http.HttpServer2.stop(HttpServer2.java:962)
	at org.apache.hadoop.hdfs.server.datanode.web.DatanodeHttpServer.close(DatanodeHttpServer.java:257)
	at org.apache.hadoop.hdfs.server.datanode.DataNode.shutdown(DataNode.java:1872)
	at org.apache.hadoop.hdfs.MiniDFSCluster.shutdownDataNodes(MiniDFSCluster.java:1932)
	at org.apache.hadoop.hdfs.MiniDFSCluster.shutdown(MiniDFSCluster.java:1908)
	at org.apache.hadoop.hdfs.MiniDFSCluster.shutdown(MiniDFSCluster.java:1882)
	at org.apache.hadoop.hdfs.MiniDFSCluster.shutdown(MiniDFSCluster.java:1875)
	at org.apache.hadoop.hdfs.qjournal.TestSecureNNWithQJM.shutdown(TestSecureNNWithQJM.java:156)


FAILED:  org.apache.hadoop.hdfs.server.blockmanagement.TestReconstructStripedBlocksWithRackAwareness.testReconstructForNotEnoughRacks

Error Message:
expected:<0> but was:<1>

Stack Trace:
java.lang.AssertionError: expected:<0> but was:<1>
	at org.junit.Assert.fail(Assert.java:88)
	at org.junit.Assert.failNotEquals(Assert.java:743)
	at org.junit.Assert.assertEquals(Assert.java:118)
	at org.junit.Assert.assertEquals(Assert.java:555)
	at org.junit.Assert.assertEquals(Assert.java:542)
	at org.apache.hadoop.hdfs.server.blockmanagement.TestReconstructStripedBlocksWithRackAwareness.testReconstructForNotEnoughRacks(TestReconstructStripedBlocksWithRackAwareness.java:153)


FAILED:  org.apache.hadoop.hdfs.server.blockmanagement.TestUnderReplicatedBlocks.testSetrepIncWithUnderReplicatedBlocks

Error Message:
test timed out after 60000 milliseconds

Stack Trace:
java.lang.Exception: test timed out after 60000 milliseconds
	at java.lang.Thread.sleep(Native Method)
	at org.apache.hadoop.fs.shell.SetReplication.waitForReplication(SetReplication.java:127)
	at org.apache.hadoop.fs.shell.SetReplication.processArguments(SetReplication.java:77)
	at org.apache.hadoop.fs.shell.FsCommand.processRawArguments(FsCommand.java:119)
	at org.apache.hadoop.fs.shell.Command.run(Command.java:166)
	at org.apache.hadoop.fs.FsShell.run(FsShell.java:319)
	at org.apache.hadoop.hdfs.server.blockmanagement.TestUnderReplicatedBlocks.testSetrepIncWithUnderReplicatedBlocks(TestUnderReplicatedBlocks.java:70)


FAILED:  org.apache.hadoop.hdfs.server.namenode.TestDecommissioningStatus.testDecommissionStatus

Error Message:
Unexpected num under-replicated blocks expected:<4> but was:<3>

Stack Trace:
java.lang.AssertionError: Unexpected num under-replicated blocks expected:<4> but was:<3>
	at org.junit.Assert.fail(Assert.java:88)
	at org.junit.Assert.failNotEquals(Assert.java:743)
	at org.junit.Assert.assertEquals(Assert.java:118)
	at org.junit.Assert.assertEquals(Assert.java:555)
	at org.apache.hadoop.hdfs.server.namenode.TestDecommissioningStatus.checkDecommissionStatus(TestDecommissioningStatus.java:196)
	at org.apache.hadoop.hdfs.server.namenode.TestDecommissioningStatus.testDecommissionStatus(TestDecommissioningStatus.java:302)




Mime
View raw message