hadoop-hdfs-dev mailing list archives

Site index · List index
Message view « Date » · « Thread »
Top « Date » · « Thread »
From Apache Jenkins Server <jenk...@builds.apache.org>
Subject Hadoop-Hdfs-trunk-Java8 - Build # 1065 - Still Failing
Date Tue, 05 Apr 2016 17:50:20 GMT
See https://builds.apache.org/job/Hadoop-Hdfs-trunk-Java8/1065/

###################################################################################
########################## LAST 60 LINES OF THE CONSOLE ###########################
[...truncated 9136 lines...]
[INFO] --- maven-antrun-plugin:1.7:run (create-testdirs) @ hadoop-hdfs-project ---
[INFO] Executing tasks

main:
    [mkdir] Created dir: /home/jenkins/jenkins-slave/workspace/Hadoop-Hdfs-trunk-Java8/hadoop-hdfs-project/target/test-dir
[INFO] Executed tasks
[INFO] 
[INFO] --- maven-source-plugin:2.3:jar-no-fork (hadoop-java-sources) @ hadoop-hdfs-project
---
[INFO] 
[INFO] --- maven-source-plugin:2.3:test-jar-no-fork (hadoop-java-sources) @ hadoop-hdfs-project
---
[INFO] 
[INFO] --- maven-enforcer-plugin:1.3.1:enforce (dist-enforce) @ hadoop-hdfs-project ---
[INFO] 
[INFO] --- maven-site-plugin:3.5:attach-descriptor (attach-descriptor) @ hadoop-hdfs-project
---
[INFO] 
[INFO] --- maven-javadoc-plugin:2.8.1:jar (module-javadocs) @ hadoop-hdfs-project ---
[INFO] Not executing Javadoc as the project is not a Java classpath-capable package
[INFO] 
[INFO] --- maven-enforcer-plugin:1.3.1:enforce (depcheck) @ hadoop-hdfs-project ---
[INFO] 
[INFO] --- maven-checkstyle-plugin:2.15:checkstyle (default-cli) @ hadoop-hdfs-project ---
[INFO] 
[INFO] --- findbugs-maven-plugin:3.0.0:findbugs (default-cli) @ hadoop-hdfs-project ---
[INFO] ------------------------------------------------------------------------
[INFO] Reactor Summary:
[INFO] 
[INFO] Apache Hadoop HDFS Client ......................... SUCCESS [04:00 min]
[INFO] Apache Hadoop HDFS ................................ FAILURE [  03:41 h]
[INFO] Apache Hadoop HDFS Native Client .................. SKIPPED
[INFO] Apache Hadoop HttpFS .............................. SKIPPED
[INFO] Apache Hadoop HDFS BookKeeper Journal ............. SKIPPED
[INFO] Apache Hadoop HDFS-NFS ............................ SKIPPED
[INFO] Apache Hadoop HDFS Project ........................ SUCCESS [  0.082 s]
[INFO] ------------------------------------------------------------------------
[INFO] BUILD FAILURE
[INFO] ------------------------------------------------------------------------
[INFO] Total time: 03:45 h
[INFO] Finished at: 2016-04-05T17:50:03+00:00
[INFO] Final Memory: 56M/468M
[INFO] ------------------------------------------------------------------------
[ERROR] Failed to execute goal org.apache.maven.plugins:maven-surefire-plugin:2.17:test (default-test)
on project hadoop-hdfs: There are test failures.
[ERROR] 
[ERROR] Please refer to /home/jenkins/jenkins-slave/workspace/Hadoop-Hdfs-trunk-Java8/hadoop-hdfs-project/hadoop-hdfs/target/surefire-reports
for the individual test results.
[ERROR] -> [Help 1]
[ERROR] 
[ERROR] To see the full stack trace of the errors, re-run Maven with the -e switch.
[ERROR] Re-run Maven using the -X switch to enable full debug logging.
[ERROR] 
[ERROR] For more information about the errors and possible solutions, please read the following
articles:
[ERROR] [Help 1] http://cwiki.apache.org/confluence/display/MAVEN/MojoFailureException
[ERROR] 
[ERROR] After correcting the problems, you can resume the build with the command
[ERROR]   mvn <goals> -rf :hadoop-hdfs
Build step 'Execute shell' marked build as failure
Archiving artifacts
Recording test results
Sending e-mails to: hdfs-dev@hadoop.apache.org
Email was triggered for: Failure - Any
Sending email for trigger: Failure - Any



###################################################################################
############################## FAILED TESTS (if any) ##############################
4 tests failed.
FAILED:  org.apache.hadoop.fs.contract.hdfs.TestHDFSContractMkdir.org.apache.hadoop.fs.contract.hdfs.TestHDFSContractMkdir

Error Message:
org/apache/hadoop/security/authentication/server/AuthenticationFilter

Stack Trace:
java.lang.NoClassDefFoundError: org/apache/hadoop/security/authentication/server/AuthenticationFilter
	at java.net.URLClassLoader$1.run(URLClassLoader.java:372)
	at java.net.URLClassLoader$1.run(URLClassLoader.java:361)
	at java.security.AccessController.doPrivileged(Native Method)
	at java.net.URLClassLoader.findClass(URLClassLoader.java:360)
	at java.lang.ClassLoader.loadClass(ClassLoader.java:424)
	at sun.misc.Launcher$AppClassLoader.loadClass(Launcher.java:308)
	at java.lang.ClassLoader.loadClass(ClassLoader.java:357)
	at org.apache.hadoop.http.HttpServer2.constructSecretProvider(HttpServer2.java:460)
	at org.apache.hadoop.http.HttpServer2.<init>(HttpServer2.java:353)
	at org.apache.hadoop.http.HttpServer2.<init>(HttpServer2.java:115)
	at org.apache.hadoop.http.HttpServer2$Builder.build(HttpServer2.java:297)
	at org.apache.hadoop.hdfs.server.namenode.NameNodeHttpServer.start(NameNodeHttpServer.java:142)
	at org.apache.hadoop.hdfs.server.namenode.NameNode.startHttpServer(NameNode.java:838)
	at org.apache.hadoop.hdfs.server.namenode.NameNode.initialize(NameNode.java:696)
	at org.apache.hadoop.hdfs.server.namenode.NameNode.<init>(NameNode.java:900)
	at org.apache.hadoop.hdfs.server.namenode.NameNode.<init>(NameNode.java:879)
	at org.apache.hadoop.hdfs.server.namenode.NameNode.createNameNode(NameNode.java:1596)
	at org.apache.hadoop.hdfs.MiniDFSCluster.createNameNode(MiniDFSCluster.java:1247)
	at org.apache.hadoop.hdfs.MiniDFSCluster.configureNameService(MiniDFSCluster.java:1016)
	at org.apache.hadoop.hdfs.MiniDFSCluster.createNameNodesAndSetConf(MiniDFSCluster.java:891)
	at org.apache.hadoop.hdfs.MiniDFSCluster.initMiniDFSCluster(MiniDFSCluster.java:823)
	at org.apache.hadoop.hdfs.MiniDFSCluster.<init>(MiniDFSCluster.java:482)
	at org.apache.hadoop.hdfs.MiniDFSCluster$Builder.build(MiniDFSCluster.java:441)
	at org.apache.hadoop.fs.contract.hdfs.HDFSContract.createCluster(HDFSContract.java:58)
	at org.apache.hadoop.fs.contract.hdfs.TestHDFSContractMkdir.createCluster(TestHDFSContractMkdir.java:36)


FAILED:  org.apache.hadoop.fs.contract.hdfs.TestHDFSContractRootDirectory.org.apache.hadoop.fs.contract.hdfs.TestHDFSContractRootDirectory

Error Message:
org/apache/hadoop/security/proto/SecurityProtos$GetDelegationTokenRequestProto$1

Stack Trace:
java.lang.NoClassDefFoundError: org/apache/hadoop/security/proto/SecurityProtos$GetDelegationTokenRequestProto$1
	at java.net.URLClassLoader$1.run(URLClassLoader.java:372)
	at java.net.URLClassLoader$1.run(URLClassLoader.java:361)
	at java.security.AccessController.doPrivileged(Native Method)
	at java.net.URLClassLoader.findClass(URLClassLoader.java:360)
	at java.lang.ClassLoader.loadClass(ClassLoader.java:424)
	at sun.misc.Launcher$AppClassLoader.loadClass(Launcher.java:308)
	at java.lang.ClassLoader.loadClass(ClassLoader.java:357)
	at org.apache.hadoop.security.proto.SecurityProtos$GetDelegationTokenRequestProto.<clinit>(SecurityProtos.java:1011)
	at java.lang.Class.forName0(Native Method)
	at java.lang.Class.forName(Class.java:259)
	at com.sun.proxy.$Proxy24.<clinit>(Unknown Source)
	at sun.reflect.NativeConstructorAccessorImpl.newInstance0(Native Method)
	at sun.reflect.NativeConstructorAccessorImpl.newInstance(NativeConstructorAccessorImpl.java:62)
	at sun.reflect.DelegatingConstructorAccessorImpl.newInstance(DelegatingConstructorAccessorImpl.java:45)
	at java.lang.reflect.Constructor.newInstance(Constructor.java:408)
	at java.lang.reflect.Proxy.newProxyInstance(Proxy.java:737)
	at org.apache.hadoop.ipc.ProtobufRpcEngine.getProxy(ProtobufRpcEngine.java:104)
	at org.apache.hadoop.ipc.RPC.getProtocolProxy(RPC.java:583)
	at org.apache.hadoop.hdfs.NameNodeProxiesClient.createNonHAProxyWithClientProtocol(NameNodeProxiesClient.java:343)
	at org.apache.hadoop.hdfs.NameNodeProxiesClient.createProxyWithClientProtocol(NameNodeProxiesClient.java:131)
	at org.apache.hadoop.hdfs.DFSClient.<init>(DFSClient.java:331)
	at org.apache.hadoop.hdfs.DFSClient.<init>(DFSClient.java:275)
	at org.apache.hadoop.hdfs.DFSClient.<init>(DFSClient.java:266)
	at org.apache.hadoop.hdfs.DFSClient.<init>(DFSClient.java:258)
	at org.apache.hadoop.hdfs.MiniDFSCluster.waitActive(MiniDFSCluster.java:2466)
	at org.apache.hadoop.hdfs.MiniDFSCluster.waitActive(MiniDFSCluster.java:2512)
	at org.apache.hadoop.hdfs.MiniDFSCluster.startDataNodes(MiniDFSCluster.java:1632)
	at org.apache.hadoop.hdfs.MiniDFSCluster.initMiniDFSCluster(MiniDFSCluster.java:844)
	at org.apache.hadoop.hdfs.MiniDFSCluster.<init>(MiniDFSCluster.java:482)
	at org.apache.hadoop.hdfs.MiniDFSCluster$Builder.build(MiniDFSCluster.java:441)
	at org.apache.hadoop.fs.contract.hdfs.HDFSContract.createCluster(HDFSContract.java:58)
	at org.apache.hadoop.fs.contract.hdfs.TestHDFSContractRootDirectory.createCluster(TestHDFSContractRootDirectory.java:37)


FAILED:  org.apache.hadoop.hdfs.server.balancer.TestBalancer.testBalancerWithKeytabs

Error Message:
test timed out after 300000 milliseconds

Stack Trace:
java.lang.Exception: test timed out after 300000 milliseconds
	at java.lang.Thread.sleep(Native Method)
	at org.apache.hadoop.hdfs.server.balancer.Balancer.run(Balancer.java:690)
	at org.apache.hadoop.hdfs.server.balancer.TestBalancer.testUnknownDatanode(TestBalancer.java:1098)
	at org.apache.hadoop.hdfs.server.balancer.TestBalancer.access$000(TestBalancer.java:125)


FAILED:  org.apache.hadoop.hdfs.server.mover.TestStorageMover.testNoSpaceDisk

Error Message:
file = /cold/foo
  types = [ARCHIVE, ARCHIVE, ] expected:<[disk=0, archive=3]> but was:<[disk=0, archive=2]>

Stack Trace:
java.lang.AssertionError: file = /cold/foo
  types = [ARCHIVE, ARCHIVE, ] expected:<[disk=0, archive=3]> but was:<[disk=0, archive=2]>
	at org.junit.Assert.fail(Assert.java:88)
	at org.junit.Assert.failNotEquals(Assert.java:743)
	at org.junit.Assert.assertEquals(Assert.java:118)
	at org.apache.hadoop.hdfs.server.mover.TestStorageMover$MigrationTest.getOrVerifyReplication(TestStorageMover.java:367)
	at org.apache.hadoop.hdfs.server.mover.TestStorageMover$MigrationTest.verifyReplication(TestStorageMover.java:342)
	at org.apache.hadoop.hdfs.server.mover.TestStorageMover.testNoSpaceDisk(TestStorageMover.java:688)



Mime
  • Unnamed multipart/mixed (inline, None, 0 bytes)
View raw message