hadoop-hdfs-dev mailing list archives

Site index · List index
Message view « Date » · « Thread »
Top « Date » · « Thread »
From Apache Jenkins Server <jenk...@builds.apache.org>
Subject Hadoop-Hdfs-trunk - Build # 2982 - Still Failing
Date Fri, 01 Apr 2016 10:43:27 GMT
See https://builds.apache.org/job/Hadoop-Hdfs-trunk/2982/

###################################################################################
########################## LAST 60 LINES OF THE CONSOLE ###########################
[...truncated 8489 lines...]
[INFO] --- maven-antrun-plugin:1.7:run (create-testdirs) @ hadoop-hdfs-project ---
[INFO] Executing tasks

main:
    [mkdir] Created dir: /home/jenkins/jenkins-slave/workspace/Hadoop-Hdfs-trunk/hadoop-hdfs-project/target/test-dir
[INFO] Executed tasks
[INFO] 
[INFO] --- maven-source-plugin:2.3:jar-no-fork (hadoop-java-sources) @ hadoop-hdfs-project
---
[INFO] 
[INFO] --- maven-source-plugin:2.3:test-jar-no-fork (hadoop-java-sources) @ hadoop-hdfs-project
---
[INFO] 
[INFO] --- maven-enforcer-plugin:1.3.1:enforce (dist-enforce) @ hadoop-hdfs-project ---
[INFO] 
[INFO] --- maven-site-plugin:3.5:attach-descriptor (attach-descriptor) @ hadoop-hdfs-project
---
[INFO] 
[INFO] --- maven-javadoc-plugin:2.8.1:jar (module-javadocs) @ hadoop-hdfs-project ---
[INFO] Skipping javadoc generation
[INFO] 
[INFO] --- maven-enforcer-plugin:1.3.1:enforce (depcheck) @ hadoop-hdfs-project ---
[INFO] 
[INFO] --- maven-checkstyle-plugin:2.15:checkstyle (default-cli) @ hadoop-hdfs-project ---
[INFO] 
[INFO] --- findbugs-maven-plugin:3.0.0:findbugs (default-cli) @ hadoop-hdfs-project ---
[INFO] ------------------------------------------------------------------------
[INFO] Reactor Summary:
[INFO] 
[INFO] Apache Hadoop HDFS Client ......................... SUCCESS [04:19 min]
[INFO] Apache Hadoop HDFS ................................ FAILURE [  04:51 h]
[INFO] Apache Hadoop HDFS Native Client .................. SKIPPED
[INFO] Apache Hadoop HttpFS .............................. SKIPPED
[INFO] Apache Hadoop HDFS BookKeeper Journal ............. SKIPPED
[INFO] Apache Hadoop HDFS-NFS ............................ SKIPPED
[INFO] Apache Hadoop HDFS Project ........................ SUCCESS [  0.084 s]
[INFO] ------------------------------------------------------------------------
[INFO] BUILD FAILURE
[INFO] ------------------------------------------------------------------------
[INFO] Total time: 04:55 h
[INFO] Finished at: 2016-04-01T10:43:18+00:00
[INFO] Final Memory: 58M/558M
[INFO] ------------------------------------------------------------------------
[ERROR] Failed to execute goal org.apache.maven.plugins:maven-surefire-plugin:2.17:test (default-test)
on project hadoop-hdfs: There are test failures.
[ERROR] 
[ERROR] Please refer to /home/jenkins/jenkins-slave/workspace/Hadoop-Hdfs-trunk/hadoop-hdfs-project/hadoop-hdfs/target/surefire-reports
for the individual test results.
[ERROR] -> [Help 1]
[ERROR] 
[ERROR] To see the full stack trace of the errors, re-run Maven with the -e switch.
[ERROR] Re-run Maven using the -X switch to enable full debug logging.
[ERROR] 
[ERROR] For more information about the errors and possible solutions, please read the following
articles:
[ERROR] [Help 1] http://cwiki.apache.org/confluence/display/MAVEN/MojoFailureException
[ERROR] 
[ERROR] After correcting the problems, you can resume the build with the command
[ERROR]   mvn <goals> -rf :hadoop-hdfs
Build step 'Execute shell' marked build as failure
Archiving artifacts
Recording test results
Sending e-mails to: hdfs-dev@hadoop.apache.org
Email was triggered for: Failure - Any
Sending email for trigger: Failure - Any



###################################################################################
############################## FAILED TESTS (if any) ##############################
5 tests failed.
FAILED:  org.apache.hadoop.hdfs.server.balancer.TestBalancer.testBalancerWithKeytabs

Error Message:
test timed out after 300000 milliseconds

Stack Trace:
java.lang.Exception: test timed out after 300000 milliseconds
	at java.lang.Thread.sleep(Native Method)
	at org.apache.hadoop.hdfs.server.balancer.Balancer.run(Balancer.java:690)
	at org.apache.hadoop.hdfs.server.balancer.TestBalancer.testUnknownDatanode(TestBalancer.java:1098)
	at org.apache.hadoop.hdfs.server.balancer.TestBalancer.access$000(TestBalancer.java:125)


FAILED:  org.apache.hadoop.hdfs.server.blockmanagement.TestBlockManager.testBlockReportQueueing

Error Message:
null

Stack Trace:
java.lang.AssertionError: null
	at org.junit.Assert.fail(Assert.java:86)
	at org.junit.Assert.assertTrue(Assert.java:41)
	at org.junit.Assert.assertTrue(Assert.java:52)
	at org.apache.hadoop.hdfs.server.blockmanagement.TestBlockManager.testBlockReportQueueing(TestBlockManager.java:1051)


FAILED:  org.apache.hadoop.hdfs.server.namenode.TestEditLog.testBatchedSyncWithClosedLogs[1]

Error Message:
logging edit without syncing should do not affect txid expected:<1> but was:<2>

Stack Trace:
java.lang.AssertionError: logging edit without syncing should do not affect txid expected:<1>
but was:<2>
	at org.junit.Assert.fail(Assert.java:88)
	at org.junit.Assert.failNotEquals(Assert.java:743)
	at org.junit.Assert.assertEquals(Assert.java:118)
	at org.junit.Assert.assertEquals(Assert.java:555)
	at org.apache.hadoop.hdfs.server.namenode.TestEditLog.testBatchedSyncWithClosedLogs(TestEditLog.java:594)


FAILED:  org.apache.hadoop.hdfs.server.namenode.ha.TestFailureToReadEdits.testCheckpointStartingMidEditsFile[0]

Error Message:
Expected non-empty /home/jenkins/jenkins-slave/workspace/Hadoop-Hdfs-trunk/hadoop-hdfs-project/hadoop-hdfs/target/test/data/dfs/name-0-3/current/fsimage_0000000000000000005

Stack Trace:
java.lang.AssertionError: Expected non-empty /home/jenkins/jenkins-slave/workspace/Hadoop-Hdfs-trunk/hadoop-hdfs-project/hadoop-hdfs/target/test/data/dfs/name-0-3/current/fsimage_0000000000000000005
	at org.junit.Assert.fail(Assert.java:88)
	at org.junit.Assert.assertTrue(Assert.java:41)
	at org.apache.hadoop.hdfs.server.namenode.FSImageTestUtil.assertNNHasCheckpoints(FSImageTestUtil.java:495)
	at org.apache.hadoop.hdfs.server.namenode.ha.HATestUtil.waitForCheckpoint(HATestUtil.java:235)
	at org.apache.hadoop.hdfs.server.namenode.ha.TestFailureToReadEdits.testCheckpointStartingMidEditsFile(TestFailureToReadEdits.java:265)


FAILED:  org.apache.hadoop.TestRefreshCallQueue.testRefresh

Error Message:
org.apache.hadoop.TestRefreshCallQueue$MockCallQueue could not be constructed.

Stack Trace:
java.lang.RuntimeException: org.apache.hadoop.TestRefreshCallQueue$MockCallQueue could not
be constructed.
	at org.apache.hadoop.ipc.CallQueueManager.createCallQueueInstance(CallQueueManager.java:164)
	at org.apache.hadoop.ipc.CallQueueManager.<init>(CallQueueManager.java:70)
	at org.apache.hadoop.ipc.Server.<init>(Server.java:2577)
	at org.apache.hadoop.ipc.RPC$Server.<init>(RPC.java:958)
	at org.apache.hadoop.ipc.ProtobufRpcEngine$Server.<init>(ProtobufRpcEngine.java:535)
	at org.apache.hadoop.ipc.ProtobufRpcEngine.getServer(ProtobufRpcEngine.java:510)
	at org.apache.hadoop.ipc.RPC$Builder.build(RPC.java:800)
	at org.apache.hadoop.hdfs.server.namenode.NameNodeRpcServer.<init>(NameNodeRpcServer.java:421)
	at org.apache.hadoop.hdfs.server.namenode.NameNode.createRpcServer(NameNode.java:759)
	at org.apache.hadoop.hdfs.server.namenode.NameNode.initialize(NameNode.java:701)
	at org.apache.hadoop.hdfs.server.namenode.NameNode.<init>(NameNode.java:900)
	at org.apache.hadoop.hdfs.server.namenode.NameNode.<init>(NameNode.java:879)
	at org.apache.hadoop.hdfs.server.namenode.NameNode.createNameNode(NameNode.java:1596)
	at org.apache.hadoop.hdfs.MiniDFSCluster.createNameNode(MiniDFSCluster.java:1247)
	at org.apache.hadoop.hdfs.MiniDFSCluster.configureNameService(MiniDFSCluster.java:1016)
	at org.apache.hadoop.hdfs.MiniDFSCluster.createNameNodesAndSetConf(MiniDFSCluster.java:891)
	at org.apache.hadoop.hdfs.MiniDFSCluster.initMiniDFSCluster(MiniDFSCluster.java:823)
	at org.apache.hadoop.hdfs.MiniDFSCluster.<init>(MiniDFSCluster.java:482)
	at org.apache.hadoop.hdfs.MiniDFSCluster$Builder.build(MiniDFSCluster.java:441)
	at org.apache.hadoop.TestRefreshCallQueue.setUp(TestRefreshCallQueue.java:71)



Mime
  • Unnamed multipart/mixed (inline, None, 0 bytes)
View raw message