hadoop-hdfs-dev mailing list archives

Site index · List index
Message view « Date » · « Thread »
Top « Date » · « Thread »
From Apache Jenkins Server <jenk...@builds.apache.org>
Subject Build failed in Jenkins: Hadoop-Hdfs-trunk-Java8 #1136
Date Tue, 26 Apr 2016 00:09:21 GMT
See <https://builds.apache.org/job/Hadoop-Hdfs-trunk-Java8/1136/changes>

Changes:

[szetszwo] HDFS-8057 Move BlockReader implementation to the client implementation

------------------------------------------
[...truncated 5070 lines...]
Tests run: 7, Failures: 0, Errors: 0, Skipped: 0, Time elapsed: 21.306 sec - in org.apache.hadoop.hdfs.server.namenode.TestNameNodeMXBean
Java HotSpot(TM) 64-Bit Server VM warning: ignoring option MaxPermSize=768m; support was removed
in 8.0
Running org.apache.hadoop.hdfs.server.namenode.TestNameNodeRetryCacheMetrics
Tests run: 1, Failures: 0, Errors: 0, Skipped: 0, Time elapsed: 7.486 sec - in org.apache.hadoop.hdfs.server.namenode.TestNameNodeRetryCacheMetrics
Java HotSpot(TM) 64-Bit Server VM warning: ignoring option MaxPermSize=768m; support was removed
in 8.0
Running org.apache.hadoop.hdfs.server.namenode.TestProtectedDirectories
Tests run: 7, Failures: 0, Errors: 0, Skipped: 0, Time elapsed: 13.014 sec - in org.apache.hadoop.hdfs.server.namenode.TestProtectedDirectories
Java HotSpot(TM) 64-Bit Server VM warning: ignoring option MaxPermSize=768m; support was removed
in 8.0
Running org.apache.hadoop.hdfs.server.namenode.TestAuditLogger
Tests run: 7, Failures: 0, Errors: 0, Skipped: 0, Time elapsed: 10.702 sec - in org.apache.hadoop.hdfs.server.namenode.TestAuditLogger
Java HotSpot(TM) 64-Bit Server VM warning: ignoring option MaxPermSize=768m; support was removed
in 8.0
Running org.apache.hadoop.hdfs.server.namenode.TestGetImageServlet
Tests run: 1, Failures: 0, Errors: 0, Skipped: 0, Time elapsed: 1.078 sec - in org.apache.hadoop.hdfs.server.namenode.TestGetImageServlet
Java HotSpot(TM) 64-Bit Server VM warning: ignoring option MaxPermSize=768m; support was removed
in 8.0
Running org.apache.hadoop.hdfs.server.namenode.TestEditLogFileInputStream
Tests run: 2, Failures: 0, Errors: 0, Skipped: 0, Time elapsed: 1.11 sec - in org.apache.hadoop.hdfs.server.namenode.TestEditLogFileInputStream
Java HotSpot(TM) 64-Bit Server VM warning: ignoring option MaxPermSize=768m; support was removed
in 8.0
Running org.apache.hadoop.hdfs.server.namenode.TestMetaSave
Tests run: 3, Failures: 0, Errors: 0, Skipped: 0, Time elapsed: 16.21 sec - in org.apache.hadoop.hdfs.server.namenode.TestMetaSave
Java HotSpot(TM) 64-Bit Server VM warning: ignoring option MaxPermSize=768m; support was removed
in 8.0
Running org.apache.hadoop.hdfs.server.namenode.TestNameEditsConfigs
Tests run: 4, Failures: 0, Errors: 0, Skipped: 0, Time elapsed: 19.02 sec - in org.apache.hadoop.hdfs.server.namenode.TestNameEditsConfigs
Java HotSpot(TM) 64-Bit Server VM warning: ignoring option MaxPermSize=768m; support was removed
in 8.0
Running org.apache.hadoop.hdfs.server.namenode.TestFileTruncate
Tests run: 18, Failures: 0, Errors: 0, Skipped: 0, Time elapsed: 82.848 sec - in org.apache.hadoop.hdfs.server.namenode.TestFileTruncate
Java HotSpot(TM) 64-Bit Server VM warning: ignoring option MaxPermSize=768m; support was removed
in 8.0
Running org.apache.hadoop.hdfs.server.namenode.TestBlockPlacementPolicyRackFaultTolerant
Tests run: 1, Failures: 0, Errors: 0, Skipped: 0, Time elapsed: 9.676 sec - in org.apache.hadoop.hdfs.server.namenode.TestBlockPlacementPolicyRackFaultTolerant
Java HotSpot(TM) 64-Bit Server VM warning: ignoring option MaxPermSize=768m; support was removed
in 8.0
Running org.apache.hadoop.hdfs.server.namenode.TestSecureNameNode
Tests run: 2, Failures: 0, Errors: 0, Skipped: 0, Time elapsed: 8.213 sec - in org.apache.hadoop.hdfs.server.namenode.TestSecureNameNode
Java HotSpot(TM) 64-Bit Server VM warning: ignoring option MaxPermSize=768m; support was removed
in 8.0
Running org.apache.hadoop.hdfs.server.namenode.TestHostsFiles
Tests run: 4, Failures: 0, Errors: 0, Skipped: 0, Time elapsed: 20.449 sec - in org.apache.hadoop.hdfs.server.namenode.TestHostsFiles
Java HotSpot(TM) 64-Bit Server VM warning: ignoring option MaxPermSize=768m; support was removed
in 8.0
Running org.apache.hadoop.hdfs.server.namenode.TestCacheDirectives
Tests run: 13, Failures: 0, Errors: 0, Skipped: 0, Time elapsed: 92.413 sec - in org.apache.hadoop.hdfs.server.namenode.TestCacheDirectives
Java HotSpot(TM) 64-Bit Server VM warning: ignoring option MaxPermSize=768m; support was removed
in 8.0
Running org.apache.hadoop.hdfs.server.namenode.TestQuotaByStorageType
Tests run: 20, Failures: 0, Errors: 0, Skipped: 0, Time elapsed: 38.456 sec - in org.apache.hadoop.hdfs.server.namenode.TestQuotaByStorageType
Java HotSpot(TM) 64-Bit Server VM warning: ignoring option MaxPermSize=768m; support was removed
in 8.0
Running org.apache.hadoop.hdfs.server.namenode.TestClusterId
Tests run: 13, Failures: 0, Errors: 0, Skipped: 0, Time elapsed: 2.17 sec - in org.apache.hadoop.hdfs.server.namenode.TestClusterId
Java HotSpot(TM) 64-Bit Server VM warning: ignoring option MaxPermSize=768m; support was removed
in 8.0
Running org.apache.hadoop.hdfs.server.namenode.TestNameCache
Tests run: 1, Failures: 0, Errors: 0, Skipped: 0, Time elapsed: 0.173 sec - in org.apache.hadoop.hdfs.server.namenode.TestNameCache
Java HotSpot(TM) 64-Bit Server VM warning: ignoring option MaxPermSize=768m; support was removed
in 8.0
Running org.apache.hadoop.hdfs.server.namenode.TestAuditLoggerWithCommands
Tests run: 18, Failures: 0, Errors: 0, Skipped: 0, Time elapsed: 5.031 sec - in org.apache.hadoop.hdfs.server.namenode.TestAuditLoggerWithCommands
Java HotSpot(TM) 64-Bit Server VM warning: ignoring option MaxPermSize=768m; support was removed
in 8.0
Running org.apache.hadoop.hdfs.server.namenode.TestDeleteRace
Tests run: 5, Failures: 0, Errors: 0, Skipped: 0, Time elapsed: 59.133 sec - in org.apache.hadoop.hdfs.server.namenode.TestDeleteRace
Java HotSpot(TM) 64-Bit Server VM warning: ignoring option MaxPermSize=768m; support was removed
in 8.0
Running org.apache.hadoop.hdfs.server.namenode.TestStartupProgressServlet
Tests run: 3, Failures: 0, Errors: 0, Skipped: 0, Time elapsed: 0.58 sec - in org.apache.hadoop.hdfs.server.namenode.TestStartupProgressServlet
Java HotSpot(TM) 64-Bit Server VM warning: ignoring option MaxPermSize=768m; support was removed
in 8.0
Running org.apache.hadoop.hdfs.server.namenode.TestEditLogFileOutputStream
Tests run: 4, Failures: 0, Errors: 0, Skipped: 0, Time elapsed: 0.721 sec - in org.apache.hadoop.hdfs.server.namenode.TestEditLogFileOutputStream
Java HotSpot(TM) 64-Bit Server VM warning: ignoring option MaxPermSize=768m; support was removed
in 8.0
Running org.apache.hadoop.hdfs.server.namenode.TestFsckWithMultipleNameNodes
Tests run: 1, Failures: 0, Errors: 0, Skipped: 0, Time elapsed: 6.721 sec - in org.apache.hadoop.hdfs.server.namenode.TestFsckWithMultipleNameNodes
Java HotSpot(TM) 64-Bit Server VM warning: ignoring option MaxPermSize=768m; support was removed
in 8.0
Running org.apache.hadoop.hdfs.server.namenode.TestBackupNode
Tests run: 5, Failures: 0, Errors: 0, Skipped: 0, Time elapsed: 21.752 sec - in org.apache.hadoop.hdfs.server.namenode.TestBackupNode
Java HotSpot(TM) 64-Bit Server VM warning: ignoring option MaxPermSize=768m; support was removed
in 8.0
Running org.apache.hadoop.hdfs.server.namenode.TestFsLimits
Tests run: 9, Failures: 0, Errors: 0, Skipped: 0, Time elapsed: 2.175 sec - in org.apache.hadoop.hdfs.server.namenode.TestFsLimits
Java HotSpot(TM) 64-Bit Server VM warning: ignoring option MaxPermSize=768m; support was removed
in 8.0
Running org.apache.hadoop.hdfs.server.namenode.TestGenericJournalConf
Tests run: 4, Failures: 0, Errors: 0, Skipped: 0, Time elapsed: 3.906 sec - in org.apache.hadoop.hdfs.server.namenode.TestGenericJournalConf
Java HotSpot(TM) 64-Bit Server VM warning: ignoring option MaxPermSize=768m; support was removed
in 8.0
Running org.apache.hadoop.hdfs.server.namenode.TestProcessCorruptBlocks
Tests run: 4, Failures: 0, Errors: 0, Skipped: 0, Time elapsed: 24.094 sec - in org.apache.hadoop.hdfs.server.namenode.TestProcessCorruptBlocks
Java HotSpot(TM) 64-Bit Server VM warning: ignoring option MaxPermSize=768m; support was removed
in 8.0
Running org.apache.hadoop.hdfs.server.namenode.TestINodeAttributeProvider
Tests run: 2, Failures: 0, Errors: 0, Skipped: 0, Time elapsed: 4.701 sec - in org.apache.hadoop.hdfs.server.namenode.TestINodeAttributeProvider
Java HotSpot(TM) 64-Bit Server VM warning: ignoring option MaxPermSize=768m; support was removed
in 8.0
Running org.apache.hadoop.hdfs.server.namenode.TestValidateConfigurationSettings
Tests run: 3, Failures: 0, Errors: 0, Skipped: 0, Time elapsed: 3.386 sec - in org.apache.hadoop.hdfs.server.namenode.TestValidateConfigurationSettings
Java HotSpot(TM) 64-Bit Server VM warning: ignoring option MaxPermSize=768m; support was removed
in 8.0
Running org.apache.hadoop.hdfs.server.namenode.TestCheckPointForSecurityTokens
Tests run: 1, Failures: 0, Errors: 0, Skipped: 0, Time elapsed: 8.753 sec - in org.apache.hadoop.hdfs.server.namenode.TestCheckPointForSecurityTokens
Java HotSpot(TM) 64-Bit Server VM warning: ignoring option MaxPermSize=768m; support was removed
in 8.0
Running org.apache.hadoop.hdfs.server.namenode.TestMalformedURLs
Tests run: 1, Failures: 0, Errors: 0, Skipped: 0, Time elapsed: 4.155 sec - in org.apache.hadoop.hdfs.server.namenode.TestMalformedURLs
Java HotSpot(TM) 64-Bit Server VM warning: ignoring option MaxPermSize=768m; support was removed
in 8.0
Running org.apache.hadoop.hdfs.server.namenode.TestFSImageWithAcl
Tests run: 5, Failures: 0, Errors: 0, Skipped: 0, Time elapsed: 70.274 sec - in org.apache.hadoop.hdfs.server.namenode.TestFSImageWithAcl
Java HotSpot(TM) 64-Bit Server VM warning: ignoring option MaxPermSize=768m; support was removed
in 8.0
Running org.apache.hadoop.hdfs.server.namenode.TestEditLogRace
Tests run: 8, Failures: 0, Errors: 0, Skipped: 0, Time elapsed: 35.772 sec - in org.apache.hadoop.hdfs.server.namenode.TestEditLogRace
Java HotSpot(TM) 64-Bit Server VM warning: ignoring option MaxPermSize=768m; support was removed
in 8.0
Running org.apache.hadoop.hdfs.server.namenode.TestGetBlockLocations
Tests run: 3, Failures: 0, Errors: 0, Skipped: 0, Time elapsed: 1.8 sec - in org.apache.hadoop.hdfs.server.namenode.TestGetBlockLocations
Java HotSpot(TM) 64-Bit Server VM warning: ignoring option MaxPermSize=768m; support was removed
in 8.0
Running org.apache.hadoop.hdfs.server.namenode.TestBlockUnderConstruction
Tests run: 2, Failures: 0, Errors: 0, Skipped: 0, Time elapsed: 5.149 sec - in org.apache.hadoop.hdfs.server.namenode.TestBlockUnderConstruction
Java HotSpot(TM) 64-Bit Server VM warning: ignoring option MaxPermSize=768m; support was removed
in 8.0
Running org.apache.hadoop.hdfs.server.namenode.TestCreateEditsLog
Tests run: 1, Failures: 0, Errors: 0, Skipped: 0, Time elapsed: 4.93 sec - in org.apache.hadoop.hdfs.server.namenode.TestCreateEditsLog
Java HotSpot(TM) 64-Bit Server VM warning: ignoring option MaxPermSize=768m; support was removed
in 8.0
Running org.apache.hadoop.hdfs.server.namenode.TestFileJournalManager
Tests run: 14, Failures: 0, Errors: 0, Skipped: 0, Time elapsed: 2.277 sec - in org.apache.hadoop.hdfs.server.namenode.TestFileJournalManager
Java HotSpot(TM) 64-Bit Server VM warning: ignoring option MaxPermSize=768m; support was removed
in 8.0
Running org.apache.hadoop.hdfs.server.namenode.TestAclTransformation
Tests run: 55, Failures: 0, Errors: 0, Skipped: 0, Time elapsed: 0.337 sec - in org.apache.hadoop.hdfs.server.namenode.TestAclTransformation
Java HotSpot(TM) 64-Bit Server VM warning: ignoring option MaxPermSize=768m; support was removed
in 8.0
Running org.apache.hadoop.hdfs.server.namenode.TestXAttrFeature
Tests run: 1, Failures: 0, Errors: 0, Skipped: 0, Time elapsed: 0.225 sec - in org.apache.hadoop.hdfs.server.namenode.TestXAttrFeature
Java HotSpot(TM) 64-Bit Server VM warning: ignoring option MaxPermSize=768m; support was removed
in 8.0
Running org.apache.hadoop.hdfs.server.namenode.TestSecondaryWebUi
Tests run: 1, Failures: 0, Errors: 0, Skipped: 0, Time elapsed: 3.987 sec - in org.apache.hadoop.hdfs.server.namenode.TestSecondaryWebUi
Java HotSpot(TM) 64-Bit Server VM warning: ignoring option MaxPermSize=768m; support was removed
in 8.0
Running org.apache.hadoop.hdfs.server.namenode.TestFSImageWithXAttr
Tests run: 2, Failures: 0, Errors: 0, Skipped: 0, Time elapsed: 40.382 sec - in org.apache.hadoop.hdfs.server.namenode.TestFSImageWithXAttr
Java HotSpot(TM) 64-Bit Server VM warning: ignoring option MaxPermSize=768m; support was removed
in 8.0
Running org.apache.hadoop.hdfs.server.namenode.TestNNStorageRetentionManager
Tests run: 9, Failures: 0, Errors: 0, Skipped: 0, Time elapsed: 1.098 sec - in org.apache.hadoop.hdfs.server.namenode.TestNNStorageRetentionManager
Java HotSpot(TM) 64-Bit Server VM warning: ignoring option MaxPermSize=768m; support was removed
in 8.0
Running org.apache.hadoop.hdfs.server.namenode.TestSecondaryNameNodeUpgrade
Tests run: 3, Failures: 0, Errors: 0, Skipped: 0, Time elapsed: 6.834 sec - in org.apache.hadoop.hdfs.server.namenode.TestSecondaryNameNodeUpgrade
Java HotSpot(TM) 64-Bit Server VM warning: ignoring option MaxPermSize=768m; support was removed
in 8.0
Running org.apache.hadoop.hdfs.server.mover.TestStorageMover
Tests run: 6, Failures: 0, Errors: 0, Skipped: 0, Time elapsed: 187.616 sec - in org.apache.hadoop.hdfs.server.mover.TestStorageMover
Java HotSpot(TM) 64-Bit Server VM warning: ignoring option MaxPermSize=768m; support was removed
in 8.0
Running org.apache.hadoop.hdfs.server.mover.TestMover
Tests run: 10, Failures: 0, Errors: 0, Skipped: 0, Time elapsed: 93.282 sec - in org.apache.hadoop.hdfs.server.mover.TestMover
Java HotSpot(TM) 64-Bit Server VM warning: ignoring option MaxPermSize=768m; support was removed
in 8.0
Running org.apache.hadoop.hdfs.server.blockmanagement.TestOverReplicatedBlocks
Tests run: 3, Failures: 0, Errors: 0, Skipped: 0, Time elapsed: 27.892 sec - in org.apache.hadoop.hdfs.server.blockmanagement.TestOverReplicatedBlocks
Java HotSpot(TM) 64-Bit Server VM warning: ignoring option MaxPermSize=768m; support was removed
in 8.0
Running org.apache.hadoop.hdfs.server.blockmanagement.TestHost2NodesMap
Tests run: 3, Failures: 0, Errors: 0, Skipped: 0, Time elapsed: 0.297 sec - in org.apache.hadoop.hdfs.server.blockmanagement.TestHost2NodesMap
Java HotSpot(TM) 64-Bit Server VM warning: ignoring option MaxPermSize=768m; support was removed
in 8.0
Running org.apache.hadoop.hdfs.server.blockmanagement.TestHeartbeatHandling
Tests run: 3, Failures: 0, Errors: 0, Skipped: 0, Time elapsed: 7.607 sec - in org.apache.hadoop.hdfs.server.blockmanagement.TestHeartbeatHandling
Java HotSpot(TM) 64-Bit Server VM warning: ignoring option MaxPermSize=768m; support was removed
in 8.0
Running org.apache.hadoop.hdfs.server.blockmanagement.TestBlockUnderConstructionFeature
Tests run: 1, Failures: 0, Errors: 0, Skipped: 0, Time elapsed: 0.353 sec - in org.apache.hadoop.hdfs.server.blockmanagement.TestBlockUnderConstructionFeature
Java HotSpot(TM) 64-Bit Server VM warning: ignoring option MaxPermSize=768m; support was removed
in 8.0
Running org.apache.hadoop.hdfs.server.blockmanagement.TestSequentialBlockGroupId
Tests run: 3, Failures: 0, Errors: 0, Skipped: 0, Time elapsed: 15.526 sec - in org.apache.hadoop.hdfs.server.blockmanagement.TestSequentialBlockGroupId
Java HotSpot(TM) 64-Bit Server VM warning: ignoring option MaxPermSize=768m; support was removed
in 8.0
Running org.apache.hadoop.hdfs.server.blockmanagement.TestDatanodeDescriptor
Tests run: 2, Failures: 0, Errors: 0, Skipped: 0, Time elapsed: 0.286 sec - in org.apache.hadoop.hdfs.server.blockmanagement.TestDatanodeDescriptor
Java HotSpot(TM) 64-Bit Server VM warning: ignoring option MaxPermSize=768m; support was removed
in 8.0
Running org.apache.hadoop.hdfs.server.blockmanagement.TestBlockReportRateLimiting
Tests run: 2, Failures: 0, Errors: 0, Skipped: 0, Time elapsed: 9.101 sec - in org.apache.hadoop.hdfs.server.blockmanagement.TestBlockReportRateLimiting
Java HotSpot(TM) 64-Bit Server VM warning: ignoring option MaxPermSize=768m; support was removed
in 8.0
Running org.apache.hadoop.hdfs.server.blockmanagement.TestBlocksWithNotEnoughRacks
Tests run: 9, Failures: 0, Errors: 0, Skipped: 0, Time elapsed: 50.854 sec - in org.apache.hadoop.hdfs.server.blockmanagement.TestBlocksWithNotEnoughRacks
Java HotSpot(TM) 64-Bit Server VM warning: ignoring option MaxPermSize=768m; support was removed
in 8.0
Running org.apache.hadoop.hdfs.server.blockmanagement.TestBlockManager
Tests run: 17, Failures: 0, Errors: 0, Skipped: 0, Time elapsed: 12.615 sec - in org.apache.hadoop.hdfs.server.blockmanagement.TestBlockManager
Java HotSpot(TM) 64-Bit Server VM warning: ignoring option MaxPermSize=768m; support was removed
in 8.0
Running org.apache.hadoop.hdfs.server.blockmanagement.TestDatanodeManager

Results :

Failed tests: 
  TestLazyPersistReplicaRecovery.testDnRestartWithSavedReplicas:53->LazyPersistTestCase.ensureFileReplicasOnStorageType:141

Expected: is <DISK>
     but: was <RAM_DISK>

Tests run: 2589, Failures: 1, Errors: 0, Skipped: 11

[INFO]                                                                         
[INFO] ------------------------------------------------------------------------
[INFO] Skipping Apache Hadoop HDFS Native Client
[INFO] This project has been banned from the build due to previous failures.
[INFO] ------------------------------------------------------------------------
[INFO]                                                                         
[INFO] ------------------------------------------------------------------------
[INFO] Skipping Apache Hadoop HttpFS
[INFO] This project has been banned from the build due to previous failures.
[INFO] ------------------------------------------------------------------------
[INFO]                                                                         
[INFO] ------------------------------------------------------------------------
[INFO] Skipping Apache Hadoop HDFS BookKeeper Journal
[INFO] This project has been banned from the build due to previous failures.
[INFO] ------------------------------------------------------------------------
[INFO]                                                                         
[INFO] ------------------------------------------------------------------------
[INFO] Skipping Apache Hadoop HDFS-NFS
[INFO] This project has been banned from the build due to previous failures.
[INFO] ------------------------------------------------------------------------
[INFO]                                                                         
[INFO] ------------------------------------------------------------------------
[INFO] Building Apache Hadoop HDFS Project 3.0.0-SNAPSHOT
[INFO] ------------------------------------------------------------------------
[INFO] 
[INFO] --- maven-clean-plugin:2.5:clean (default-clean) @ hadoop-hdfs-project ---
[INFO] Deleting <https://builds.apache.org/job/Hadoop-Hdfs-trunk-Java8/ws/hadoop-hdfs-project/target>
[INFO] 
[INFO] --- maven-antrun-plugin:1.7:run (create-testdirs) @ hadoop-hdfs-project ---
[INFO] Executing tasks

main:
    [mkdir] Created dir: <https://builds.apache.org/job/Hadoop-Hdfs-trunk-Java8/ws/hadoop-hdfs-project/target/test-dir>
[INFO] Executed tasks
[INFO] 
[INFO] --- maven-source-plugin:2.3:jar-no-fork (hadoop-java-sources) @ hadoop-hdfs-project
---
[INFO] 
[INFO] --- maven-source-plugin:2.3:test-jar-no-fork (hadoop-java-sources) @ hadoop-hdfs-project
---
[INFO] 
[INFO] --- maven-enforcer-plugin:1.3.1:enforce (dist-enforce) @ hadoop-hdfs-project ---
[INFO] 
[INFO] --- maven-site-plugin:3.5:attach-descriptor (attach-descriptor) @ hadoop-hdfs-project
---
[INFO] 
[INFO] --- maven-javadoc-plugin:2.8.1:jar (module-javadocs) @ hadoop-hdfs-project ---
[INFO] Not executing Javadoc as the project is not a Java classpath-capable package
[INFO] 
[INFO] --- maven-enforcer-plugin:1.3.1:enforce (depcheck) @ hadoop-hdfs-project ---
[INFO] 
[INFO] --- maven-checkstyle-plugin:2.15:checkstyle (default-cli) @ hadoop-hdfs-project ---
[INFO] 
[INFO] --- findbugs-maven-plugin:3.0.0:findbugs (default-cli) @ hadoop-hdfs-project ---
[INFO] ------------------------------------------------------------------------
[INFO] Reactor Summary:
[INFO] 
[INFO] Apache Hadoop HDFS Client ......................... SUCCESS [04:07 min]
[INFO] Apache Hadoop HDFS ................................ FAILURE [  02:00 h]
[INFO] Apache Hadoop HDFS Native Client .................. SKIPPED
[INFO] Apache Hadoop HttpFS .............................. SKIPPED
[INFO] Apache Hadoop HDFS BookKeeper Journal ............. SKIPPED
[INFO] Apache Hadoop HDFS-NFS ............................ SKIPPED
[INFO] Apache Hadoop HDFS Project ........................ SUCCESS [  0.128 s]
[INFO] ------------------------------------------------------------------------
[INFO] BUILD FAILURE
[INFO] ------------------------------------------------------------------------
[INFO] Total time: 02:04 h
[INFO] Finished at: 2016-04-26T00:09:13+00:00
[INFO] Final Memory: 74M/794M
[INFO] ------------------------------------------------------------------------
[ERROR] Failed to execute goal org.apache.maven.plugins:maven-surefire-plugin:2.17:test (default-test)
on project hadoop-hdfs: ExecutionException: java.lang.RuntimeException: The forked VM terminated
without properly saying goodbye. VM crash or System.exit called?
[ERROR] Command was /bin/sh -c cd <https://builds.apache.org/job/Hadoop-Hdfs-trunk-Java8/ws/hadoop-hdfs-project/hadoop-hdfs>
&& /home/jenkins/tools/java/jdk1.8.0/jre/bin/java -Xmx2048m -XX:MaxPermSize=768m -XX:+HeapDumpOnOutOfMemoryError
-jar <https://builds.apache.org/job/Hadoop-Hdfs-trunk-Java8/ws/hadoop-hdfs-project/hadoop-hdfs/target/surefire/surefirebooter8475256474634901942.jar>
<https://builds.apache.org/job/Hadoop-Hdfs-trunk-Java8/ws/hadoop-hdfs-project/hadoop-hdfs/target/surefire/surefire8709293754348533449tmp>
<https://builds.apache.org/job/Hadoop-Hdfs-trunk-Java8/ws/hadoop-hdfs-project/hadoop-hdfs/target/surefire/surefire_203141511097645394145tmp>
[ERROR] -> [Help 1]
[ERROR] 
[ERROR] To see the full stack trace of the errors, re-run Maven with the -e switch.
[ERROR] Re-run Maven using the -X switch to enable full debug logging.
[ERROR] 
[ERROR] For more information about the errors and possible solutions, please read the following
articles:
[ERROR] [Help 1] http://cwiki.apache.org/confluence/display/MAVEN/MojoFailureException
[ERROR] 
[ERROR] After correcting the problems, you can resume the build with the command
[ERROR]   mvn <goals> -rf :hadoop-hdfs
Build step 'Execute shell' marked build as failure
Archiving artifacts
Recording test results

Mime
View raw message