hadoop-hdfs-dev mailing list archives

Site index · List index
Message view « Date » · « Thread »
Top « Date » · « Thread »
From Apache Jenkins Server <jenk...@builds.apache.org>
Subject Build failed in Jenkins: Hadoop-Hdfs-trunk #3023
Date Wed, 13 Apr 2016 10:08:08 GMT
See <https://builds.apache.org/job/Hadoop-Hdfs-trunk/3023/changes>

Changes:

[cmccabe] HADOOP-12973. Make DU pluggable. (Elliott Clark via cmccabe)

------------------------------------------
[...truncated 32123 lines...]
Tests run: 60, Failures: 0, Errors: 0, Skipped: 0, Time elapsed: 14.478 sec - in org.apache.hadoop.fs.viewfs.TestViewFileSystemAtHdfsRoot
Running org.apache.hadoop.fs.viewfs.TestViewFsAtHdfsRoot
Tests run: 58, Failures: 0, Errors: 0, Skipped: 0, Time elapsed: 9.82 sec - in org.apache.hadoop.fs.viewfs.TestViewFsAtHdfsRoot
Running org.apache.hadoop.fs.viewfs.TestViewFsHdfs
Tests run: 58, Failures: 0, Errors: 0, Skipped: 0, Time elapsed: 9.961 sec - in org.apache.hadoop.fs.viewfs.TestViewFsHdfs
Running org.apache.hadoop.fs.viewfs.TestViewFsWithAcls
Tests run: 1, Failures: 0, Errors: 0, Skipped: 0, Time elapsed: 5.206 sec - in org.apache.hadoop.fs.viewfs.TestViewFsWithAcls
Running org.apache.hadoop.fs.viewfs.TestViewFsDefaultValue
Tests run: 7, Failures: 0, Errors: 0, Skipped: 0, Time elapsed: 4.601 sec - in org.apache.hadoop.fs.viewfs.TestViewFsDefaultValue
Running org.apache.hadoop.fs.viewfs.TestViewFileSystemWithXAttrs
Tests run: 1, Failures: 0, Errors: 0, Skipped: 0, Time elapsed: 5.42 sec - in org.apache.hadoop.fs.viewfs.TestViewFileSystemWithXAttrs
Running org.apache.hadoop.fs.viewfs.TestViewFsFileStatusHdfs
Tests run: 2, Failures: 0, Errors: 0, Skipped: 0, Time elapsed: 4.445 sec - in org.apache.hadoop.fs.viewfs.TestViewFsFileStatusHdfs
Running org.apache.hadoop.fs.viewfs.TestViewFileSystemHdfs
Tests run: 60, Failures: 0, Errors: 0, Skipped: 0, Time elapsed: 14.293 sec - in org.apache.hadoop.fs.viewfs.TestViewFileSystemHdfs
Running org.apache.hadoop.fs.viewfs.TestViewFileSystemWithAcls
Tests run: 1, Failures: 0, Errors: 0, Skipped: 0, Time elapsed: 5.357 sec - in org.apache.hadoop.fs.viewfs.TestViewFileSystemWithAcls
Running org.apache.hadoop.fs.TestFcHdfsSetUMask
Tests run: 12, Failures: 0, Errors: 0, Skipped: 0, Time elapsed: 5.315 sec - in org.apache.hadoop.fs.TestFcHdfsSetUMask
Running org.apache.hadoop.fs.TestSymlinkHdfsFileSystem
Tests run: 74, Failures: 0, Errors: 0, Skipped: 2, Time elapsed: 11.184 sec - in org.apache.hadoop.fs.TestSymlinkHdfsFileSystem
Running org.apache.hadoop.fs.TestEnhancedByteBufferAccess
Tests run: 10, Failures: 0, Errors: 0, Skipped: 1, Time elapsed: 16.224 sec - in org.apache.hadoop.fs.TestEnhancedByteBufferAccess
Running org.apache.hadoop.fs.TestWebHdfsFileContextMainOperations
Tests run: 61, Failures: 0, Errors: 0, Skipped: 0, Time elapsed: 11.764 sec - in org.apache.hadoop.fs.TestWebHdfsFileContextMainOperations
Running org.apache.hadoop.fs.TestFcHdfsPermission
Tests run: 4, Failures: 0, Errors: 0, Skipped: 0, Time elapsed: 5.658 sec - in org.apache.hadoop.fs.TestFcHdfsPermission
Running org.apache.hadoop.fs.TestHDFSFileContextMainOperations
Tests run: 69, Failures: 0, Errors: 0, Skipped: 0, Time elapsed: 10.237 sec - in org.apache.hadoop.fs.TestHDFSFileContextMainOperations
Running org.apache.hadoop.fs.TestHdfsNativeCodeLoader
Tests run: 1, Failures: 0, Errors: 0, Skipped: 0, Time elapsed: 0.208 sec - in org.apache.hadoop.fs.TestHdfsNativeCodeLoader
Running org.apache.hadoop.fs.TestSWebHdfsFileContextMainOperations
Tests run: 61, Failures: 0, Errors: 0, Skipped: 0, Time elapsed: 93.262 sec - in org.apache.hadoop.fs.TestSWebHdfsFileContextMainOperations
Running org.apache.hadoop.fs.TestUrlStreamHandler
Tests run: 2, Failures: 0, Errors: 0, Skipped: 0, Time elapsed: 4.906 sec - in org.apache.hadoop.fs.TestUrlStreamHandler
Running org.apache.hadoop.fs.TestResolveHdfsSymlink
Tests run: 4, Failures: 0, Errors: 0, Skipped: 0, Time elapsed: 4.134 sec - in org.apache.hadoop.fs.TestResolveHdfsSymlink
Running org.apache.hadoop.fs.permission.TestStickyBit
Tests run: 6, Failures: 0, Errors: 0, Skipped: 0, Time elapsed: 8.746 sec - in org.apache.hadoop.fs.permission.TestStickyBit
Running org.apache.hadoop.fs.shell.TestHdfsTextCommand
Tests run: 1, Failures: 0, Errors: 0, Skipped: 0, Time elapsed: 4.644 sec - in org.apache.hadoop.fs.shell.TestHdfsTextCommand
Running org.apache.hadoop.fs.contract.hdfs.TestHDFSContractDelete
Tests run: 8, Failures: 0, Errors: 0, Skipped: 0, Time elapsed: 5.043 sec - in org.apache.hadoop.fs.contract.hdfs.TestHDFSContractDelete
Running org.apache.hadoop.fs.contract.hdfs.TestHDFSContractSetTimes
Tests run: 1, Failures: 0, Errors: 0, Skipped: 0, Time elapsed: 4.22 sec - in org.apache.hadoop.fs.contract.hdfs.TestHDFSContractSetTimes
Running org.apache.hadoop.fs.contract.hdfs.TestHDFSContractRename
Tests run: 6, Failures: 0, Errors: 0, Skipped: 0, Time elapsed: 5.148 sec - in org.apache.hadoop.fs.contract.hdfs.TestHDFSContractRename
Running org.apache.hadoop.fs.contract.hdfs.TestHDFSContractOpen
Tests run: 6, Failures: 0, Errors: 0, Skipped: 0, Time elapsed: 5.079 sec - in org.apache.hadoop.fs.contract.hdfs.TestHDFSContractOpen
Running org.apache.hadoop.fs.contract.hdfs.TestHDFSContractGetFileStatus
Tests run: 2, Failures: 0, Errors: 0, Skipped: 0, Time elapsed: 4.295 sec - in org.apache.hadoop.fs.contract.hdfs.TestHDFSContractGetFileStatus
Running org.apache.hadoop.fs.contract.hdfs.TestHDFSContractMkdir
Tests run: 5, Failures: 0, Errors: 0, Skipped: 0, Time elapsed: 5.097 sec - in org.apache.hadoop.fs.contract.hdfs.TestHDFSContractMkdir
Running org.apache.hadoop.fs.contract.hdfs.TestHDFSContractSeek
Tests run: 18, Failures: 0, Errors: 0, Skipped: 0, Time elapsed: 8.313 sec - in org.apache.hadoop.fs.contract.hdfs.TestHDFSContractSeek
Running org.apache.hadoop.fs.contract.hdfs.TestHDFSContractCreate
Tests run: 6, Failures: 0, Errors: 0, Skipped: 0, Time elapsed: 5.481 sec - in org.apache.hadoop.fs.contract.hdfs.TestHDFSContractCreate
Running org.apache.hadoop.fs.contract.hdfs.TestHDFSContractRootDirectory
Tests run: 6, Failures: 0, Errors: 0, Skipped: 0, Time elapsed: 4.702 sec - in org.apache.hadoop.fs.contract.hdfs.TestHDFSContractRootDirectory
Running org.apache.hadoop.fs.contract.hdfs.TestHDFSContractConcat
Tests run: 4, Failures: 0, Errors: 0, Skipped: 0, Time elapsed: 5.27 sec - in org.apache.hadoop.fs.contract.hdfs.TestHDFSContractConcat
Running org.apache.hadoop.fs.contract.hdfs.TestHDFSContractAppend
Tests run: 5, Failures: 0, Errors: 0, Skipped: 0, Time elapsed: 5.599 sec - in org.apache.hadoop.fs.contract.hdfs.TestHDFSContractAppend
Running org.apache.hadoop.fs.loadGenerator.TestLoadGenerator
Tests run: 2, Failures: 0, Errors: 0, Skipped: 0, Time elapsed: 15.174 sec - in org.apache.hadoop.fs.loadGenerator.TestLoadGenerator
Running org.apache.hadoop.fs.TestGlobPaths
Tests run: 36, Failures: 0, Errors: 0, Skipped: 6, Time elapsed: 5.899 sec - in org.apache.hadoop.fs.TestGlobPaths
Running org.apache.hadoop.fs.TestSymlinkHdfsDisable
Tests run: 1, Failures: 0, Errors: 0, Skipped: 0, Time elapsed: 4.303 sec - in org.apache.hadoop.fs.TestSymlinkHdfsDisable
Running org.apache.hadoop.fs.TestSymlinkHdfsFileContext
Tests run: 71, Failures: 0, Errors: 0, Skipped: 0, Time elapsed: 10.639 sec - in org.apache.hadoop.fs.TestSymlinkHdfsFileContext
Running org.apache.hadoop.fs.TestUnbuffer
Tests run: 2, Failures: 0, Errors: 0, Skipped: 0, Time elapsed: 7.754 sec - in org.apache.hadoop.fs.TestUnbuffer
Running org.apache.hadoop.metrics2.sink.TestRollingFileSystemSinkWithHdfs
Tests run: 11, Failures: 0, Errors: 0, Skipped: 0, Time elapsed: 39.336 sec - in org.apache.hadoop.metrics2.sink.TestRollingFileSystemSinkWithHdfs
Running org.apache.hadoop.metrics2.sink.TestRollingFileSystemSinkWithSecureHdfs
Tests run: 2, Failures: 0, Errors: 0, Skipped: 0, Time elapsed: 14.722 sec - in org.apache.hadoop.metrics2.sink.TestRollingFileSystemSinkWithSecureHdfs
Running org.apache.hadoop.TestGenericRefresh
Tests run: 9, Failures: 0, Errors: 0, Skipped: 0, Time elapsed: 4.469 sec - in org.apache.hadoop.TestGenericRefresh

Results :

Failed tests: 
  TestBlockReaderFactory.testMultipleWaitersOnShortCircuitCache:196 null
  TestDFSStripedOutputStreamWithFailure180>TestDFSStripedOutputStreamWithFailure$TestBase.test3:533->TestDFSStripedOutputStreamWithFailure$TestBase.run:527
failed, dn=6, length=3932161java.util.concurrent.TimeoutException: Timed out waiting for /TestDFSStripedOutputStreamWithFailure/dn[6]len3932161kill[1966080]
to have all the internalBlocks
	at org.apache.hadoop.hdfs.StripedFileTestUtil.waitBlockGroupsReported(StripedFileTestUtil.java:303)
	at org.apache.hadoop.hdfs.TestDFSStripedOutputStreamWithFailure.runTest(TestDFSStripedOutputStreamWithFailure.java:433)
	at org.apache.hadoop.hdfs.TestDFSStripedOutputStreamWithFailure.runTest(TestDFSStripedOutputStreamWithFailure.java:322)
	at org.apache.hadoop.hdfs.TestDFSStripedOutputStreamWithFailure$TestBase.run(TestDFSStripedOutputStreamWithFailure.java:527)
	at org.apache.hadoop.hdfs.TestDFSStripedOutputStreamWithFailure$TestBase.test3(TestDFSStripedOutputStreamWithFailure.java:533)
	at sun.reflect.NativeMethodAccessorImpl.invoke0(Native Method)
	at sun.reflect.NativeMethodAccessorImpl.invoke(NativeMethodAccessorImpl.java:57)
	at sun.reflect.DelegatingMethodAccessorImpl.invoke(DelegatingMethodAccessorImpl.java:43)
	at java.lang.reflect.Method.invoke(Method.java:606)
	at org.junit.runners.model.FrameworkMethod$1.runReflectiveCall(FrameworkMethod.java:47)
	at org.junit.internal.runners.model.ReflectiveCallable.run(ReflectiveCallable.java:12)
	at org.junit.runners.model.FrameworkMethod.invokeExplosively(FrameworkMethod.java:44)
	at org.junit.internal.runners.statements.InvokeMethod.evaluate(InvokeMethod.java:17)
	at org.junit.internal.runners.statements.FailOnTimeout$StatementThread.run(FailOnTimeout.java:74)


Tests in error: 
  TestShortCircuitLocalRead.testSmallFileLocalRead:308->doTestShortCircuitRead:241->doTestShortCircuitReadImpl:286->checkFileContent:157
» IndexOutOfBounds
  TestShortCircuitLocalRead.testLocalReadLegacy:316->doTestShortCircuitReadLegacy:235->doTestShortCircuitReadImpl:286->checkFileContent:157
» IndexOutOfBounds
  TestShortCircuitLocalRead.testLocalReadFallback:327->doTestShortCircuitReadLegacy:235->doTestShortCircuitReadImpl:286->checkFileContent:157
» IndexOutOfBounds
  TestDFSStripedOutputStreamWithFailure.testAddBlockWhenNoSufficientParityNumOfNodes:310 »

  TestReadStripedFileWithMissingBlocks.testReadFileWithMissingBlocks:78->readFileWithMissingBlocks:115
» 
  TestHFlush.testHFlushInterrupted » ClosedByInterrupt
  TestReadStripedFileWithDecoding>Object.wait:-2 »  test timed out after 300000 ...
  TestReadStripedFileWithDecoding>Object.wait:-2 »  test timed out after 300000 ...
  TestWriteReadStripedFile.testFileSmallerThanOneCell1:96->testOneFileUsingDFSStripedInputStream:200->testOneFileUsingDFSStripedInputStream:224
» 
  TestWriteReadStripedFile.testFileSmallerThanOneCell2:102->testOneFileUsingDFSStripedInputStream:200->testOneFileUsingDFSStripedInputStream:224
» 
  TestBlockReaderFactory.testShortCircuitCacheTemporaryFailure » Remote File /te...
  TestBlockReaderFactory.testShortCircuitCacheShutdown:395 » IO Cannot remove da...
  TestBlockReaderFactory.testShortCircuitReadFromServerWithoutShm:313 » IO Canno...
  TestDFSClientRetries.testNamenodeRestart:947->namenodeRestartTest:1081 »  test...
  TestDFSClientRetries.testFailuresArePerOperation:327 » BlockMissing Could not ...
  TestWebHDFS.testNamenodeRestart:264 »  test timed out after 300000 millisecond...
  TestWebHdfsFileSystemContract.testResponseCode:459 » SafeMode Cannot append to...
  TestWebHdfsFileSystemContract.testSeek:194 » SafeMode Cannot create directory ...
  TestWebHdfsFileSystemContract.testMkdirsFailsForSubdirectoryOfExistingFile:97 » SafeMode
  TestWebHdfsFileSystemContract.testOffsetPlusLengthParamsLongerThanFile:344 » SafeMode
  TestWebHdfsFileSystemContract.testCaseInsensitive:171 » IO Server returned HTT...
  TestWebHdfsFileSystemContract.testGetFileBlockLocations:133->FileSystemContractBaseTest.createFile:489
» SafeMode
  TestWebHdfsFileSystemContract.testRootDir:267 » SafeMode Cannot delete /. Name...
  TestWebHdfsFileSystemContract.testAccess:561 » SafeMode Cannot delete /pathX. ...
  TestWebHdfsFileSystemContract>FileSystemContractBaseTest.testMultiByteFilesAreFiles:580
» SafeMode
  TestWebHdfsFileSystemContract>FileSystemContractBaseTest.testDeleteEmptyDirectory:343
» SafeMode
  TestWebHdfsFileSystemContract>FileSystemContractBaseTest.testInputStreamClosedTwice:466->FileSystemContractBaseTest.createFile:489
» SafeMode
  TestWebHdfsFileSystemContract>FileSystemContractBaseTest.testMkdirsWithUmask:184 » SafeMode
  TestWebHdfsFileSystemContract>FileSystemContractBaseTest.testRenameFileMoveToNonExistentDirectory:361->FileSystemContractBaseTest.createFile:489
» SafeMode
  TestWebHdfsFileSystemContract>FileSystemContractBaseTest.testWriteReadAndDeleteOneBlock:249->FileSystemContractBaseTest.writeReadAndDelete:268->FileSystemContractBaseTest.writeAndRead:795
» SafeMode
  TestWebHdfsFileSystemContract>FileSystemContractBaseTest.testOverWriteAndRead:514->FileSystemContractBaseTest.writeAndRead:795
» SafeMode
  TestWebHdfsFileSystemContract>FileSystemContractBaseTest.testRenameRootDirForbidden:603->FileSystemContractBaseTest.rename:494
» SafeMode
  TestWebHdfsFileSystemContract>FileSystemContractBaseTest.testListStatusRootDir:715->FileSystemContractBaseTest.createFile:489
» SafeMode
  TestWebHdfsFileSystemContract>FileSystemContractBaseTest.testRenameDirectoryAsExistingFile:433
» SafeMode
  TestWebHdfsFileSystemContract>FileSystemContractBaseTest.testMoveFileUnderParent:698->FileSystemContractBaseTest.createFile:489
» SafeMode
  TestWebHdfsFileSystemContract>FileSystemContractBaseTest.testWriteReadAndDeleteEmptyFile:241->FileSystemContractBaseTest.writeReadAndDelete:268->FileSystemContractBaseTest.writeAndRead:795
» SafeMode
  TestWebHdfsFileSystemContract>FileSystemContractBaseTest.testRenameDirectoryMoveToExistingDirectory:411
» SafeMode
  TestWebHdfsFileSystemContract>FileSystemContractBaseTest.testListStatus:219 » SafeMode
  TestWebHdfsFileSystemContract>FileSystemContractBaseTest.testRenameFileAsExistingFile:380->FileSystemContractBaseTest.createFile:489
» SafeMode
  TestWebHdfsFileSystemContract>FileSystemContractBaseTest.testFilesystemIsCaseSensitive:540
» SafeMode
  TestWebHdfsFileSystemContract>FileSystemContractBaseTest.testRenameDirectoryMoveToNonExistentDirectory:402
» SafeMode
  TestWebHdfsFileSystemContract>FileSystemContractBaseTest.testWriteReadAndDeleteHalfABlock:245->FileSystemContractBaseTest.writeReadAndDelete:268->FileSystemContractBaseTest.writeAndRead:795
» SafeMode
  TestWebHdfsFileSystemContract>FileSystemContractBaseTest.testRenameDirectoryAsExistingDirectory:443
» SafeMode
  TestWebHdfsFileSystemContract>FileSystemContractBaseTest.testRenameToDirWithSamePrefixAllowed:636
» SafeMode
  TestWebHdfsFileSystemContract>FileSystemContractBaseTest.testRenameFileAsExistingDirectory:390->FileSystemContractBaseTest.createFile:489
» SafeMode
  TestWebHdfsFileSystemContract>FileSystemContractBaseTest.testWriteReadAndDeleteOneAndAHalfBlocks:253->FileSystemContractBaseTest.writeReadAndDelete:268->FileSystemContractBaseTest.writeAndRead:795
» SafeMode
  TestWebHdfsFileSystemContract>FileSystemContractBaseTest.testOverwrite:274 » SafeMode
  TestWebHdfsFileSystemContract>FileSystemContractBaseTest.testRenameFileToSelf:684->FileSystemContractBaseTest.createFile:489
» SafeMode
  TestWebHdfsFileSystemContract>FileSystemContractBaseTest.testWriteReadAndDeleteTwoBlocks:257->FileSystemContractBaseTest.writeReadAndDelete:268->FileSystemContractBaseTest.writeAndRead:795
» SafeMode
  TestWebHdfsFileSystemContract>FileSystemContractBaseTest.testLSRootDir:708->FileSystemContractBaseTest.createFile:489
» SafeMode
  TestWebHdfsFileSystemContract>FileSystemContractBaseTest.testRenameChildDirForbidden:617
» SafeMode
  TestWebHdfsFileSystemContract>FileSystemContractBaseTest.testWriteInNonExistentDirectory:300->FileSystemContractBaseTest.createFile:489
» SafeMode
  TestWebHdfsFileSystemContract>FileSystemContractBaseTest.testRenameFileMoveToExistingDirectory:370->FileSystemContractBaseTest.createFile:489
» SafeMode
  TestWebHdfsFileSystemContract>FileSystemContractBaseTest.testZeroByteFilesAreFiles:567
» SafeMode
  TestWebHdfsFileSystemContract>FileSystemContractBaseTest.testDeleteRecursively:318->FileSystemContractBaseTest.createFile:489
» SafeMode
  TestWebHdfsFileSystemContract>FileSystemContractBaseTest.testMkdirs:125 » SafeMode
  TestWebHdfsFileSystemContract>FileSystemContractBaseTest.testMoveDirUnderParent:669 »
SafeMode
  TestWebHdfsFileSystemContract>FileSystemContractBaseTest.testDeleteNonExistentFile:310
» SafeMode
  TestWebHdfsFileSystemContract>FileSystemContractBaseTest.testRenameNonExistentPath:354->FileSystemContractBaseTest.rename:494
» SafeMode
  TestWebHdfsFileSystemContract>FileSystemContractBaseTest.testRenameDirToSelf:650 » SafeMode
  TestWebHdfsFileSystemContract>FileSystemContractBaseTest.testOutputStreamClosedTwice:478
» SafeMode
  TestWebHDFSAcl.init:34->FSAclBaseTest.startCluster:87 » IO Missing directory /...
  TestWebHdfsWithRestCsrfPreventionFilter.before:96 » InconsistentFSState Direct...

Tests run: 4295, Failures: 2, Errors: 59, Skipped: 16

[INFO]                                                                         
[INFO] ------------------------------------------------------------------------
[INFO] Skipping Apache Hadoop HDFS Native Client
[INFO] This project has been banned from the build due to previous failures.
[INFO] ------------------------------------------------------------------------
[INFO]                                                                         
[INFO] ------------------------------------------------------------------------
[INFO] Skipping Apache Hadoop HttpFS
[INFO] This project has been banned from the build due to previous failures.
[INFO] ------------------------------------------------------------------------
[INFO]                                                                         
[INFO] ------------------------------------------------------------------------
[INFO] Skipping Apache Hadoop HDFS BookKeeper Journal
[INFO] This project has been banned from the build due to previous failures.
[INFO] ------------------------------------------------------------------------
[INFO]                                                                         
[INFO] ------------------------------------------------------------------------
[INFO] Skipping Apache Hadoop HDFS-NFS
[INFO] This project has been banned from the build due to previous failures.
[INFO] ------------------------------------------------------------------------
[INFO]                                                                         
[INFO] ------------------------------------------------------------------------
[INFO] Building Apache Hadoop HDFS Project 3.0.0-SNAPSHOT
[INFO] ------------------------------------------------------------------------
[INFO] 
[INFO] --- maven-clean-plugin:2.5:clean (default-clean) @ hadoop-hdfs-project ---
[INFO] Deleting <https://builds.apache.org/job/Hadoop-Hdfs-trunk/ws/hadoop-hdfs-project/target>
[INFO] 
[INFO] --- maven-antrun-plugin:1.7:run (create-testdirs) @ hadoop-hdfs-project ---
[INFO] Executing tasks

main:
    [mkdir] Created dir: <https://builds.apache.org/job/Hadoop-Hdfs-trunk/ws/hadoop-hdfs-project/target/test-dir>
[INFO] Executed tasks
[INFO] 
[INFO] --- maven-source-plugin:2.3:jar-no-fork (hadoop-java-sources) @ hadoop-hdfs-project
---
[INFO] 
[INFO] --- maven-source-plugin:2.3:test-jar-no-fork (hadoop-java-sources) @ hadoop-hdfs-project
---
[INFO] 
[INFO] --- maven-enforcer-plugin:1.3.1:enforce (dist-enforce) @ hadoop-hdfs-project ---
[INFO] 
[INFO] --- maven-site-plugin:3.5:attach-descriptor (attach-descriptor) @ hadoop-hdfs-project
---
[INFO] 
[INFO] --- maven-javadoc-plugin:2.8.1:jar (module-javadocs) @ hadoop-hdfs-project ---
[INFO] Skipping javadoc generation
[INFO] 
[INFO] --- maven-enforcer-plugin:1.3.1:enforce (depcheck) @ hadoop-hdfs-project ---
[INFO] 
[INFO] --- maven-checkstyle-plugin:2.15:checkstyle (default-cli) @ hadoop-hdfs-project ---
[INFO] 
[INFO] --- findbugs-maven-plugin:3.0.0:findbugs (default-cli) @ hadoop-hdfs-project ---
[INFO] ------------------------------------------------------------------------
[INFO] Reactor Summary:
[INFO] 
[INFO] Apache Hadoop HDFS Client ......................... SUCCESS [03:56 min]
[INFO] Apache Hadoop HDFS ................................ FAILURE [  04:10 h]
[INFO] Apache Hadoop HDFS Native Client .................. SKIPPED
[INFO] Apache Hadoop HttpFS .............................. SKIPPED
[INFO] Apache Hadoop HDFS BookKeeper Journal ............. SKIPPED
[INFO] Apache Hadoop HDFS-NFS ............................ SKIPPED
[INFO] Apache Hadoop HDFS Project ........................ SUCCESS [  0.076 s]
[INFO] ------------------------------------------------------------------------
[INFO] BUILD FAILURE
[INFO] ------------------------------------------------------------------------
[INFO] Total time: 04:14 h
[INFO] Finished at: 2016-04-13T10:07:56+00:00
[INFO] Final Memory: 56M/528M
[INFO] ------------------------------------------------------------------------
[ERROR] Failed to execute goal org.apache.maven.plugins:maven-surefire-plugin:2.17:test (default-test)
on project hadoop-hdfs: There was a timeout or other error in the fork -> [Help 1]
[ERROR] 
[ERROR] To see the full stack trace of the errors, re-run Maven with the -e switch.
[ERROR] Re-run Maven using the -X switch to enable full debug logging.
[ERROR] 
[ERROR] For more information about the errors and possible solutions, please read the following
articles:
[ERROR] [Help 1] http://cwiki.apache.org/confluence/display/MAVEN/MojoFailureException
[ERROR] 
[ERROR] After correcting the problems, you can resume the build with the command
[ERROR]   mvn <goals> -rf :hadoop-hdfs
Build step 'Execute shell' marked build as failure
Archiving artifacts
Recording test results

Mime
View raw message