hadoop-hdfs-dev mailing list archives

Site index · List index
Message view « Date » · « Thread »
Top « Date » · « Thread »
From Apache Jenkins Server <jenk...@builds.apache.org>
Subject Hadoop-Hdfs-trunk-Java8 - Build # 1149 - Still Failing
Date Thu, 28 Apr 2016 07:11:40 GMT
See https://builds.apache.org/job/Hadoop-Hdfs-trunk-Java8/1149/

###################################################################################
########################## LAST 60 LINES OF THE CONSOLE ###########################
[...truncated 6019 lines...]
[INFO] --- maven-antrun-plugin:1.7:run (create-testdirs) @ hadoop-hdfs-project ---
[INFO] Executing tasks

main:
    [mkdir] Created dir: /home/jenkins/jenkins-slave/workspace/Hadoop-Hdfs-trunk-Java8/hadoop-hdfs-project/target/test-dir
[INFO] Executed tasks
[INFO] 
[INFO] --- maven-source-plugin:2.3:jar-no-fork (hadoop-java-sources) @ hadoop-hdfs-project
---
[INFO] 
[INFO] --- maven-source-plugin:2.3:test-jar-no-fork (hadoop-java-sources) @ hadoop-hdfs-project
---
[INFO] 
[INFO] --- maven-enforcer-plugin:1.3.1:enforce (dist-enforce) @ hadoop-hdfs-project ---
[INFO] 
[INFO] --- maven-site-plugin:3.5:attach-descriptor (attach-descriptor) @ hadoop-hdfs-project
---
[INFO] 
[INFO] --- maven-javadoc-plugin:2.8.1:jar (module-javadocs) @ hadoop-hdfs-project ---
[INFO] Not executing Javadoc as the project is not a Java classpath-capable package
[INFO] 
[INFO] --- maven-enforcer-plugin:1.3.1:enforce (depcheck) @ hadoop-hdfs-project ---
[INFO] 
[INFO] --- maven-checkstyle-plugin:2.15:checkstyle (default-cli) @ hadoop-hdfs-project ---
[INFO] 
[INFO] --- findbugs-maven-plugin:3.0.0:findbugs (default-cli) @ hadoop-hdfs-project ---
[INFO] ------------------------------------------------------------------------
[INFO] Reactor Summary:
[INFO] 
[INFO] Apache Hadoop HDFS Client ......................... SUCCESS [04:33 min]
[INFO] Apache Hadoop HDFS ................................ FAILURE [  04:24 h]
[INFO] Apache Hadoop HDFS Native Client .................. SKIPPED
[INFO] Apache Hadoop HttpFS .............................. SKIPPED
[INFO] Apache Hadoop HDFS BookKeeper Journal ............. SKIPPED
[INFO] Apache Hadoop HDFS-NFS ............................ SKIPPED
[INFO] Apache Hadoop HDFS Project ........................ SUCCESS [  0.075 s]
[INFO] ------------------------------------------------------------------------
[INFO] BUILD FAILURE
[INFO] ------------------------------------------------------------------------
[INFO] Total time: 04:29 h
[INFO] Finished at: 2016-04-28T07:11:29+00:00
[INFO] Final Memory: 57M/503M
[INFO] ------------------------------------------------------------------------
[ERROR] Failed to execute goal org.apache.maven.plugins:maven-surefire-plugin:2.17:test (default-test)
on project hadoop-hdfs: There are test failures.
[ERROR] 
[ERROR] Please refer to /home/jenkins/jenkins-slave/workspace/Hadoop-Hdfs-trunk-Java8/hadoop-hdfs-project/hadoop-hdfs/target/surefire-reports
for the individual test results.
[ERROR] -> [Help 1]
[ERROR] 
[ERROR] To see the full stack trace of the errors, re-run Maven with the -e switch.
[ERROR] Re-run Maven using the -X switch to enable full debug logging.
[ERROR] 
[ERROR] For more information about the errors and possible solutions, please read the following
articles:
[ERROR] [Help 1] http://cwiki.apache.org/confluence/display/MAVEN/MojoFailureException
[ERROR] 
[ERROR] After correcting the problems, you can resume the build with the command
[ERROR]   mvn <goals> -rf :hadoop-hdfs
Build step 'Execute shell' marked build as failure
Archiving artifacts
Recording test results
Sending e-mails to: hdfs-dev@hadoop.apache.org
Email was triggered for: Failure - Any
Sending email for trigger: Failure - Any



###################################################################################
############################## FAILED TESTS (if any) ##############################
5 tests failed.
FAILED:  org.apache.hadoop.hdfs.TestDFSUpgradeFromImage.testUpgradeFromRel1BBWImage

Error Message:
Cannot obtain block length for LocatedBlock{BP-44065648-67.195.81.149-1461825913734:blk_7162739548153522810_1020;
getBlockSize()=1024; corrupt=false; offset=0; locs=[DatanodeInfoWithStorage[127.0.0.1:56338,DS-df78f2f3-4539-44c6-a64f-31edde26192a,DISK]]}

Stack Trace:
java.io.IOException: Cannot obtain block length for LocatedBlock{BP-44065648-67.195.81.149-1461825913734:blk_7162739548153522810_1020;
getBlockSize()=1024; corrupt=false; offset=0; locs=[DatanodeInfoWithStorage[127.0.0.1:56338,DS-df78f2f3-4539-44c6-a64f-31edde26192a,DISK]]}
	at org.apache.hadoop.hdfs.DFSInputStream.readBlockLength(DFSInputStream.java:435)
	at org.apache.hadoop.hdfs.DFSInputStream.fetchLocatedBlocksAndGetLastBlockLength(DFSInputStream.java:345)
	at org.apache.hadoop.hdfs.DFSInputStream.openInfo(DFSInputStream.java:278)
	at org.apache.hadoop.hdfs.DFSInputStream.<init>(DFSInputStream.java:267)
	at org.apache.hadoop.hdfs.DFSClient.open(DFSClient.java:1038)
	at org.apache.hadoop.hdfs.DFSClient.open(DFSClient.java:1003)
	at org.apache.hadoop.hdfs.TestDFSUpgradeFromImage.dfsOpenFileWithRetries(TestDFSUpgradeFromImage.java:178)
	at org.apache.hadoop.hdfs.TestDFSUpgradeFromImage.verifyDir(TestDFSUpgradeFromImage.java:214)
	at org.apache.hadoop.hdfs.TestDFSUpgradeFromImage.verifyFileSystem(TestDFSUpgradeFromImage.java:229)
	at org.apache.hadoop.hdfs.TestDFSUpgradeFromImage.upgradeAndVerify(TestDFSUpgradeFromImage.java:606)
	at org.apache.hadoop.hdfs.TestDFSUpgradeFromImage.testUpgradeFromRel1BBWImage(TestDFSUpgradeFromImage.java:628)


FAILED:  org.apache.hadoop.hdfs.server.blockmanagement.TestComputeInvalidateWork.testDatanodeReRegistration

Error Message:
Expected invalidate blocks to be the number of DNs expected:<3> but was:<2>

Stack Trace:
java.lang.AssertionError: Expected invalidate blocks to be the number of DNs expected:<3>
but was:<2>
	at org.junit.Assert.fail(Assert.java:88)
	at org.junit.Assert.failNotEquals(Assert.java:743)
	at org.junit.Assert.assertEquals(Assert.java:118)
	at org.junit.Assert.assertEquals(Assert.java:555)
	at org.apache.hadoop.hdfs.server.blockmanagement.TestComputeInvalidateWork.testDatanodeReRegistration(TestComputeInvalidateWork.java:161)


FAILED:  org.apache.hadoop.hdfs.server.datanode.fsdataset.impl.TestFsDatasetImpl.testCleanShutdownOfVolume

Error Message:
null

Stack Trace:
java.lang.AssertionError: null
	at org.junit.Assert.fail(Assert.java:86)
	at org.junit.Assert.assertTrue(Assert.java:41)
	at org.junit.Assert.assertTrue(Assert.java:52)
	at org.apache.hadoop.hdfs.server.datanode.fsdataset.impl.TestFsDatasetImpl.testCleanShutdownOfVolume(TestFsDatasetImpl.java:683)


FAILED:  org.apache.hadoop.hdfs.server.namenode.snapshot.TestOpenFilesWithSnapshot.testWithCheckpoint

Error Message:
Timed out waiting for Mini HDFS Cluster to start

Stack Trace:
java.io.IOException: Timed out waiting for Mini HDFS Cluster to start
	at org.apache.hadoop.hdfs.MiniDFSCluster.waitClusterUp(MiniDFSCluster.java:1345)
	at org.apache.hadoop.hdfs.MiniDFSCluster.restartNameNode(MiniDFSCluster.java:2024)
	at org.apache.hadoop.hdfs.MiniDFSCluster.restartNameNode(MiniDFSCluster.java:1994)
	at org.apache.hadoop.hdfs.server.namenode.snapshot.TestOpenFilesWithSnapshot.testWithCheckpoint(TestOpenFilesWithSnapshot.java:94)


FAILED:  org.apache.hadoop.hdfs.TestHFlush.testHFlushInterrupted

Error Message:
The stream is closed

Stack Trace:
java.io.IOException: The stream is closed
	at org.apache.hadoop.net.SocketOutputStream.write(SocketOutputStream.java:118)
	at java.io.BufferedOutputStream.flushBuffer(BufferedOutputStream.java:82)
	at java.io.BufferedOutputStream.flush(BufferedOutputStream.java:140)
	at java.io.DataOutputStream.flush(DataOutputStream.java:123)
	at java.io.FilterOutputStream.close(FilterOutputStream.java:158)
	at org.apache.hadoop.hdfs.DataStreamer.closeStream(DataStreamer.java:881)
	at org.apache.hadoop.hdfs.DataStreamer.closeInternal(DataStreamer.java:730)
	at org.apache.hadoop.hdfs.DataStreamer.run(DataStreamer.java:725)



Mime
  • Unnamed multipart/mixed (inline, None, 0 bytes)
View raw message