hadoop-hdfs-dev mailing list archives

Site index · List index
Message view « Date » · « Thread »
Top « Date » · « Thread »
From Apache Jenkins Server <jenk...@builds.apache.org>
Subject Hadoop-Hdfs-trunk - Build # 3020 - Still Failing
Date Tue, 12 Apr 2016 14:49:36 GMT
See https://builds.apache.org/job/Hadoop-Hdfs-trunk/3020/

###################################################################################
########################## LAST 60 LINES OF THE CONSOLE ###########################
[...truncated 9201 lines...]
[INFO] 
[INFO] --- maven-antrun-plugin:1.7:run (create-testdirs) @ hadoop-hdfs-project ---
[INFO] Executing tasks

main:
    [mkdir] Created dir: /home/jenkins/jenkins-slave/workspace/Hadoop-Hdfs-trunk/hadoop-hdfs-project/target/test-dir
[INFO] Executed tasks
[INFO] 
[INFO] --- maven-source-plugin:2.3:jar-no-fork (hadoop-java-sources) @ hadoop-hdfs-project
---
[INFO] 
[INFO] --- maven-source-plugin:2.3:test-jar-no-fork (hadoop-java-sources) @ hadoop-hdfs-project
---
[INFO] 
[INFO] --- maven-enforcer-plugin:1.3.1:enforce (dist-enforce) @ hadoop-hdfs-project ---
[INFO] 
[INFO] --- maven-site-plugin:3.5:attach-descriptor (attach-descriptor) @ hadoop-hdfs-project
---
[INFO] 
[INFO] --- maven-javadoc-plugin:2.8.1:jar (module-javadocs) @ hadoop-hdfs-project ---
[INFO] Skipping javadoc generation
[INFO] 
[INFO] --- maven-enforcer-plugin:1.3.1:enforce (depcheck) @ hadoop-hdfs-project ---
[INFO] 
[INFO] --- maven-checkstyle-plugin:2.15:checkstyle (default-cli) @ hadoop-hdfs-project ---
[INFO] 
[INFO] --- findbugs-maven-plugin:3.0.0:findbugs (default-cli) @ hadoop-hdfs-project ---
[INFO] ------------------------------------------------------------------------
[INFO] Reactor Summary:
[INFO] 
[INFO] Apache Hadoop HDFS Client ......................... SUCCESS [04:20 min]
[INFO] Apache Hadoop HDFS ................................ FAILURE [  01:57 h]
[INFO] Apache Hadoop HDFS Native Client .................. SKIPPED
[INFO] Apache Hadoop HttpFS .............................. SKIPPED
[INFO] Apache Hadoop HDFS BookKeeper Journal ............. SKIPPED
[INFO] Apache Hadoop HDFS-NFS ............................ SKIPPED
[INFO] Apache Hadoop HDFS Project ........................ SUCCESS [  0.097 s]
[INFO] ------------------------------------------------------------------------
[INFO] BUILD FAILURE
[INFO] ------------------------------------------------------------------------
[INFO] Total time: 02:01 h
[INFO] Finished at: 2016-04-12T14:49:18+00:00
[INFO] Final Memory: 69M/996M
[INFO] ------------------------------------------------------------------------
[ERROR] Failed to execute goal org.apache.maven.plugins:maven-surefire-plugin:2.17:test (default-test)
on project hadoop-hdfs: ExecutionException: java.lang.RuntimeException: The forked VM terminated
without properly saying goodbye. VM crash or System.exit called?
[ERROR] Command was /bin/sh -c cd /home/jenkins/jenkins-slave/workspace/Hadoop-Hdfs-trunk/hadoop-hdfs-project/hadoop-hdfs
&& /home/jenkins/tools/java/jdk1.7.0_55/jre/bin/java -Xmx2048m -XX:MaxPermSize=768m
-XX:+HeapDumpOnOutOfMemoryError -jar /home/jenkins/jenkins-slave/workspace/Hadoop-Hdfs-trunk/hadoop-hdfs-project/hadoop-hdfs/target/surefire/surefirebooter373336565875394344.jar
/home/jenkins/jenkins-slave/workspace/Hadoop-Hdfs-trunk/hadoop-hdfs-project/hadoop-hdfs/target/surefire/surefire6869342553129766408tmp
/home/jenkins/jenkins-slave/workspace/Hadoop-Hdfs-trunk/hadoop-hdfs-project/hadoop-hdfs/target/surefire/surefire_1364455785643085575386tmp
[ERROR] -> [Help 1]
[ERROR] 
[ERROR] To see the full stack trace of the errors, re-run Maven with the -e switch.
[ERROR] Re-run Maven using the -X switch to enable full debug logging.
[ERROR] 
[ERROR] For more information about the errors and possible solutions, please read the following
articles:
[ERROR] [Help 1] http://cwiki.apache.org/confluence/display/MAVEN/MojoFailureException
[ERROR] 
[ERROR] After correcting the problems, you can resume the build with the command
[ERROR]   mvn <goals> -rf :hadoop-hdfs
Build step 'Execute shell' marked build as failure
Archiving artifacts
Recording test results
Sending e-mails to: hdfs-dev@hadoop.apache.org
Email was triggered for: Failure - Any
Sending email for trigger: Failure - Any



###################################################################################
############################## FAILED TESTS (if any) ##############################
8 tests failed.
FAILED:  org.apache.hadoop.hdfs.TestDFSRename.testRename

Error Message:
org/apache/hadoop/util/PlatformName

Stack Trace:
java.lang.NoClassDefFoundError: org/apache/hadoop/util/PlatformName
	at java.net.URLClassLoader$1.run(URLClassLoader.java:366)
	at java.net.URLClassLoader$1.run(URLClassLoader.java:355)
	at java.security.AccessController.doPrivileged(Native Method)
	at java.net.URLClassLoader.findClass(URLClassLoader.java:354)
	at java.lang.ClassLoader.loadClass(ClassLoader.java:425)
	at sun.misc.Launcher$AppClassLoader.loadClass(Launcher.java:308)
	at java.lang.ClassLoader.loadClass(ClassLoader.java:358)
	at org.apache.hadoop.security.UserGroupInformation.getOSLoginModuleName(UserGroupInformation.java:382)
	at org.apache.hadoop.security.UserGroupInformation.<clinit>(UserGroupInformation.java:427)
	at org.apache.hadoop.hdfs.server.namenode.NameNode.format(NameNode.java:1073)
	at org.apache.hadoop.hdfs.server.namenode.NameNode.format(NameNode.java:386)
	at org.apache.hadoop.hdfs.DFSTestUtil.formatNameNode(DFSTestUtil.java:228)
	at org.apache.hadoop.hdfs.MiniDFSCluster.configureNameService(MiniDFSCluster.java:1005)
	at org.apache.hadoop.hdfs.MiniDFSCluster.createNameNodesAndSetConf(MiniDFSCluster.java:891)
	at org.apache.hadoop.hdfs.MiniDFSCluster.initMiniDFSCluster(MiniDFSCluster.java:823)
	at org.apache.hadoop.hdfs.MiniDFSCluster.<init>(MiniDFSCluster.java:482)
	at org.apache.hadoop.hdfs.MiniDFSCluster$Builder.build(MiniDFSCluster.java:441)
	at org.apache.hadoop.hdfs.TestDFSRename.testRename(TestDFSRename.java:59)


FAILED:  org.apache.hadoop.hdfs.TestDFSRename.testRenameWithOverwrite

Error Message:
Could not initialize class org.apache.hadoop.security.UserGroupInformation

Stack Trace:
java.lang.NoClassDefFoundError: Could not initialize class org.apache.hadoop.security.UserGroupInformation
	at org.apache.hadoop.hdfs.server.namenode.NameNode.format(NameNode.java:1073)
	at org.apache.hadoop.hdfs.server.namenode.NameNode.format(NameNode.java:386)
	at org.apache.hadoop.hdfs.DFSTestUtil.formatNameNode(DFSTestUtil.java:228)
	at org.apache.hadoop.hdfs.MiniDFSCluster.configureNameService(MiniDFSCluster.java:1005)
	at org.apache.hadoop.hdfs.MiniDFSCluster.createNameNodesAndSetConf(MiniDFSCluster.java:891)
	at org.apache.hadoop.hdfs.MiniDFSCluster.initMiniDFSCluster(MiniDFSCluster.java:823)
	at org.apache.hadoop.hdfs.MiniDFSCluster.<init>(MiniDFSCluster.java:482)
	at org.apache.hadoop.hdfs.MiniDFSCluster$Builder.build(MiniDFSCluster.java:441)
	at org.apache.hadoop.hdfs.TestDFSRename.testRenameWithOverwrite(TestDFSRename.java:141)


FAILED:  org.apache.hadoop.hdfs.server.datanode.TestDirectoryScanner.testThrottling

Error Message:
Throttle is too permissive

Stack Trace:
java.lang.AssertionError: Throttle is too permissive
	at org.junit.Assert.fail(Assert.java:88)
	at org.junit.Assert.assertTrue(Assert.java:41)
	at org.apache.hadoop.hdfs.server.datanode.TestDirectoryScanner.testThrottling(TestDirectoryScanner.java:617)


FAILED:  org.apache.hadoop.hdfs.TestDFSStripedOutputStreamWithFailure.testAddBlockWhenNoSufficientParityNumOfNodes

Error Message:
test timed out after 90000 milliseconds

Stack Trace:
java.lang.Exception: test timed out after 90000 milliseconds
	at java.io.DataInputStream.read(DataInputStream.java:149)
	at org.apache.hadoop.hdfs.StripedFileTestUtil.readAll(StripedFileTestUtil.java:91)
	at org.apache.hadoop.hdfs.StripedFileTestUtil.assertSeekAndRead(StripedFileTestUtil.java:218)
	at org.apache.hadoop.hdfs.StripedFileTestUtil.verifySeek(StripedFileTestUtil.java:176)
	at org.apache.hadoop.hdfs.TestDFSStripedOutputStreamWithFailure.testAddBlockWhenNoSufficientParityNumOfNodes(TestDFSStripedOutputStreamWithFailure.java:310)


FAILED:  org.apache.hadoop.hdfs.TestReadStripedFileWithMissingBlocks.testReadFileWithMissingBlocks

Error Message:
test timed out after 300000 milliseconds

Stack Trace:
java.lang.Exception: test timed out after 300000 milliseconds
	at java.io.DataInputStream.read(DataInputStream.java:149)
	at org.apache.hadoop.hdfs.StripedFileTestUtil.readAll(StripedFileTestUtil.java:91)
	at org.apache.hadoop.hdfs.StripedFileTestUtil.assertSeekAndRead(StripedFileTestUtil.java:218)
	at org.apache.hadoop.hdfs.StripedFileTestUtil.verifySeek(StripedFileTestUtil.java:176)
	at org.apache.hadoop.hdfs.TestReadStripedFileWithMissingBlocks.readFileWithMissingBlocks(TestReadStripedFileWithMissingBlocks.java:115)
	at org.apache.hadoop.hdfs.TestReadStripedFileWithMissingBlocks.testReadFileWithMissingBlocks(TestReadStripedFileWithMissingBlocks.java:78)


FAILED:  org.apache.hadoop.hdfs.shortcircuit.TestShortCircuitLocalRead.testSmallFileLocalRead

Error Message:
Requested more bytes than destination buffer size

Stack Trace:
java.lang.IndexOutOfBoundsException: Requested more bytes than destination buffer size
	at org.apache.hadoop.fs.FSInputStream.validatePositionedReadArgs(FSInputStream.java:107)
	at org.apache.hadoop.hdfs.DFSInputStream.read(DFSInputStream.java:975)
	at java.io.DataInputStream.read(DataInputStream.java:149)
	at org.apache.hadoop.hdfs.shortcircuit.TestShortCircuitLocalRead.checkFileContent(TestShortCircuitLocalRead.java:157)
	at org.apache.hadoop.hdfs.shortcircuit.TestShortCircuitLocalRead.doTestShortCircuitReadImpl(TestShortCircuitLocalRead.java:286)
	at org.apache.hadoop.hdfs.shortcircuit.TestShortCircuitLocalRead.doTestShortCircuitRead(TestShortCircuitLocalRead.java:241)
	at org.apache.hadoop.hdfs.shortcircuit.TestShortCircuitLocalRead.testSmallFileLocalRead(TestShortCircuitLocalRead.java:308)


FAILED:  org.apache.hadoop.hdfs.shortcircuit.TestShortCircuitLocalRead.testLocalReadLegacy

Error Message:
Requested more bytes than destination buffer size

Stack Trace:
java.lang.IndexOutOfBoundsException: Requested more bytes than destination buffer size
	at org.apache.hadoop.fs.FSInputStream.validatePositionedReadArgs(FSInputStream.java:107)
	at org.apache.hadoop.hdfs.DFSInputStream.read(DFSInputStream.java:975)
	at java.io.DataInputStream.read(DataInputStream.java:149)
	at org.apache.hadoop.hdfs.shortcircuit.TestShortCircuitLocalRead.checkFileContent(TestShortCircuitLocalRead.java:157)
	at org.apache.hadoop.hdfs.shortcircuit.TestShortCircuitLocalRead.doTestShortCircuitReadImpl(TestShortCircuitLocalRead.java:286)
	at org.apache.hadoop.hdfs.shortcircuit.TestShortCircuitLocalRead.doTestShortCircuitReadLegacy(TestShortCircuitLocalRead.java:235)
	at org.apache.hadoop.hdfs.shortcircuit.TestShortCircuitLocalRead.testLocalReadLegacy(TestShortCircuitLocalRead.java:316)


FAILED:  org.apache.hadoop.hdfs.shortcircuit.TestShortCircuitLocalRead.testLocalReadFallback

Error Message:
Requested more bytes than destination buffer size

Stack Trace:
java.lang.IndexOutOfBoundsException: Requested more bytes than destination buffer size
	at org.apache.hadoop.fs.FSInputStream.validatePositionedReadArgs(FSInputStream.java:107)
	at org.apache.hadoop.hdfs.DFSInputStream.read(DFSInputStream.java:975)
	at java.io.DataInputStream.read(DataInputStream.java:149)
	at org.apache.hadoop.hdfs.shortcircuit.TestShortCircuitLocalRead.checkFileContent(TestShortCircuitLocalRead.java:157)
	at org.apache.hadoop.hdfs.shortcircuit.TestShortCircuitLocalRead.doTestShortCircuitReadImpl(TestShortCircuitLocalRead.java:286)
	at org.apache.hadoop.hdfs.shortcircuit.TestShortCircuitLocalRead.doTestShortCircuitReadLegacy(TestShortCircuitLocalRead.java:235)
	at org.apache.hadoop.hdfs.shortcircuit.TestShortCircuitLocalRead.testLocalReadFallback(TestShortCircuitLocalRead.java:327)



Mime
  • Unnamed multipart/mixed (inline, None, 0 bytes)
View raw message