hadoop-hdfs-dev mailing list archives

Site index · List index
Message view « Date » · « Thread »
Top « Date » · « Thread »
From Apache Jenkins Server <jenk...@builds.apache.org>
Subject Build failed in Jenkins: Hadoop-Hdfs-trunk #2924
Date Fri, 11 Mar 2016 17:14:34 GMT
See <https://builds.apache.org/job/Hadoop-Hdfs-trunk/2924/changes>

Changes:

[aajisaka] Revert "MAPREDUCE-6520. Migrate MR Client test cases part 1."

[aajisaka] MAPREDUCE-6520. Migrate MR Client test cases part 1. Contributed by

------------------------------------------
[...truncated 68254 lines...]
  TestStorageMover.testNoSpaceArchive:718 » IO Failed on local exception: java.i...
  TestStorageMover.testNoSpaceDisk:660 » IO Failed on local exception: java.io.I...
  TestStorageMover.testMigrateOpenFileToArchival:544 » IO Failed on local except...
  TestStorageMover.testHotWarmColdDirs:605 » IO Failed on local exception: java....
  TestMover.testMoveWhenStoragePolicyNotSatisfying:359 » IO Failed on local exce...
  TestMover.testScheduleBlockWithinSameNode:123 » IO Failed on local exception: ...
  TestMover.testMoverFailedRetry:390 » IO Failed on local exception: java.io.IOE...
  TestMover.testMoverCliWithHAConf:212 » IO Failed on local exception: java.io.I...
  TestMover.testTwoReplicaSameStorageTypeShouldNotSelect:312 » IO Failed on loca...
  TestMover.testMoverCliWithFederationHA:282 » IO Failed on local exception: jav...
  TestMover.testScheduleSameBlock:88 » IO Failed on local exception: java.io.IOE...
  TestMover.testMoverCli:179 » IO Failed on local exception: java.io.IOException...
  TestMover.testMoverWithStripedFile:447 » IO Failed on local exception: java.io...
  TestMover.testMoverCliWithFederation:234 » IO Failed on local exception: java....
  TestDatanodeStartupFixesLegacyStorageIDs.testUpgradeFrom22via26FixesStorageIDs:125->runLayoutUpgradeTest:70->upgradeAndVerify:103
» IO
  TestDatanodeStartupFixesLegacyStorageIDs.testUpgradeFrom26PreservesStorageIDs:136->runLayoutUpgradeTest:70->upgradeAndVerify:103
» IO
  TestDatanodeStartupFixesLegacyStorageIDs.testUpgradeFrom22FixesStorageIDs:115->runLayoutUpgradeTest:70->upgradeAndVerify:103
» IO
  TestApplyingStoragePolicy.clusterSetUp:45 » IO Failed on local exception: java...
  TestApplyingStoragePolicy.clusterSetUp:45 » IO Failed on local exception: java...
  TestApplyingStoragePolicy.clusterSetUp:45 » IO Failed on local exception: java...
  TestApplyingStoragePolicy.clusterSetUp:45 » IO Failed on local exception: java...
  TestDatanodeReport.testDatanodeReport:55 » IO Failed on local exception: java....
  TestEncryptedTransfer.testEncryptedWriteWithTwoDns:491->testEncryptedWrite:505 » IO
  TestEncryptedTransfer.testEncryptedWriteWithOneDn:486->testEncryptedWrite:505 » IO
  TestEncryptedTransfer.testEncryptedAppend:544 » IO Failed on local exception: ...
  TestEncryptedTransfer.testEncryptedWriteWithMultipleDns:496->testEncryptedWrite:505 »
IO
  TestEncryptedTransfer.testLongLivedWriteClientAfterRestart:408 » IO Failed on ...
  TestEncryptedTransfer.testEncryptedAppendRequiringBlockTransfer:570 » IO Faile...
  TestEncryptedTransfer.testEncryptedReadAfterNameNodeRestart:267 » IO Failed on...
  TestEncryptedTransfer.testClientThatDoesNotSupportEncryption:309 » IO Failed o...
  TestEncryptedTransfer.testLongLivedClient:437 » IO Failed on local exception: ...
  TestEncryptedTransfer.testEncryptedReadWithAES:214 » IO Failed on local except...
  TestEncryptedTransfer.testEncryptedReadWithRC4:157 » IO Failed on local except...
  TestEncryptedTransfer.testLongLivedReadClientAfterRestart:364 » IO Failed on l...
  TestEncryptedTransfer.testEncryptedRead:104 » IO Failed on local exception: ja...
  TestEncryptedTransfer.testEncryptedWriteWithTwoDns:491->testEncryptedWrite:505 » IO
  TestEncryptedTransfer.testEncryptedWriteWithOneDn:486->testEncryptedWrite:505 » IO
  TestEncryptedTransfer.testEncryptedAppend:544 » IO Failed on local exception: ...
  TestEncryptedTransfer.testEncryptedWriteWithMultipleDns:496->testEncryptedWrite:505 »
IO
  TestEncryptedTransfer.testLongLivedWriteClientAfterRestart:408 » IO Failed on ...
  TestEncryptedTransfer.testEncryptedAppendRequiringBlockTransfer:570 » IO Faile...
  TestEncryptedTransfer.testEncryptedReadAfterNameNodeRestart:267 » IO Failed on...
  TestEncryptedTransfer.testClientThatDoesNotSupportEncryption:309 » IO Failed o...
  TestEncryptedTransfer.testLongLivedClient:437 » IO Failed on local exception: ...
  TestEncryptedTransfer.testEncryptedReadWithAES:214 » IO Failed on local except...
  TestEncryptedTransfer.testEncryptedReadWithRC4:157 » IO Failed on local except...
  TestEncryptedTransfer.testLongLivedReadClientAfterRestart:364 » IO Failed on l...
  TestEncryptedTransfer.testEncryptedRead:104 » IO Failed on local exception: ja...
  TestPipelines.startUpCluster:62 » IO Failed on local exception: java.io.IOExce...
  TestEncryptionZonesWithHA.setupCluster:67 » IO Failed on local exception: java...
  TestDFSClientSocketSize.testAutoTuningSendBufferSize:70->createSocket:90 » IO ...
  TestDFSClientSocketSize.testDefaultSendBufferSize:52->createSocket:90 » IO Fai...
  TestDFSClientSocketSize.testSpecifiedSendBufferSize:62->createSocket:90 » IO F...
  TestWriteRead.initJunitModeTest:77 » IO Failed on local exception: java.io.IOE...
  TestWriteRead.initJunitModeTest:77 » IO Failed on local exception: java.io.IOE...
  TestWriteRead.initJunitModeTest:77 » IO Failed on local exception: java.io.IOE...
  TestDFSInotifyEventInputStream.testBasic:94 » IO Failed on local exception: ja...
  TestDFSInotifyEventInputStream.testReadEventsWithTimeout:494 » IO Failed on lo...
  TestDFSInotifyEventInputStream.testNNFailover:417 » IO Failed on local excepti...
  TestDFSInotifyEventInputStream.testTwoActiveNNs:449 » IO Failed on local excep...
  TestClientProtocolForPipelineRecovery.testGetNewStamp:51 » IO Failed on local ...
  TestClientProtocolForPipelineRecovery.testPipelineRecoveryForLastBlock:143 » IO
  TestClientProtocolForPipelineRecovery.testPipelineRecoveryOnDatanodeUpgrade:342 » IO
  TestClientProtocolForPipelineRecovery.testPipelineRecoveryOnRestartFailure:282 » IO
  TestClientProtocolForPipelineRecovery.testPipelineRecoveryOnOOB:243 » IO Faile...
  TestClientProtocolForPipelineRecovery.testPacketTransmissionDelay:190 » IO Fai...
  TestReplaceDatanodeOnFailure.testReplaceDatanodeOnFailure:127 » IO Failed on l...
  TestReplaceDatanodeOnFailure.testBestEffort:332 » IO Failed on local exception...
  TestReplaceDatanodeOnFailure.testAppend:280 » IO Failed on local exception: ja...
  TestPersistBlocks.testEarlierVersionEditLog:337 » IO Failed on local exception...
  TestPersistBlocks.testRestartDfsWithAbandonedBlock:163 » IO Failed on local ex...
  TestPersistBlocks.testRestartWithAppend:273 » IO Failed on local exception: ja...
  TestPersistBlocks.testRestartWithPartialBlockHflushed:224 » IO Failed on local...
  TestPersistBlocks.TestRestartDfsWithFlush:80->testRestartDfs:104 » IO Failed o...
  TestFSInputChecker.testFSInputChecker:326 » IO Failed on local exception: java...
  TestFcHdfsSetUMask.clusterSetupAtBegining:90 » IO Failed on local exception: j...
  TestFcHdfsPermission.clusterSetupAtBegining:58 » IO Failed on local exception:...
  TestGlobPaths.setUp:71 » IO Failed on local exception: java.io.IOException: Co...
  TestLoadGenerator.testLoadGenerator:152 » IO Failed on local exception: java.i...
  TestSymlinkHdfsDisable.testSymlinkHdfsDisable:41 » IO Failed on local exceptio...
  TestSymlinkHdfsFileSystem>TestSymlinkHdfs.beforeClassSetup:92 » IO Failed on l...
  TestUrlStreamHandler.testDfsUrls:56 » IO Failed on local exception: java.io.IO...
  TestUnbuffer.testUnbufferClosesSockets:60 » IO Failed on local exception: java...
  TestUnbuffer.testOpenManyFilesViaTcp:106 » IO Failed on local exception: java....
  TestFcHdfsCreateMkdir.clusterSetupAtBegining:51 » IO Failed on local exception...
  TestEnhancedByteBufferAccess.testZeroCopyReadsNoFallback:250 » IO Failed on lo...
  TestEnhancedByteBufferAccess.testShortZeroCopyReads:194 » IO Failed on local e...
  TestEnhancedByteBufferAccess.testFallbackRead:528 » IO Failed on local excepti...
  TestEnhancedByteBufferAccess.testZeroCopyMmapCache:341 » IO Failed on local ex...
  TestEnhancedByteBufferAccess.testHdfsFallbackReads:444 » IO Failed on local ex...
  TestEnhancedByteBufferAccess.testClientMmapDisable:730 » IO Failed on local ex...
  TestEnhancedByteBufferAccess.testZeroCopyReads:147 » IO Failed on local except...
  TestEnhancedByteBufferAccess.testZeroCopyReadOfCachedData:608 » IO Failed on l...
  TestHDFSFileContextMainOperations.clusterSetupAtBegining:59 » IO Failed on loc...
  TestHdfsTextCommand.setUp:54 » IO Failed on local exception: java.io.IOExcepti...
  TestSWebHdfsFileContextMainOperations.clusterSetupAtBeginning:84 » IO Failed o...
  TestResolveHdfsSymlink.setUp:61 » IO Failed on local exception: java.io.IOExce...
  TestWebHdfsFileContextMainOperations.clusterSetupAtBeginning:77 » IO Failed on...
  TestViewFsWithAcls.clusterSetupAtBeginning:67 » IO Failed on local exception: ...
  TestViewFsFileStatusHdfs.clusterSetupAtBegining:65 » IO Failed on local except...
  TestViewFsFileStatusHdfs.cleanup:121 NullPointer
  TestViewFileSystemHdfs.clusterSetupAtBegining:65 » IO Failed on local exceptio...
  TestViewFsWithXAttrs.clusterSetupAtBeginning:61 » IO Failed on local exception...
  TestViewFsAtHdfsRoot.clusterSetupAtBegining:59 » IO Failed on local exception:...
  TestViewFsHdfs.clusterSetupAtBegining:56 » IO Failed on local exception: java....
  TestViewFileSystemWithAcls.clusterSetupAtBeginning:67 » IO Failed on local exc...
  TestViewFileSystemAtHdfsRoot.clusterSetupAtBegining:58 » IO Failed on local ex...
  TestViewFileSystemWithXAttrs.clusterSetupAtBeginning:62 » IO Failed on local e...
  TestViewFsDefaultValue.clusterSetupAtBegining:85 » IO Failed on local exceptio...
  TestViewFsDefaultValue.cleanup:217 NullPointer
  TestSymlinkHdfsFileContext>TestSymlinkHdfs.beforeClassSetup:92 » IO Failed on ...
  TestHDFSContractDelete.createCluster:36 » IO Failed on local exception: java.i...
  TestHDFSContractSetTimes.createCluster:33 » IO Failed on local exception: java...
  TestHDFSContractMkdir.createCluster:36 » IO Failed on local exception: java.io...
  TestHDFSContractOpen.createCluster:36 » IO Failed on local exception: java.io....
  TestHDFSContractRootDirectory.createCluster:37 » IO Failed on local exception:...
  TestHDFSContractAppend.createCluster:29 » IO Failed on local exception: java.i...
  TestHDFSContractCreate.createCluster:33 » IO Failed on local exception: java.i...
  TestHDFSContractSeek.createCluster:36 » IO Failed on local exception: java.io....
  TestHDFSContractRename.createCluster:33 » IO Failed on local exception: java.i...
  TestHDFSContractGetFileStatus.createCluster:34 » IO Failed on local exception:...
  TestHDFSContractConcat.createCluster:36 » IO Failed on local exception: java.i...
  TestStickyBit.init:68->initCluster:72 » IO Failed on local exception: java.io....
  TestRollingFileSystemSinkWithHdfs.setupHdfs:57 » IO Failed on local exception:...
  TestRollingFileSystemSinkWithHdfs.setupHdfs:57 » IO Failed on local exception:...
  TestRollingFileSystemSinkWithHdfs.setupHdfs:57 » IO Failed on local exception:...
  TestRollingFileSystemSinkWithHdfs.setupHdfs:57 » IO Failed on local exception:...
  TestRollingFileSystemSinkWithHdfs.setupHdfs:57 » IO Failed on local exception:...
  TestRollingFileSystemSinkWithHdfs.setupHdfs:57 » IO Failed on local exception:...
  TestRollingFileSystemSinkWithHdfs.setupHdfs:57 » IO Failed on local exception:...
  TestRollingFileSystemSinkWithHdfs.setupHdfs:57 » IO Failed on local exception:...
  TestRollingFileSystemSinkWithHdfs.setupHdfs:57 » IO Failed on local exception:...
  TestRollingFileSystemSinkWithHdfs.setupHdfs:57 » IO Failed on local exception:...
  TestRollingFileSystemSinkWithHdfs.setupHdfs:57 » IO Failed on local exception:...
  TestRollingFileSystemSinkWithSecureHdfs.testMissingPropertiesWithSecureHDFS:140 » IO
  TestRollingFileSystemSinkWithSecureHdfs.testWithSecureHDFS:90 » IO Failed on l...
  TestRefreshCallQueue.setUp:71 » IO Failed on local exception: java.io.IOExcept...
  TestPermissionSymlinks.beforeClassSetUp:78 » IO Failed on local exception: jav...
  TestRefreshUserMappings.setUp:94 » IO Failed on local exception: java.io.IOExc...
  TestRefreshUserMappings.setUp:94 » IO Failed on local exception: java.io.IOExc...
  TestPermission.testFilePermission:186 » IO Failed on local exception: java.io....
  TestPermission.testCreate:128 » IO Failed on local exception: java.io.IOExcept...
  TestJMXGet.testDataNode:154 » IO Failed on local exception: java.io.IOExceptio...
  TestJMXGet.testNameNode:96 » IO Failed on local exception: java.io.IOException...
  TestTracing.startCluster:215 » IO Failed on local exception: java.io.IOExcepti...
  TestTraceAdmin.testCreateAndDestroySpanReceiver:67 » IO Failed on local except...
  TestTracingShortCircuitLocalRead.testShortCircuitTraceHooks:81 » IO Failed on ...
  TestNetworkTopology.testInvalidNetworkTopologiesNotCachedInHdfs:321 » IO Faile...
  TestGenericRefresh.setUpBeforeClass:60 » IO Failed on local exception: java.io...
  TestHDFSCLI.setUp:56 » IO Failed on local exception: java.io.IOException: Coul...
  TestHDFSCLI.tearDown:87->CLITestHelper.tearDown:125->CLITestHelper.displayResults:162->expandCommand:93
» NullPointer
  TestCacheAdminCLI.setUp:63 » IO Failed on local exception: java.io.IOException...
  TestAclCLI.setUp:40 » IO Failed on local exception: java.io.IOException: Could...
  TestAclCLI.tearDown:49->CLITestHelper.tearDown:125->CLITestHelper.displayResults:162->expandCommand:68
» NullPointer
  TestErasureCodingCLI.setUp:48 » IO Failed on local exception: java.io.IOExcept...
  TestErasureCodingCLI.tearDown:75->CLITestHelper.tearDown:125->CLITestHelper.displayResults:162->expandCommand:81
» NullPointer
  TestCryptoAdminCLI.setUp:72 » IO Failed on local exception: java.io.IOExceptio...
  TestCryptoAdminCLI.tearDown:96->CLITestHelper.tearDown:125->CLITestHelper.displayResults:162->expandCommand:117
» NullPointer
  TestXAttrCLI.setUp:49 » IO Failed on local exception: java.io.IOException: Cou...
  TestXAttrCLI.tearDown:77->CLITestHelper.tearDown:125->CLITestHelper.displayResults:162->expandCommand:83
» NullPointer
  TestDeleteCLI.setUp:47 » IO Failed on local exception: java.io.IOException: Co...
  TestDeleteCLI.tearDown:68->CLITestHelper.tearDown:125->CLITestHelper.displayResults:162->expandCommand:79
» NullPointer

Tests run: 3206, Failures: 26, Errors: 1989, Skipped: 7

[INFO]                                                                         
[INFO] ------------------------------------------------------------------------
[INFO] Skipping Apache Hadoop HDFS Native Client
[INFO] This project has been banned from the build due to previous failures.
[INFO] ------------------------------------------------------------------------
[INFO]                                                                         
[INFO] ------------------------------------------------------------------------
[INFO] Skipping Apache Hadoop HttpFS
[INFO] This project has been banned from the build due to previous failures.
[INFO] ------------------------------------------------------------------------
[INFO]                                                                         
[INFO] ------------------------------------------------------------------------
[INFO] Skipping Apache Hadoop HDFS BookKeeper Journal
[INFO] This project has been banned from the build due to previous failures.
[INFO] ------------------------------------------------------------------------
[INFO]                                                                         
[INFO] ------------------------------------------------------------------------
[INFO] Skipping Apache Hadoop HDFS-NFS
[INFO] This project has been banned from the build due to previous failures.
[INFO] ------------------------------------------------------------------------
[INFO]                                                                         
[INFO] ------------------------------------------------------------------------
[INFO] Building Apache Hadoop HDFS Project 3.0.0-SNAPSHOT
[INFO] ------------------------------------------------------------------------
[INFO] 
[INFO] --- maven-clean-plugin:2.5:clean (default-clean) @ hadoop-hdfs-project ---
[INFO] Deleting <https://builds.apache.org/job/Hadoop-Hdfs-trunk/ws/hadoop-hdfs-project/target>
[INFO] 
[INFO] --- maven-antrun-plugin:1.7:run (create-testdirs) @ hadoop-hdfs-project ---
[INFO] Executing tasks

main:
    [mkdir] Created dir: <https://builds.apache.org/job/Hadoop-Hdfs-trunk/ws/hadoop-hdfs-project/target/test-dir>
[INFO] Executed tasks
[INFO] 
[INFO] --- maven-source-plugin:2.3:jar-no-fork (hadoop-java-sources) @ hadoop-hdfs-project
---
[INFO] 
[INFO] --- maven-source-plugin:2.3:test-jar-no-fork (hadoop-java-sources) @ hadoop-hdfs-project
---
[INFO] 
[INFO] --- maven-enforcer-plugin:1.3.1:enforce (dist-enforce) @ hadoop-hdfs-project ---
[INFO] 
[INFO] --- maven-site-plugin:3.5:attach-descriptor (attach-descriptor) @ hadoop-hdfs-project
---
[INFO] 
[INFO] --- maven-javadoc-plugin:2.8.1:jar (module-javadocs) @ hadoop-hdfs-project ---
[INFO] Skipping javadoc generation
[INFO] 
[INFO] --- maven-enforcer-plugin:1.3.1:enforce (depcheck) @ hadoop-hdfs-project ---
[INFO] 
[INFO] --- maven-checkstyle-plugin:2.15:checkstyle (default-cli) @ hadoop-hdfs-project ---
[INFO] 
[INFO] --- findbugs-maven-plugin:3.0.0:findbugs (default-cli) @ hadoop-hdfs-project ---
[INFO] ------------------------------------------------------------------------
[INFO] Reactor Summary:
[INFO] 
[INFO] Apache Hadoop HDFS Client ......................... SUCCESS [03:54 min]
[INFO] Apache Hadoop HDFS ................................ FAILURE [  01:24 h]
[INFO] Apache Hadoop HDFS Native Client .................. SKIPPED
[INFO] Apache Hadoop HttpFS .............................. SKIPPED
[INFO] Apache Hadoop HDFS BookKeeper Journal ............. SKIPPED
[INFO] Apache Hadoop HDFS-NFS ............................ SKIPPED
[INFO] Apache Hadoop HDFS Project ........................ SUCCESS [  0.068 s]
[INFO] ------------------------------------------------------------------------
[INFO] BUILD FAILURE
[INFO] ------------------------------------------------------------------------
[INFO] Total time: 01:27 h
[INFO] Finished at: 2016-03-11T17:13:49+00:00
[INFO] Final Memory: 58M/672M
[INFO] ------------------------------------------------------------------------
[ERROR] Failed to execute goal org.apache.maven.plugins:maven-surefire-plugin:2.17:test (default-test)
on project hadoop-hdfs: There are test failures.
[ERROR] 
[ERROR] Please refer to <https://builds.apache.org/job/Hadoop-Hdfs-trunk/ws/hadoop-hdfs-project/hadoop-hdfs/target/surefire-reports>
for the individual test results.
[ERROR] -> [Help 1]
[ERROR] 
[ERROR] To see the full stack trace of the errors, re-run Maven with the -e switch.
[ERROR] Re-run Maven using the -X switch to enable full debug logging.
[ERROR] 
[ERROR] For more information about the errors and possible solutions, please read the following
articles:
[ERROR] [Help 1] http://cwiki.apache.org/confluence/display/MAVEN/MojoFailureException
[ERROR] 
[ERROR] After correcting the problems, you can resume the build with the command
[ERROR]   mvn <goals> -rf :hadoop-hdfs
Build step 'Execute shell' marked build as failure
Archiving artifacts
Recording test results

Mime
View raw message