hadoop-hdfs-dev mailing list archives

Site index · List index
Message view « Date » · « Thread »
Top « Date » · « Thread »
From Apache Jenkins Server <jenk...@builds.apache.org>
Subject Build failed in Jenkins: Hadoop-Hdfs-trunk #2969
Date Tue, 29 Mar 2016 10:00:36 GMT
See <https://builds.apache.org/job/Hadoop-Hdfs-trunk/2969/changes>

Changes:

[rohithsharmaks] MAPREDUCE-6662. Clear ASF Warnings on test data files. Contributed by

[vinayakumarb] HDFS-9871. "Bytes Being Moved" -ve(-1 B) when cluster was already

[xgong] YARN-4863. AHS Security login should be in serviceInit() instead of

------------------------------------------
[...truncated 5267 lines...]
Tests run: 5, Failures: 0, Errors: 0, Skipped: 0, Time elapsed: 5.227 sec - in org.apache.hadoop.fs.contract.hdfs.TestHDFSContractMkdir
Running org.apache.hadoop.fs.contract.hdfs.TestHDFSContractCreate
Tests run: 6, Failures: 0, Errors: 0, Skipped: 0, Time elapsed: 5.247 sec - in org.apache.hadoop.fs.contract.hdfs.TestHDFSContractCreate
Running org.apache.hadoop.fs.contract.hdfs.TestHDFSContractRootDirectory
Tests run: 6, Failures: 0, Errors: 0, Skipped: 0, Time elapsed: 4.566 sec - in org.apache.hadoop.fs.contract.hdfs.TestHDFSContractRootDirectory
Running org.apache.hadoop.fs.contract.hdfs.TestHDFSContractSeek
Tests run: 10, Failures: 0, Errors: 0, Skipped: 0, Time elapsed: 7.75 sec - in org.apache.hadoop.fs.contract.hdfs.TestHDFSContractSeek
Running org.apache.hadoop.fs.contract.hdfs.TestHDFSContractSetTimes
Tests run: 1, Failures: 0, Errors: 0, Skipped: 0, Time elapsed: 4.247 sec - in org.apache.hadoop.fs.contract.hdfs.TestHDFSContractSetTimes
Running org.apache.hadoop.fs.TestEnhancedByteBufferAccess
Tests run: 10, Failures: 0, Errors: 0, Skipped: 1, Time elapsed: 15.868 sec - in org.apache.hadoop.fs.TestEnhancedByteBufferAccess
Running org.apache.hadoop.fs.permission.TestStickyBit
Tests run: 6, Failures: 0, Errors: 0, Skipped: 0, Time elapsed: 8.789 sec - in org.apache.hadoop.fs.permission.TestStickyBit
Running org.apache.hadoop.fs.TestSymlinkHdfsDisable
Tests run: 1, Failures: 0, Errors: 0, Skipped: 0, Time elapsed: 4.321 sec - in org.apache.hadoop.fs.TestSymlinkHdfsDisable
Running org.apache.hadoop.fs.TestHDFSFileContextMainOperations
Tests run: 68, Failures: 0, Errors: 0, Skipped: 0, Time elapsed: 9.087 sec - in org.apache.hadoop.fs.TestHDFSFileContextMainOperations
Running org.apache.hadoop.fs.TestWebHdfsFileContextMainOperations
Tests run: 60, Failures: 0, Errors: 0, Skipped: 0, Time elapsed: 10.071 sec - in org.apache.hadoop.fs.TestWebHdfsFileContextMainOperations
Running org.apache.hadoop.fs.TestSWebHdfsFileContextMainOperations
Tests run: 60, Failures: 0, Errors: 0, Skipped: 0, Time elapsed: 96.091 sec - in org.apache.hadoop.fs.TestSWebHdfsFileContextMainOperations
Running org.apache.hadoop.fs.TestSymlinkHdfsFileContext
Tests run: 71, Failures: 0, Errors: 0, Skipped: 0, Time elapsed: 10.669 sec - in org.apache.hadoop.fs.TestSymlinkHdfsFileContext
Running org.apache.hadoop.fs.TestUnbuffer
Tests run: 2, Failures: 0, Errors: 0, Skipped: 0, Time elapsed: 7.909 sec - in org.apache.hadoop.fs.TestUnbuffer
Running org.apache.hadoop.fs.shell.TestHdfsTextCommand
Tests run: 1, Failures: 0, Errors: 0, Skipped: 0, Time elapsed: 4.761 sec - in org.apache.hadoop.fs.shell.TestHdfsTextCommand
Running org.apache.hadoop.fs.TestResolveHdfsSymlink
Tests run: 4, Failures: 0, Errors: 0, Skipped: 0, Time elapsed: 4.193 sec - in org.apache.hadoop.fs.TestResolveHdfsSymlink
Running org.apache.hadoop.fs.TestFcHdfsCreateMkdir
Tests run: 8, Failures: 0, Errors: 0, Skipped: 0, Time elapsed: 4.891 sec - in org.apache.hadoop.fs.TestFcHdfsCreateMkdir
Running org.apache.hadoop.fs.TestFcHdfsPermission
Tests run: 4, Failures: 0, Errors: 0, Skipped: 0, Time elapsed: 4.911 sec - in org.apache.hadoop.fs.TestFcHdfsPermission
Running org.apache.hadoop.fs.TestGlobPaths
Tests run: 36, Failures: 0, Errors: 0, Skipped: 6, Time elapsed: 5.827 sec - in org.apache.hadoop.fs.TestGlobPaths
Running org.apache.hadoop.fs.TestUrlStreamHandler
Tests run: 2, Failures: 0, Errors: 0, Skipped: 0, Time elapsed: 4.888 sec - in org.apache.hadoop.fs.TestUrlStreamHandler
Running org.apache.hadoop.fs.viewfs.TestViewFileSystemAtHdfsRoot
Tests run: 60, Failures: 0, Errors: 0, Skipped: 0, Time elapsed: 10.699 sec - in org.apache.hadoop.fs.viewfs.TestViewFileSystemAtHdfsRoot
Running org.apache.hadoop.fs.viewfs.TestViewFsWithAcls
Tests run: 1, Failures: 0, Errors: 0, Skipped: 0, Time elapsed: 4.818 sec - in org.apache.hadoop.fs.viewfs.TestViewFsWithAcls
Running org.apache.hadoop.fs.viewfs.TestViewFsDefaultValue
Tests run: 7, Failures: 0, Errors: 0, Skipped: 0, Time elapsed: 4.231 sec - in org.apache.hadoop.fs.viewfs.TestViewFsDefaultValue
Running org.apache.hadoop.fs.viewfs.TestViewFileSystemWithAcls
Tests run: 1, Failures: 0, Errors: 0, Skipped: 0, Time elapsed: 4.891 sec - in org.apache.hadoop.fs.viewfs.TestViewFileSystemWithAcls
Running org.apache.hadoop.fs.viewfs.TestViewFileSystemHdfs
Tests run: 60, Failures: 0, Errors: 0, Skipped: 0, Time elapsed: 10.706 sec - in org.apache.hadoop.fs.viewfs.TestViewFileSystemHdfs
Running org.apache.hadoop.fs.viewfs.TestViewFsAtHdfsRoot
Tests run: 58, Failures: 0, Errors: 0, Skipped: 0, Time elapsed: 8.826 sec - in org.apache.hadoop.fs.viewfs.TestViewFsAtHdfsRoot
Running org.apache.hadoop.fs.viewfs.TestViewFsFileStatusHdfs
Tests run: 2, Failures: 0, Errors: 0, Skipped: 0, Time elapsed: 4.172 sec - in org.apache.hadoop.fs.viewfs.TestViewFsFileStatusHdfs
Running org.apache.hadoop.fs.viewfs.TestViewFileSystemWithXAttrs
Tests run: 1, Failures: 0, Errors: 0, Skipped: 0, Time elapsed: 4.731 sec - in org.apache.hadoop.fs.viewfs.TestViewFileSystemWithXAttrs
Running org.apache.hadoop.fs.viewfs.TestViewFsWithXAttrs
Tests run: 1, Failures: 0, Errors: 0, Skipped: 0, Time elapsed: 4.704 sec - in org.apache.hadoop.fs.viewfs.TestViewFsWithXAttrs
Running org.apache.hadoop.fs.viewfs.TestViewFsHdfs
Tests run: 58, Failures: 0, Errors: 0, Skipped: 0, Time elapsed: 8.667 sec - in org.apache.hadoop.fs.viewfs.TestViewFsHdfs
Running org.apache.hadoop.fs.TestHdfsNativeCodeLoader
Tests run: 1, Failures: 0, Errors: 0, Skipped: 0, Time elapsed: 0.216 sec - in org.apache.hadoop.fs.TestHdfsNativeCodeLoader
Running org.apache.hadoop.metrics2.sink.TestRollingFileSystemSinkWithSecureHdfs
#
# A fatal error has been detected by the Java Runtime Environment:
#
#  SIGSEGV (0xb) at pc=0x00007f22ad064663, pid=6357, tid=139786919724800
#
# JRE version: Java(TM) SE Runtime Environment (7.0_55-b13) (build 1.7.0_55-b13)
# Java VM: Java HotSpot(TM) 64-Bit Server VM (24.55-b03 mixed mode linux-amd64 compressed
oops)
# Problematic frame:
# C  [libc.so.6+0x151663]  __nss_hosts_lookup+0x1a3e3
#
# Failed to write core dump. Core dumps have been disabled. To enable core dumping, try "ulimit
-c unlimited" before starting Java again
#
# An error report file with more information is saved as:
# <https://builds.apache.org/job/Hadoop-Hdfs-trunk/ws/hadoop-hdfs-project/hadoop-hdfs/hs_err_pid6357.log>
#
# If you would like to submit a bug report, please visit:
#   http://bugreport.sun.com/bugreport/crash.jsp
# The crash happened outside the Java Virtual Machine in native code.
# See problematic frame for where to report the bug.
#
Aborted (core dumped)
Running org.apache.hadoop.metrics2.sink.TestRollingFileSystemSinkWithHdfs
Tests run: 11, Failures: 0, Errors: 2, Skipped: 0, Time elapsed: 79.67 sec <<< FAILURE!
- in org.apache.hadoop.metrics2.sink.TestRollingFileSystemSinkWithHdfs
testAppend(org.apache.hadoop.metrics2.sink.TestRollingFileSystemSinkWithHdfs)  Time elapsed:
21.29 sec  <<< ERROR!
java.io.IOException: Cannot obtain block length for LocatedBlock{BP-1984676970-67.195.81.150-1459245443533:blk_1073741825_1001;
getBlockSize()=12; corrupt=false; offset=0; locs=[DatanodeInfoWithStorage[127.0.0.1:58207,DS-f4562852-6928-40d5-8189-34d1d7e8898c,DISK],
DatanodeInfoWithStorage[127.0.0.1:45560,DS-3fdef13f-039d-487f-aad3-f3ad42ed427c,DISK], DatanodeInfoWithStorage[127.0.0.1:49167,DS-628762fb-bc3d-4d31-82b4-db4f4c8010e3,DISK]]}
	at org.apache.hadoop.hdfs.DFSInputStream.readBlockLength(DFSInputStream.java:434)
	at org.apache.hadoop.hdfs.DFSInputStream.fetchLocatedBlocksAndGetLastBlockLength(DFSInputStream.java:344)
	at org.apache.hadoop.hdfs.DFSInputStream.openInfo(DFSInputStream.java:276)
	at org.apache.hadoop.hdfs.DFSInputStream.<init>(DFSInputStream.java:266)
	at org.apache.hadoop.hdfs.DFSClient.open(DFSClient.java:1038)
	at org.apache.hadoop.hdfs.DistributedFileSystem$3.doCall(DistributedFileSystem.java:271)
	at org.apache.hadoop.hdfs.DistributedFileSystem$3.doCall(DistributedFileSystem.java:268)
	at org.apache.hadoop.fs.FileSystemLinkResolver.resolve(FileSystemLinkResolver.java:81)
	at org.apache.hadoop.hdfs.DistributedFileSystem.open(DistributedFileSystem.java:268)
	at org.apache.hadoop.fs.FileSystem.open(FileSystem.java:777)
	at org.apache.hadoop.metrics2.sink.RollingFileSystemSinkTestBase.readLogData(RollingFileSystemSinkTestBase.java:275)
	at org.apache.hadoop.metrics2.sink.RollingFileSystemSinkTestBase.readLogFile(RollingFileSystemSinkTestBase.java:254)
	at org.apache.hadoop.metrics2.sink.RollingFileSystemSinkTestBase.doWriteTest(RollingFileSystemSinkTestBase.java:225)
	at org.apache.hadoop.metrics2.sink.RollingFileSystemSinkTestBase.doAppendTest(RollingFileSystemSinkTestBase.java:385)
	at org.apache.hadoop.metrics2.sink.TestRollingFileSystemSinkWithHdfs.testAppend(TestRollingFileSystemSinkWithHdfs.java:98)

testSilentAppend(org.apache.hadoop.metrics2.sink.TestRollingFileSystemSinkWithHdfs)  Time
elapsed: 21.136 sec  <<< ERROR!
java.io.IOException: Cannot obtain block length for LocatedBlock{BP-541636477-67.195.81.150-1459245464828:blk_1073741825_1001;
getBlockSize()=12; corrupt=false; offset=0; locs=[DatanodeInfoWithStorage[127.0.0.1:46496,DS-0aa9c2ca-d0d0-457e-b8de-f5582d0f8e73,DISK],
DatanodeInfoWithStorage[127.0.0.1:52354,DS-d7b89be2-5c23-402c-b262-bc499f289ce4,DISK], DatanodeInfoWithStorage[127.0.0.1:58356,DS-57644718-b375-497c-befb-28604c11c17f,DISK]]}
	at org.apache.hadoop.hdfs.DFSInputStream.readBlockLength(DFSInputStream.java:434)
	at org.apache.hadoop.hdfs.DFSInputStream.fetchLocatedBlocksAndGetLastBlockLength(DFSInputStream.java:344)
	at org.apache.hadoop.hdfs.DFSInputStream.openInfo(DFSInputStream.java:276)
	at org.apache.hadoop.hdfs.DFSInputStream.<init>(DFSInputStream.java:266)
	at org.apache.hadoop.hdfs.DFSClient.open(DFSClient.java:1038)
	at org.apache.hadoop.hdfs.DistributedFileSystem$3.doCall(DistributedFileSystem.java:271)
	at org.apache.hadoop.hdfs.DistributedFileSystem$3.doCall(DistributedFileSystem.java:268)
	at org.apache.hadoop.fs.FileSystemLinkResolver.resolve(FileSystemLinkResolver.java:81)
	at org.apache.hadoop.hdfs.DistributedFileSystem.open(DistributedFileSystem.java:268)
	at org.apache.hadoop.fs.FileSystem.open(FileSystem.java:777)
	at org.apache.hadoop.metrics2.sink.RollingFileSystemSinkTestBase.readLogData(RollingFileSystemSinkTestBase.java:275)
	at org.apache.hadoop.metrics2.sink.RollingFileSystemSinkTestBase.readLogFile(RollingFileSystemSinkTestBase.java:254)
	at org.apache.hadoop.metrics2.sink.RollingFileSystemSinkTestBase.doWriteTest(RollingFileSystemSinkTestBase.java:225)
	at org.apache.hadoop.metrics2.sink.RollingFileSystemSinkTestBase.doAppendTest(RollingFileSystemSinkTestBase.java:385)
	at org.apache.hadoop.metrics2.sink.TestRollingFileSystemSinkWithHdfs.testSilentAppend(TestRollingFileSystemSinkWithHdfs.java:111)

Running org.apache.hadoop.tools.TestJMXGet
Tests run: 2, Failures: 0, Errors: 0, Skipped: 0, Time elapsed: 5.874 sec - in org.apache.hadoop.tools.TestJMXGet
Running org.apache.hadoop.tools.TestTools
Tests run: 5, Failures: 0, Errors: 0, Skipped: 0, Time elapsed: 1.721 sec - in org.apache.hadoop.tools.TestTools
Running org.apache.hadoop.tools.TestHdfsConfigFields
Tests run: 2, Failures: 0, Errors: 0, Skipped: 0, Time elapsed: 0.718 sec - in org.apache.hadoop.tools.TestHdfsConfigFields
Running org.apache.hadoop.TestRefreshCallQueue
Tests run: 1, Failures: 0, Errors: 0, Skipped: 0, Time elapsed: 4.642 sec - in org.apache.hadoop.TestRefreshCallQueue
Running org.apache.hadoop.net.TestNetworkTopology
Tests run: 10, Failures: 0, Errors: 0, Skipped: 0, Time elapsed: 9.479 sec - in org.apache.hadoop.net.TestNetworkTopology
Running org.apache.hadoop.cli.TestCacheAdminCLI
Tests run: 1, Failures: 0, Errors: 0, Skipped: 0, Time elapsed: 6.937 sec - in org.apache.hadoop.cli.TestCacheAdminCLI
Running org.apache.hadoop.cli.TestCryptoAdminCLI
Tests run: 1, Failures: 0, Errors: 0, Skipped: 0, Time elapsed: 6.978 sec - in org.apache.hadoop.cli.TestCryptoAdminCLI
Running org.apache.hadoop.cli.TestDeleteCLI
Tests run: 1, Failures: 0, Errors: 0, Skipped: 0, Time elapsed: 7.913 sec - in org.apache.hadoop.cli.TestDeleteCLI
Running org.apache.hadoop.cli.TestAclCLI
Tests run: 1, Failures: 0, Errors: 0, Skipped: 0, Time elapsed: 6.97 sec - in org.apache.hadoop.cli.TestAclCLI
Running org.apache.hadoop.cli.TestErasureCodingCLI
Tests run: 1, Failures: 0, Errors: 0, Skipped: 0, Time elapsed: 8.356 sec - in org.apache.hadoop.cli.TestErasureCodingCLI
Running org.apache.hadoop.cli.TestXAttrCLI
Tests run: 1, Failures: 0, Errors: 0, Skipped: 0, Time elapsed: 7.843 sec - in org.apache.hadoop.cli.TestXAttrCLI
Running org.apache.hadoop.cli.TestHDFSCLI
Tests run: 1, Failures: 1, Errors: 0, Skipped: 0, Time elapsed: 56.665 sec <<< FAILURE!
- in org.apache.hadoop.cli.TestHDFSCLI
testAll(org.apache.hadoop.cli.TestHDFSCLI)  Time elapsed: 56.385 sec  <<< FAILURE!
java.lang.AssertionError: One of the tests failed. See the Detailed results to identify the
command that failed
	at org.junit.Assert.fail(Assert.java:88)
	at org.junit.Assert.assertTrue(Assert.java:41)
	at org.apache.hadoop.cli.CLITestHelper.displayResults(CLITestHelper.java:263)
	at org.apache.hadoop.cli.CLITestHelper.tearDown(CLITestHelper.java:125)
	at org.apache.hadoop.cli.TestHDFSCLI.tearDown(TestHDFSCLI.java:87)


Results :

Failed tests: 
  TestEditLog.testBatchedSyncWithClosedLogs:594 logging edit without syncing should do not
affect txid expected:<1> but was:<2>
  TestHDFSCLI.tearDown:87->CLITestHelper.tearDown:125->CLITestHelper.displayResults:263
One of the tests failed. See the Detailed results to identify the command that failed

Tests in error: 
  TestHFlush.testHFlushInterrupted » ClosedByInterrupt
  TestEncryptionZonesWithKMS.setup:59->TestEncryptionZones.setup:159 » SocketTimeout
  TestRollingFileSystemSinkWithHdfs.testAppend:98->RollingFileSystemSinkTestBase.doAppendTest:385->RollingFileSystemSinkTestBase.doWriteTest:225->RollingFileSystemSinkTestBase.readLogFile:254->RollingFileSystemSinkTestBase.readLogData:275
» IO
  TestRollingFileSystemSinkWithHdfs.testSilentAppend:111->RollingFileSystemSinkTestBase.doAppendTest:385->RollingFileSystemSinkTestBase.doWriteTest:225->RollingFileSystemSinkTestBase.readLogFile:254->RollingFileSystemSinkTestBase.readLogData:275
» IO

Tests run: 4347, Failures: 2, Errors: 4, Skipped: 17

[INFO]                                                                         
[INFO] ------------------------------------------------------------------------
[INFO] Skipping Apache Hadoop HDFS Native Client
[INFO] This project has been banned from the build due to previous failures.
[INFO] ------------------------------------------------------------------------
[INFO]                                                                         
[INFO] ------------------------------------------------------------------------
[INFO] Skipping Apache Hadoop HttpFS
[INFO] This project has been banned from the build due to previous failures.
[INFO] ------------------------------------------------------------------------
[INFO]                                                                         
[INFO] ------------------------------------------------------------------------
[INFO] Skipping Apache Hadoop HDFS BookKeeper Journal
[INFO] This project has been banned from the build due to previous failures.
[INFO] ------------------------------------------------------------------------
[INFO]                                                                         
[INFO] ------------------------------------------------------------------------
[INFO] Skipping Apache Hadoop HDFS-NFS
[INFO] This project has been banned from the build due to previous failures.
[INFO] ------------------------------------------------------------------------
[INFO]                                                                         
[INFO] ------------------------------------------------------------------------
[INFO] Building Apache Hadoop HDFS Project 3.0.0-SNAPSHOT
[INFO] ------------------------------------------------------------------------
[INFO] 
[INFO] --- maven-clean-plugin:2.5:clean (default-clean) @ hadoop-hdfs-project ---
[INFO] Deleting <https://builds.apache.org/job/Hadoop-Hdfs-trunk/ws/hadoop-hdfs-project/target>
[INFO] 
[INFO] --- maven-antrun-plugin:1.7:run (create-testdirs) @ hadoop-hdfs-project ---
[INFO] Executing tasks

main:
    [mkdir] Created dir: <https://builds.apache.org/job/Hadoop-Hdfs-trunk/ws/hadoop-hdfs-project/target/test-dir>
[INFO] Executed tasks
[INFO] 
[INFO] --- maven-source-plugin:2.3:jar-no-fork (hadoop-java-sources) @ hadoop-hdfs-project
---
[INFO] 
[INFO] --- maven-source-plugin:2.3:test-jar-no-fork (hadoop-java-sources) @ hadoop-hdfs-project
---
[INFO] 
[INFO] --- maven-enforcer-plugin:1.3.1:enforce (dist-enforce) @ hadoop-hdfs-project ---
[INFO] 
[INFO] --- maven-site-plugin:3.5:attach-descriptor (attach-descriptor) @ hadoop-hdfs-project
---
[INFO] 
[INFO] --- maven-javadoc-plugin:2.8.1:jar (module-javadocs) @ hadoop-hdfs-project ---
[INFO] Skipping javadoc generation
[INFO] 
[INFO] --- maven-enforcer-plugin:1.3.1:enforce (depcheck) @ hadoop-hdfs-project ---
[INFO] 
[INFO] --- maven-checkstyle-plugin:2.15:checkstyle (default-cli) @ hadoop-hdfs-project ---
[INFO] 
[INFO] --- findbugs-maven-plugin:3.0.0:findbugs (default-cli) @ hadoop-hdfs-project ---
[INFO] ------------------------------------------------------------------------
[INFO] Reactor Summary:
[INFO] 
[INFO] Apache Hadoop HDFS Client ......................... SUCCESS [04:29 min]
[INFO] Apache Hadoop HDFS ................................ FAILURE [  03:28 h]
[INFO] Apache Hadoop HDFS Native Client .................. SKIPPED
[INFO] Apache Hadoop HttpFS .............................. SKIPPED
[INFO] Apache Hadoop HDFS BookKeeper Journal ............. SKIPPED
[INFO] Apache Hadoop HDFS-NFS ............................ SKIPPED
[INFO] Apache Hadoop HDFS Project ........................ SUCCESS [  0.063 s]
[INFO] ------------------------------------------------------------------------
[INFO] BUILD FAILURE
[INFO] ------------------------------------------------------------------------
[INFO] Total time: 03:33 h
[INFO] Finished at: 2016-03-29T10:00:26+00:00
[INFO] Final Memory: 56M/799M
[INFO] ------------------------------------------------------------------------
[ERROR] Failed to execute goal org.apache.maven.plugins:maven-surefire-plugin:2.17:test (default-test)
on project hadoop-hdfs: ExecutionException: java.lang.RuntimeException: The forked VM terminated
without properly saying goodbye. VM crash or System.exit called?
[ERROR] Command was /bin/sh -c cd <https://builds.apache.org/job/Hadoop-Hdfs-trunk/ws/hadoop-hdfs-project/hadoop-hdfs>
&& /home/jenkins/tools/java/jdk1.7.0_55/jre/bin/java -Xmx2048m -XX:MaxPermSize=768m
-XX:+HeapDumpOnOutOfMemoryError -jar <https://builds.apache.org/job/Hadoop-Hdfs-trunk/ws/hadoop-hdfs-project/hadoop-hdfs/target/surefire/surefirebooter3810133858351130602.jar>
<https://builds.apache.org/job/Hadoop-Hdfs-trunk/ws/hadoop-hdfs-project/hadoop-hdfs/target/surefire/surefire6682150641363074352tmp>
<https://builds.apache.org/job/Hadoop-Hdfs-trunk/ws/hadoop-hdfs-project/hadoop-hdfs/target/surefire/surefire_5998318069799502094881tmp>
[ERROR] -> [Help 1]
[ERROR] 
[ERROR] To see the full stack trace of the errors, re-run Maven with the -e switch.
[ERROR] Re-run Maven using the -X switch to enable full debug logging.
[ERROR] 
[ERROR] For more information about the errors and possible solutions, please read the following
articles:
[ERROR] [Help 1] http://cwiki.apache.org/confluence/display/MAVEN/MojoFailureException
[ERROR] 
[ERROR] After correcting the problems, you can resume the build with the command
[ERROR]   mvn <goals> -rf :hadoop-hdfs
Build step 'Execute shell' marked build as failure
Archiving artifacts
Recording test results

Mime
View raw message