hadoop-hdfs-dev mailing list archives

Site index · List index
Message view « Date » · « Thread »
Top « Date » · « Thread »
From Apache Jenkins Server <jenk...@builds.apache.org>
Subject Build failed in Jenkins: Hadoop-Hdfs-trunk #2912
Date Tue, 08 Mar 2016 06:16:08 GMT
See <https://builds.apache.org/job/Hadoop-Hdfs-trunk/2912/changes>

Changes:

[aajisaka] HDFS-9812. Streamer threads leak if failure happens when closing

------------------------------------------
[...truncated 5310 lines...]
Running org.apache.hadoop.hdfs.TestParallelRead
Tests run: 4, Failures: 0, Errors: 0, Skipped: 0, Time elapsed: 43.292 sec - in org.apache.hadoop.hdfs.TestParallelRead
Running org.apache.hadoop.hdfs.TestWriteStripedFileWithFailure
Tests run: 1, Failures: 0, Errors: 0, Skipped: 1, Time elapsed: 0.094 sec - in org.apache.hadoop.hdfs.TestWriteStripedFileWithFailure
Running org.apache.hadoop.hdfs.TestPread
Tests run: 7, Failures: 0, Errors: 0, Skipped: 0, Time elapsed: 108.447 sec - in org.apache.hadoop.hdfs.TestPread
Running org.apache.hadoop.hdfs.TestBlocksScheduledCounter
Tests run: 1, Failures: 0, Errors: 0, Skipped: 0, Time elapsed: 5.676 sec - in org.apache.hadoop.hdfs.TestBlocksScheduledCounter
Running org.apache.hadoop.hdfs.TestDFSClientFailover
Tests run: 9, Failures: 0, Errors: 0, Skipped: 0, Time elapsed: 19.714 sec - in org.apache.hadoop.hdfs.TestDFSClientFailover
Running org.apache.hadoop.hdfs.TestLargeBlock
Tests run: 1, Failures: 0, Errors: 0, Skipped: 0, Time elapsed: 18.217 sec - in org.apache.hadoop.hdfs.TestLargeBlock
Running org.apache.hadoop.hdfs.TestDFSClientExcludedNodes
Tests run: 2, Failures: 0, Errors: 0, Skipped: 0, Time elapsed: 18.504 sec - in org.apache.hadoop.hdfs.TestDFSClientExcludedNodes
Running org.apache.hadoop.hdfs.TestFileLengthOnClusterRestart
Tests run: 1, Failures: 0, Errors: 0, Skipped: 0, Time elapsed: 12.187 sec - in org.apache.hadoop.hdfs.TestFileLengthOnClusterRestart
Running org.apache.hadoop.hdfs.tools.offlineEditsViewer.TestOfflineEditsViewer
Tests run: 4, Failures: 0, Errors: 0, Skipped: 0, Time elapsed: 18.104 sec - in org.apache.hadoop.hdfs.tools.offlineEditsViewer.TestOfflineEditsViewer
Running org.apache.hadoop.hdfs.tools.TestStoragePolicyCommands
Tests run: 2, Failures: 0, Errors: 0, Skipped: 0, Time elapsed: 7.117 sec - in org.apache.hadoop.hdfs.tools.TestStoragePolicyCommands
Running org.apache.hadoop.hdfs.tools.TestDelegationTokenFetcher
Tests run: 4, Failures: 0, Errors: 0, Skipped: 0, Time elapsed: 4.474 sec - in org.apache.hadoop.hdfs.tools.TestDelegationTokenFetcher
Running org.apache.hadoop.hdfs.tools.TestDebugAdmin
Tests run: 3, Failures: 0, Errors: 0, Skipped: 0, Time elapsed: 8.176 sec - in org.apache.hadoop.hdfs.tools.TestDebugAdmin
Running org.apache.hadoop.hdfs.tools.TestDFSAdminWithHA
Tests run: 11, Failures: 0, Errors: 0, Skipped: 0, Time elapsed: 28.461 sec - in org.apache.hadoop.hdfs.tools.TestDFSAdminWithHA
Running org.apache.hadoop.hdfs.tools.TestDFSHAAdminMiniCluster
Tests run: 6, Failures: 0, Errors: 0, Skipped: 0, Time elapsed: 10.136 sec - in org.apache.hadoop.hdfs.tools.TestDFSHAAdminMiniCluster
Running org.apache.hadoop.hdfs.tools.offlineImageViewer.TestOfflineImageViewerForXAttr
Tests run: 6, Failures: 0, Errors: 0, Skipped: 0, Time elapsed: 5.622 sec - in org.apache.hadoop.hdfs.tools.offlineImageViewer.TestOfflineImageViewerForXAttr
Running org.apache.hadoop.hdfs.tools.offlineImageViewer.TestOfflineImageViewer
Tests run: 9, Failures: 0, Errors: 0, Skipped: 0, Time elapsed: 7.333 sec - in org.apache.hadoop.hdfs.tools.offlineImageViewer.TestOfflineImageViewer
Running org.apache.hadoop.hdfs.tools.offlineImageViewer.TestOfflineImageViewerForAcl
Tests run: 3, Failures: 0, Errors: 0, Skipped: 0, Time elapsed: 6.21 sec - in org.apache.hadoop.hdfs.tools.offlineImageViewer.TestOfflineImageViewerForAcl
Running org.apache.hadoop.hdfs.tools.offlineImageViewer.TestOfflineImageViewerWithStripedBlocks
Tests run: 7, Failures: 0, Errors: 0, Skipped: 0, Time elapsed: 9.785 sec - in org.apache.hadoop.hdfs.tools.offlineImageViewer.TestOfflineImageViewerWithStripedBlocks
Running org.apache.hadoop.hdfs.tools.offlineImageViewer.TestOfflineImageViewerForContentSummary
Tests run: 6, Failures: 0, Errors: 0, Skipped: 0, Time elapsed: 6.586 sec - in org.apache.hadoop.hdfs.tools.offlineImageViewer.TestOfflineImageViewerForContentSummary
Running org.apache.hadoop.hdfs.tools.TestDFSHAAdmin
Tests run: 20, Failures: 0, Errors: 0, Skipped: 0, Time elapsed: 2.021 sec - in org.apache.hadoop.hdfs.tools.TestDFSHAAdmin
Running org.apache.hadoop.hdfs.tools.TestDFSZKFailoverController
Tests run: 4, Failures: 0, Errors: 0, Skipped: 0, Time elapsed: 17.581 sec - in org.apache.hadoop.hdfs.tools.TestDFSZKFailoverController
Running org.apache.hadoop.hdfs.tools.TestDFSAdmin
Tests run: 5, Failures: 0, Errors: 0, Skipped: 0, Time elapsed: 11.732 sec - in org.apache.hadoop.hdfs.tools.TestDFSAdmin
Running org.apache.hadoop.hdfs.tools.TestGetConf
Tests run: 10, Failures: 0, Errors: 0, Skipped: 0, Time elapsed: 1.583 sec - in org.apache.hadoop.hdfs.tools.TestGetConf
Running org.apache.hadoop.hdfs.tools.TestGetGroups
Tests run: 6, Failures: 0, Errors: 0, Skipped: 0, Time elapsed: 7.279 sec - in org.apache.hadoop.hdfs.tools.TestGetGroups
Running org.apache.hadoop.hdfs.TestDFSInputStream
Tests run: 4, Failures: 0, Errors: 0, Skipped: 0, Time elapsed: 14.538 sec - in org.apache.hadoop.hdfs.TestDFSInputStream
Running org.apache.hadoop.hdfs.TestFetchImage
Tests run: 1, Failures: 0, Errors: 0, Skipped: 0, Time elapsed: 5.23 sec - in org.apache.hadoop.hdfs.TestFetchImage
Running org.apache.hadoop.hdfs.TestRenameWhileOpen
Tests run: 4, Failures: 0, Errors: 0, Skipped: 0, Time elapsed: 53.129 sec - in org.apache.hadoop.hdfs.TestRenameWhileOpen
Running org.apache.hadoop.hdfs.TestDatanodeRegistration
Tests run: 6, Failures: 0, Errors: 0, Skipped: 0, Time elapsed: 15.847 sec - in org.apache.hadoop.hdfs.TestDatanodeRegistration
Running org.apache.hadoop.hdfs.TestSmallBlock
Tests run: 2, Failures: 0, Errors: 0, Skipped: 0, Time elapsed: 6.94 sec - in org.apache.hadoop.hdfs.TestSmallBlock
Running org.apache.hadoop.hdfs.TestDFSClientRetries
Tests run: 12, Failures: 0, Errors: 0, Skipped: 0, Time elapsed: 153.803 sec - in org.apache.hadoop.hdfs.TestDFSClientRetries
Running org.apache.hadoop.hdfs.TestClientReportBadBlock
Tests run: 3, Failures: 0, Errors: 0, Skipped: 0, Time elapsed: 11.391 sec - in org.apache.hadoop.hdfs.TestClientReportBadBlock
Running org.apache.hadoop.hdfs.TestDFSStripedOutputStreamWithFailure180
Tests run: 10, Failures: 0, Errors: 0, Skipped: 0, Time elapsed: 54.948 sec - in org.apache.hadoop.hdfs.TestDFSStripedOutputStreamWithFailure180
Running org.apache.hadoop.hdfs.TestBlockReaderLocalLegacy
Tests run: 3, Failures: 0, Errors: 0, Skipped: 0, Time elapsed: 8.509 sec - in org.apache.hadoop.hdfs.TestBlockReaderLocalLegacy
Running org.apache.hadoop.hdfs.TestBlockMissingException
Tests run: 1, Failures: 0, Errors: 0, Skipped: 0, Time elapsed: 5.621 sec - in org.apache.hadoop.hdfs.TestBlockMissingException
Running org.apache.hadoop.hdfs.TestSafeMode
Tests run: 7, Failures: 0, Errors: 0, Skipped: 0, Time elapsed: 43.712 sec - in org.apache.hadoop.hdfs.TestSafeMode
Running org.apache.hadoop.hdfs.TestDFSStripedOutputStreamWithFailure090
Tests run: 10, Failures: 0, Errors: 0, Skipped: 0, Time elapsed: 50.171 sec - in org.apache.hadoop.hdfs.TestDFSStripedOutputStreamWithFailure090
Running org.apache.hadoop.hdfs.TestDFSStripedOutputStreamWithFailure160
Tests run: 10, Failures: 0, Errors: 0, Skipped: 0, Time elapsed: 54.098 sec - in org.apache.hadoop.hdfs.TestDFSStripedOutputStreamWithFailure160
Running org.apache.hadoop.hdfs.TestReservedRawPaths
Tests run: 8, Failures: 0, Errors: 0, Skipped: 0, Time elapsed: 15.786 sec - in org.apache.hadoop.hdfs.TestReservedRawPaths
Running org.apache.hadoop.hdfs.TestFSInputChecker
Tests run: 1, Failures: 0, Errors: 0, Skipped: 0, Time elapsed: 5.718 sec - in org.apache.hadoop.hdfs.TestFSInputChecker
Running org.apache.hadoop.hdfs.TestReplaceDatanodeOnFailure
Tests run: 4, Failures: 0, Errors: 0, Skipped: 0, Time elapsed: 12.599 sec - in org.apache.hadoop.hdfs.TestReplaceDatanodeOnFailure
Running org.apache.hadoop.hdfs.security.TestDelegationToken
Tests run: 7, Failures: 0, Errors: 0, Skipped: 0, Time elapsed: 34.841 sec - in org.apache.hadoop.hdfs.security.TestDelegationToken
Running org.apache.hadoop.hdfs.security.token.block.TestBlockToken
Tests run: 6, Failures: 0, Errors: 0, Skipped: 0, Time elapsed: 8.737 sec - in org.apache.hadoop.hdfs.security.token.block.TestBlockToken
Running org.apache.hadoop.hdfs.security.TestClientProtocolWithDelegationToken
Tests run: 1, Failures: 0, Errors: 0, Skipped: 0, Time elapsed: 1.93 sec - in org.apache.hadoop.hdfs.security.TestClientProtocolWithDelegationToken
Running org.apache.hadoop.hdfs.security.TestDelegationTokenForProxyUser
Tests run: 2, Failures: 0, Errors: 0, Skipped: 0, Time elapsed: 6.963 sec - in org.apache.hadoop.hdfs.security.TestDelegationTokenForProxyUser
Running org.apache.hadoop.hdfs.TestFileStatus
Tests run: 5, Failures: 0, Errors: 0, Skipped: 0, Time elapsed: 5.19 sec - in org.apache.hadoop.hdfs.TestFileStatus
Running org.apache.hadoop.hdfs.TestFileAppend3
Tests run: 15, Failures: 0, Errors: 0, Skipped: 0, Time elapsed: 64.502 sec - in org.apache.hadoop.hdfs.TestFileAppend3
Running org.apache.hadoop.hdfs.protocolPB.TestPBHelper
Tests run: 30, Failures: 0, Errors: 0, Skipped: 0, Time elapsed: 0.706 sec - in org.apache.hadoop.hdfs.protocolPB.TestPBHelper
Running org.apache.hadoop.hdfs.TestReadStripedFileWithMissingBlocks
Tests run: 1, Failures: 0, Errors: 0, Skipped: 0, Time elapsed: 46.56 sec - in org.apache.hadoop.hdfs.TestReadStripedFileWithMissingBlocks
Running org.apache.hadoop.hdfs.TestDFSStripedOutputStreamWithFailure150
Tests run: 10, Failures: 0, Errors: 0, Skipped: 0, Time elapsed: 51.84 sec - in org.apache.hadoop.hdfs.TestDFSStripedOutputStreamWithFailure150
Running org.apache.hadoop.hdfs.TestExternalBlockReader
Tests run: 2, Failures: 0, Errors: 0, Skipped: 0, Time elapsed: 6.824 sec - in org.apache.hadoop.hdfs.TestExternalBlockReader
Running org.apache.hadoop.hdfs.TestDFSStripedOutputStreamWithFailure000
Tests run: 10, Failures: 0, Errors: 0, Skipped: 0, Time elapsed: 0.316 sec - in org.apache.hadoop.hdfs.TestDFSStripedOutputStreamWithFailure000
Running org.apache.hadoop.hdfs.web.TestFSMainOperationsWebHdfs
Tests run: 52, Failures: 0, Errors: 0, Skipped: 0, Time elapsed: 10.692 sec - in org.apache.hadoop.hdfs.web.TestFSMainOperationsWebHdfs
Running org.apache.hadoop.hdfs.web.TestAuthFilter
Tests run: 4, Failures: 0, Errors: 0, Skipped: 0, Time elapsed: 0.844 sec - in org.apache.hadoop.hdfs.web.TestAuthFilter
Running org.apache.hadoop.hdfs.web.TestHttpsFileSystem
Tests run: 1, Failures: 0, Errors: 0, Skipped: 0, Time elapsed: 7.878 sec - in org.apache.hadoop.hdfs.web.TestHttpsFileSystem
Running org.apache.hadoop.hdfs.web.TestWebHdfsUrl
Tests run: 6, Failures: 0, Errors: 0, Skipped: 0, Time elapsed: 2.386 sec - in org.apache.hadoop.hdfs.web.TestWebHdfsUrl
Running org.apache.hadoop.hdfs.web.TestWebHdfsFileSystemContract
Tests run: 52, Failures: 0, Errors: 0, Skipped: 0, Time elapsed: 50.935 sec - in org.apache.hadoop.hdfs.web.TestWebHdfsFileSystemContract
Running org.apache.hadoop.hdfs.web.TestWebHdfsWithAuthenticationFilter
Tests run: 1, Failures: 0, Errors: 0, Skipped: 0, Time elapsed: 6.352 sec - in org.apache.hadoop.hdfs.web.TestWebHdfsWithAuthenticationFilter
Running org.apache.hadoop.hdfs.web.TestWebHDFSForHA
Tests run: 6, Failures: 0, Errors: 0, Skipped: 0, Time elapsed: 18.897 sec - in org.apache.hadoop.hdfs.web.TestWebHDFSForHA
Running org.apache.hadoop.hdfs.web.TestJsonUtil
Tests run: 8, Failures: 0, Errors: 0, Skipped: 0, Time elapsed: 0.631 sec - in org.apache.hadoop.hdfs.web.TestJsonUtil
Running org.apache.hadoop.hdfs.web.TestWebHDFSXAttr
Tests run: 12, Failures: 0, Errors: 0, Skipped: 0, Time elapsed: 21.66 sec - in org.apache.hadoop.hdfs.web.TestWebHDFSXAttr
Running org.apache.hadoop.hdfs.web.TestWebHdfsTimeouts
Tests run: 16, Failures: 0, Errors: 0, Skipped: 0, Time elapsed: 2.333 sec - in org.apache.hadoop.hdfs.web.TestWebHdfsTimeouts
Running org.apache.hadoop.hdfs.web.TestWebHDFSAcl
Tests run: 64, Failures: 0, Errors: 0, Skipped: 1, Time elapsed: 32.064 sec - in org.apache.hadoop.hdfs.web.TestWebHDFSAcl
Running org.apache.hadoop.hdfs.web.TestWebHdfsTokens
Tests run: 11, Failures: 0, Errors: 0, Skipped: 0, Time elapsed: 11.49 sec - in org.apache.hadoop.hdfs.web.TestWebHdfsTokens
Running org.apache.hadoop.hdfs.web.TestWebHDFS
Tests run: 19, Failures: 0, Errors: 0, Skipped: 0, Time elapsed: 135.136 sec - in org.apache.hadoop.hdfs.web.TestWebHDFS
Running org.apache.hadoop.hdfs.web.TestWebHdfsWithRestCsrfPreventionFilter
Tests run: 32, Failures: 0, Errors: 0, Skipped: 0, Time elapsed: 62.696 sec - in org.apache.hadoop.hdfs.web.TestWebHdfsWithRestCsrfPreventionFilter
Running org.apache.hadoop.hdfs.web.resources.TestParam
Tests run: 29, Failures: 0, Errors: 0, Skipped: 0, Time elapsed: 0.721 sec - in org.apache.hadoop.hdfs.web.resources.TestParam
Running org.apache.hadoop.hdfs.web.TestWebHdfsWithMultipleNameNodes
Tests run: 1, Failures: 0, Errors: 0, Skipped: 0, Time elapsed: 12.381 sec - in org.apache.hadoop.hdfs.web.TestWebHdfsWithMultipleNameNodes
Running org.apache.hadoop.hdfs.TestReadStripedFileWithDecoding
Tests run: 5, Failures: 0, Errors: 0, Skipped: 0, Time elapsed: 141.564 sec - in org.apache.hadoop.hdfs.TestReadStripedFileWithDecoding
Running org.apache.hadoop.hdfs.TestAppendSnapshotTruncate

Results :

Failed tests: 
  TestNNHandlesBlockReportPerStorage>BlockReportTestBase.shutDownCluster:122 Test resulted
in an unexpected exit
  TestNNHandlesBlockReportPerStorage>BlockReportTestBase.blockReport_03:355 Wrong number
of corrupt blocks
Expected: is <1L>
     but: was <0L>
  TestNNHandlesBlockReportPerStorage>BlockReportTestBase.shutDownCluster:122 Test resulted
in an unexpected exit
  TestNNHandlesBlockReportPerStorage>BlockReportTestBase.shutDownCluster:122 Test resulted
in an unexpected exit
  TestNNHandlesBlockReportPerStorage>BlockReportTestBase.shutDownCluster:122 Test resulted
in an unexpected exit
  TestNNHandlesBlockReportPerStorage>BlockReportTestBase.shutDownCluster:122 Test resulted
in an unexpected exit
  TestNNHandlesBlockReportPerStorage>BlockReportTestBase.shutDownCluster:122 Test resulted
in an unexpected exit

Tests in error: 
  TestNNHandlesBlockReportPerStorage>BlockReportTestBase.testOneReplicaRbwReportArrivesAfterBlockCompleted:645
» NoClassDefFound
  TestNNHandlesBlockReportPerStorage>BlockReportTestBase.shutDownCluster:122 » NoClassDefFound
  TestNNHandlesBlockReportPerStorage.blockReport_01 » IO java.lang.NoClassDefFou...
  TestNNHandlesBlockReportPerStorage.blockReport_02 » IO java.lang.NoClassDefFou...
  TestNNHandlesBlockReportPerStorage>BlockReportTestBase.shutDownCluster:122 » NoClassDefFound
  TestNNHandlesBlockReportPerStorage.blockReport_04 » IO java.lang.NoClassDefFou...
  TestNNHandlesBlockReportPerStorage>BlockReportTestBase.shutDownCluster:122 » NoClassDefFound
  TestNNHandlesBlockReportPerStorage>BlockReportTestBase.blockReport_06:412->BlockReportTestBase.startDNandWait:741
» Timeout
  TestNNHandlesBlockReportPerStorage>BlockReportTestBase.blockReport_07:447->BlockReportTestBase.startDNandWait:741
» Timeout
  TestNNHandlesBlockReportPerStorage>BlockReportTestBase.blockReport_08:500->BlockReportTestBase.shutDownCluster:122
» NoClassDefFound
  TestNNHandlesBlockReportPerStorage>BlockReportTestBase.blockReport_09:542->BlockReportTestBase.shutDownCluster:122
» NoClassDefFound

Tests run: 3431, Failures: 7, Errors: 11, Skipped: 13

[INFO]                                                                         
[INFO] ------------------------------------------------------------------------
[INFO] Skipping Apache Hadoop HDFS Native Client
[INFO] This project has been banned from the build due to previous failures.
[INFO] ------------------------------------------------------------------------
[INFO]                                                                         
[INFO] ------------------------------------------------------------------------
[INFO] Skipping Apache Hadoop HttpFS
[INFO] This project has been banned from the build due to previous failures.
[INFO] ------------------------------------------------------------------------
[INFO]                                                                         
[INFO] ------------------------------------------------------------------------
[INFO] Skipping Apache Hadoop HDFS BookKeeper Journal
[INFO] This project has been banned from the build due to previous failures.
[INFO] ------------------------------------------------------------------------
[INFO]                                                                         
[INFO] ------------------------------------------------------------------------
[INFO] Skipping Apache Hadoop HDFS-NFS
[INFO] This project has been banned from the build due to previous failures.
[INFO] ------------------------------------------------------------------------
[INFO]                                                                         
[INFO] ------------------------------------------------------------------------
[INFO] Building Apache Hadoop HDFS Project 3.0.0-SNAPSHOT
[INFO] ------------------------------------------------------------------------
[INFO] 
[INFO] --- maven-clean-plugin:2.5:clean (default-clean) @ hadoop-hdfs-project ---
[INFO] Deleting <https://builds.apache.org/job/Hadoop-Hdfs-trunk/ws/hadoop-hdfs-project/target>
[INFO] 
[INFO] --- maven-antrun-plugin:1.7:run (create-testdirs) @ hadoop-hdfs-project ---
[INFO] Executing tasks

main:
    [mkdir] Created dir: <https://builds.apache.org/job/Hadoop-Hdfs-trunk/ws/hadoop-hdfs-project/target/test-dir>
[INFO] Executed tasks
[INFO] 
[INFO] --- maven-source-plugin:2.3:jar-no-fork (hadoop-java-sources) @ hadoop-hdfs-project
---
[INFO] 
[INFO] --- maven-source-plugin:2.3:test-jar-no-fork (hadoop-java-sources) @ hadoop-hdfs-project
---
[INFO] 
[INFO] --- maven-enforcer-plugin:1.3.1:enforce (dist-enforce) @ hadoop-hdfs-project ---
[INFO] 
[INFO] --- maven-site-plugin:3.5:attach-descriptor (attach-descriptor) @ hadoop-hdfs-project
---
[INFO] 
[INFO] --- maven-javadoc-plugin:2.8.1:jar (module-javadocs) @ hadoop-hdfs-project ---
[INFO] Skipping javadoc generation
[INFO] 
[INFO] --- maven-enforcer-plugin:1.3.1:enforce (depcheck) @ hadoop-hdfs-project ---
[INFO] 
[INFO] --- maven-checkstyle-plugin:2.15:checkstyle (default-cli) @ hadoop-hdfs-project ---
[INFO] 
[INFO] --- findbugs-maven-plugin:3.0.0:findbugs (default-cli) @ hadoop-hdfs-project ---
[INFO] ------------------------------------------------------------------------
[INFO] Reactor Summary:
[INFO] 
[INFO] Apache Hadoop HDFS Client ......................... SUCCESS [04:00 min]
[INFO] Apache Hadoop HDFS ................................ FAILURE [  02:54 h]
[INFO] Apache Hadoop HDFS Native Client .................. SKIPPED
[INFO] Apache Hadoop HttpFS .............................. SKIPPED
[INFO] Apache Hadoop HDFS BookKeeper Journal ............. SKIPPED
[INFO] Apache Hadoop HDFS-NFS ............................ SKIPPED
[INFO] Apache Hadoop HDFS Project ........................ SUCCESS [  0.076 s]
[INFO] ------------------------------------------------------------------------
[INFO] BUILD FAILURE
[INFO] ------------------------------------------------------------------------
[INFO] Total time: 02:58 h
[INFO] Finished at: 2016-03-08T06:15:48+00:00
[INFO] Final Memory: 70M/850M
[INFO] ------------------------------------------------------------------------
[ERROR] Failed to execute goal org.apache.maven.plugins:maven-surefire-plugin:2.17:test (default-test)
on project hadoop-hdfs: ExecutionException: java.lang.RuntimeException: The forked VM terminated
without properly saying goodbye. VM crash or System.exit called?
[ERROR] Command was /bin/sh -c cd <https://builds.apache.org/job/Hadoop-Hdfs-trunk/ws/hadoop-hdfs-project/hadoop-hdfs>
&& /home/jenkins/tools/java/jdk1.7.0_55/jre/bin/java -Xmx2048m -XX:MaxPermSize=768m
-XX:+HeapDumpOnOutOfMemoryError -jar <https://builds.apache.org/job/Hadoop-Hdfs-trunk/ws/hadoop-hdfs-project/hadoop-hdfs/target/surefire/surefirebooter2400437042525715644.jar>
<https://builds.apache.org/job/Hadoop-Hdfs-trunk/ws/hadoop-hdfs-project/hadoop-hdfs/target/surefire/surefire7869029323173461253tmp>
<https://builds.apache.org/job/Hadoop-Hdfs-trunk/ws/hadoop-hdfs-project/hadoop-hdfs/target/surefire/surefire_3245734318417085566141tmp>
[ERROR] -> [Help 1]
[ERROR] 
[ERROR] To see the full stack trace of the errors, re-run Maven with the -e switch.
[ERROR] Re-run Maven using the -X switch to enable full debug logging.
[ERROR] 
[ERROR] For more information about the errors and possible solutions, please read the following
articles:
[ERROR] [Help 1] http://cwiki.apache.org/confluence/display/MAVEN/MojoFailureException
[ERROR] 
[ERROR] After correcting the problems, you can resume the build with the command
[ERROR]   mvn <goals> -rf :hadoop-hdfs
Build step 'Execute shell' marked build as failure
Archiving artifacts
Recording test results

Mime
View raw message