hadoop-hdfs-dev mailing list archives

Site index · List index
Message view « Date » · « Thread »
Top « Date » · « Thread »
From Apache Jenkins Server <jenk...@builds.apache.org>
Subject Hadoop-Hdfs-trunk-Java8 - Build # 988 - Still Failing
Date Fri, 11 Mar 2016 00:17:35 GMT
See https://builds.apache.org/job/Hadoop-Hdfs-trunk-Java8/988/

###################################################################################
########################## LAST 60 LINES OF THE CONSOLE ###########################
[...truncated 9958 lines...]
[INFO] 
[INFO] --- maven-antrun-plugin:1.7:run (create-testdirs) @ hadoop-hdfs-project ---
[INFO] Executing tasks

main:
    [mkdir] Created dir: /home/jenkins/jenkins-slave/workspace/Hadoop-Hdfs-trunk-Java8/hadoop-hdfs-project/target/test-dir
[INFO] Executed tasks
[INFO] 
[INFO] --- maven-source-plugin:2.3:jar-no-fork (hadoop-java-sources) @ hadoop-hdfs-project
---
[INFO] 
[INFO] --- maven-source-plugin:2.3:test-jar-no-fork (hadoop-java-sources) @ hadoop-hdfs-project
---
[INFO] 
[INFO] --- maven-enforcer-plugin:1.3.1:enforce (dist-enforce) @ hadoop-hdfs-project ---
[INFO] 
[INFO] --- maven-site-plugin:3.5:attach-descriptor (attach-descriptor) @ hadoop-hdfs-project
---
[INFO] 
[INFO] --- maven-javadoc-plugin:2.8.1:jar (module-javadocs) @ hadoop-hdfs-project ---
[INFO] Not executing Javadoc as the project is not a Java classpath-capable package
[INFO] 
[INFO] --- maven-enforcer-plugin:1.3.1:enforce (depcheck) @ hadoop-hdfs-project ---
[INFO] 
[INFO] --- maven-checkstyle-plugin:2.15:checkstyle (default-cli) @ hadoop-hdfs-project ---
[INFO] 
[INFO] --- findbugs-maven-plugin:3.0.0:findbugs (default-cli) @ hadoop-hdfs-project ---
[INFO] ------------------------------------------------------------------------
[INFO] Reactor Summary:
[INFO] 
[INFO] Apache Hadoop HDFS Client ......................... SUCCESS [04:09 min]
[INFO] Apache Hadoop HDFS ................................ SUCCESS [  03:37 h]
[INFO] Apache Hadoop HDFS Native Client .................. SUCCESS [ 26.302 s]
[INFO] Apache Hadoop HttpFS .............................. FAILURE [04:11 min]
[INFO] Apache Hadoop HDFS BookKeeper Journal ............. FAILURE [04:15 min]
[INFO] Apache Hadoop HDFS-NFS ............................ FAILURE [01:32 min]
[INFO] Apache Hadoop HDFS Project ........................ SUCCESS [  0.035 s]
[INFO] ------------------------------------------------------------------------
[INFO] BUILD FAILURE
[INFO] ------------------------------------------------------------------------
[INFO] Total time: 03:51 h
[INFO] Finished at: 2016-03-11T00:16:23+00:00
[INFO] Final Memory: 106M/1205M
[INFO] ------------------------------------------------------------------------
[ERROR] Failed to execute goal org.apache.maven.plugins:maven-assembly-plugin:2.4:single (dist)
on project hadoop-hdfs-httpfs: Error reading assemblies: Descriptor with ID 'hadoop-httpfs-dist'
not found -> [Help 1]
[ERROR] Failed to execute goal org.apache.maven.plugins:maven-checkstyle-plugin:2.15:checkstyle
(default-cli) on project hadoop-hdfs-bkjournal: An error has occurred in Checkstyle report
generation. Failed during checkstyle execution: Unable to find configuration file at location:
checkstyle/checkstyle.xml: Could not find resource 'checkstyle/checkstyle.xml'. -> [Help
1]
[ERROR] Failed to execute goal org.apache.maven.plugins:maven-checkstyle-plugin:2.15:checkstyle
(default-cli) on project hadoop-hdfs-nfs: An error has occurred in Checkstyle report generation.
Failed during checkstyle execution: Unable to find configuration file at location: checkstyle/checkstyle.xml:
Could not find resource 'checkstyle/checkstyle.xml'. -> [Help 1]
[ERROR] 
[ERROR] To see the full stack trace of the errors, re-run Maven with the -e switch.
[ERROR] Re-run Maven using the -X switch to enable full debug logging.
[ERROR] 
[ERROR] For more information about the errors and possible solutions, please read the following
articles:
[ERROR] [Help 1] http://cwiki.apache.org/confluence/display/MAVEN/MojoExecutionException
[ERROR] 
[ERROR] After correcting the problems, you can resume the build with the command
[ERROR]   mvn <goals> -rf :hadoop-hdfs-httpfs
Build step 'Execute shell' marked build as failure
Archiving artifacts
Recording test results
Sending e-mails to: hdfs-dev@hadoop.apache.org
Email was triggered for: Failure - Any
Sending email for trigger: Failure - Any



###################################################################################
############################## FAILED TESTS (if any) ##############################
All tests passed
Mime
  • Unnamed multipart/mixed (inline, None, 0 bytes)
View raw message