hadoop-hdfs-dev mailing list archives

Site index · List index
Message view « Date » · « Thread »
Top « Date » · « Thread »
From Apache Jenkins Server <jenk...@builds.apache.org>
Subject Build failed in Jenkins: Hadoop-Hdfs-trunk #2921
Date Fri, 11 Mar 2016 08:46:09 GMT
See <https://builds.apache.org/job/Hadoop-Hdfs-trunk/2921/changes>

Changes:

[arp] HDFS-1477. Support reconfiguring dfs.heartbeat.interval and

------------------------------------------
[...truncated 37217 lines...]
  TestFileAppend3.setUp:79 » IO Failed on local exception: java.io.IOException: ...
  TestClientReportBadBlock.startUpCluster:76 » IO Failed on local exception: jav...
  TestClientReportBadBlock.startUpCluster:76 » IO Failed on local exception: jav...
  TestClientReportBadBlock.startUpCluster:76 » IO Failed on local exception: jav...
  TestReadStripedFileWithDecoding.setup:97 » IO Failed on local exception: java....
  TestReadStripedFileWithDecoding.setup:97 » IO Failed on local exception: java....
  TestReadStripedFileWithDecoding.setup:97 » IO Failed on local exception: java....
  TestReadStripedFileWithDecoding.setup:97 » IO Failed on local exception: java....
  TestReadStripedFileWithDecoding.setup:97 » IO Failed on local exception: java....
  TestParallelShortCircuitReadNoChecksum.setupCluster:47->TestParallelReadUtil.setupCluster:70
» IO
  TestParallelShortCircuitReadNoChecksum.teardownCluster:59->TestParallelReadUtil.teardownCluster:393
» NullPointer
  TestFileCreation.testConcurrentFileCreation:892 » IO Failed on local exception...
  TestFileCreation.testFileCreationWithOverwrite:1221 » IO Failed on local excep...
  TestFileCreation.testFileCreationUsingHostname:189->checkFileCreation:230 » IO
  TestFileCreation.testFileCreationSimulated:882->testFileCreation:182->checkFileCreation:230
» IO
  TestFileCreation.testFsClose:1024 » IO Failed on local exception: java.io.IOEx...
  TestFileCreation.testLeaseExpireHardLimit:969 » IO Failed on local exception: ...
  TestFileCreation.testFileCreationNamenodeRestart:614 » IO Failed on local exce...
  TestFileCreation.testFileIdMismatch:1188 » IO Failed on local exception: java....
  TestFileCreation.testFileCreationSyncOnClose:926 » IO Failed on local exceptio...
  TestFileCreation.testServerDefaults:162 » IO Failed on local exception: java.i...
  TestFileCreation.testOverwriteOpenForWrite:378 » IO Failed on local exception:...
  TestFileCreation.testFileCreationNonRecursive:791 » IO Failed on local excepti...
  TestFileCreation.testDFSClientDeath:755 » IO Failed on local exception: java.i...
  TestFileCreation.testDeleteOnExit:314 » IO Failed on local exception: java.io....
  TestFileCreation.testFileCreationError1:438 » IO Failed on local exception: ja...
  TestFileCreation.testFileCreationError2:513 » IO Failed on local exception: ja...
  TestFileCreation.testFileCreationError3:573 » IO Failed on local exception: ja...
  TestFileCreation.testFileCreationSetLocalInterface:198->checkFileCreation:230 » IO
  TestFileCreation.testCreateNonCanonicalPathAndRestartFromUri:1121->doCreateTest:1131
» IO
  TestFileCreation.testCreateNonCanonicalPathAndRestartFromString:1111->doCreateTest:1131
» IO
  TestFileCreation.testFileCreation:182->checkFileCreation:230 » IO Failed on lo...
  TestFileCreation.testCreateNonCanonicalPathAndRestartRpc:1101->doCreateTest:1131 » IO
  TestDFSRemove.testRemove:60 » IO Failed on local exception: java.io.IOExceptio...
  TestDFSClientSocketSize.testAutoTuningSendBufferSize:70->createSocket:90 » IO ...
  TestDFSClientSocketSize.testDefaultSendBufferSize:52->createSocket:90 » IO Fai...
  TestDFSClientSocketSize.testSpecifiedSendBufferSize:62->createSocket:90 » IO F...
  TestHdfsAdmin.setUpCluster:43 » IO Failed on local exception: java.io.IOExcept...
  TestHdfsAdmin.setUpCluster:43 » IO Failed on local exception: java.io.IOExcept...
  TestErasureCodeBenchmarkThroughput.setup:51 » IO Failed on local exception: ja...
  TestWriteBlockGetsBlockLengthHint.blockLengthHintIsPropagated:52 » IO Failed o...
  TestDataTransferKeepalive.setup:65 » IO Failed on local exception: java.io.IOE...
  TestDataTransferKeepalive.setup:65 » IO Failed on local exception: java.io.IOE...
  TestDataTransferKeepalive.setup:65 » IO Failed on local exception: java.io.IOE...
  TestDataTransferKeepalive.setup:65 » IO Failed on local exception: java.io.IOE...
  TestLease.testLeaseAfterRename:166 » IO Failed on local exception: java.io.IOE...
  TestLease.testLeaseAfterRenameAndRecreate:263 » IO Failed on local exception: ...
  TestLease.testLease:301 » IO Failed on local exception: java.io.IOException: C...
  TestLease.testLeaseAbort:77 » IO Failed on local exception: java.io.IOExceptio...
  TestDFSStripedOutputStreamWithFailure.testAddBlockWhenNoSufficientDataBlockNumOfNodes:254->setup:186
» IO
  TestDFSStripedOutputStreamWithFailure.testAddBlockWhenNoSufficientParityNumOfNodes:292->setup:186
» IO
  TestDFSStripedOutputStreamWithFailure.testBlockTokenExpired:237->setup:186 » IO
  TestDFSStripedOutputStreamWithFailure.testMultipleDatanodeFailure56:211->runTestWithMultipleFailure:341->setup:186
» IO
  TestEncryptionZonesWithKMS.setup:56->TestEncryptionZones.setup:150 » IO Failed...
  TestEncryptionZonesWithKMS.setup:56->TestEncryptionZones.setup:150 » IO Failed...
  TestEncryptionZonesWithKMS.setup:56->TestEncryptionZones.setup:150 » IO Failed...
  TestEncryptionZonesWithKMS.setup:56->TestEncryptionZones.setup:150 » IO Failed...
  TestEncryptionZonesWithKMS.setup:56->TestEncryptionZones.setup:150 » IO Failed...
  TestEncryptionZonesWithKMS.setup:56->TestEncryptionZones.setup:150 » IO Failed...
  TestEncryptionZonesWithKMS.setup:56->TestEncryptionZones.setup:150 » IO Failed...
  TestEncryptionZonesWithKMS.setup:56->TestEncryptionZones.setup:150 » IO Failed...
  TestEncryptionZonesWithKMS.setup:56->TestEncryptionZones.setup:150 » IO Failed...
  TestEncryptionZonesWithKMS.setup:56->TestEncryptionZones.setup:150 » IO Failed...
  TestEncryptionZonesWithKMS.setup:56->TestEncryptionZones.setup:150 » IO Failed...
  TestEncryptionZonesWithKMS.setup:56->TestEncryptionZones.setup:150 » IO Failed...
  TestEncryptionZonesWithKMS.setup:56->TestEncryptionZones.setup:150 » IO Failed...
  TestEncryptionZonesWithKMS.setup:56->TestEncryptionZones.setup:150 » IO Failed...
  TestEncryptionZonesWithKMS.setup:56->TestEncryptionZones.setup:150 » IO Failed...
  TestEncryptionZonesWithKMS.setup:56->TestEncryptionZones.setup:150 » IO Failed...
  TestEncryptionZonesWithKMS.setup:56->TestEncryptionZones.setup:150 » IO Failed...
  TestEncryptionZonesWithKMS.setup:56->TestEncryptionZones.setup:150 » IO Failed...
  TestEncryptionZonesWithKMS.setup:56->TestEncryptionZones.setup:150 » IO Failed...
  TestEncryptionZonesWithKMS.setup:56->TestEncryptionZones.setup:150 » IO Failed...
  TestEncryptionZonesWithKMS.setup:56->TestEncryptionZones.setup:150 » IO Failed...
  TestEncryptionZonesWithKMS.setup:56->TestEncryptionZones.setup:150 » IO Failed...
  TestEncryptionZonesWithKMS.setup:56->TestEncryptionZones.setup:150 » IO Failed...
  TestEncryptionZonesWithKMS.setup:56->TestEncryptionZones.setup:150 » IO Failed...
  TestReconstructStripedFile.setup:94 » IO Failed on local exception: java.io.IO...
  TestReconstructStripedFile.setup:94 » IO Failed on local exception: java.io.IO...
  TestReconstructStripedFile.setup:94 » IO Failed on local exception: java.io.IO...
  TestReconstructStripedFile.setup:94 » IO Failed on local exception: java.io.IO...
  TestReconstructStripedFile.setup:94 » IO Failed on local exception: java.io.IO...
  TestReconstructStripedFile.setup:94 » IO Failed on local exception: java.io.IO...
  TestReconstructStripedFile.setup:94 » IO Failed on local exception: java.io.IO...
  TestReconstructStripedFile.setup:94 » IO Failed on local exception: java.io.IO...
  TestReconstructStripedFile.setup:94 » IO Failed on local exception: java.io.IO...
  TestReconstructStripedFile.setup:94 » IO Failed on local exception: java.io.IO...
  TestReconstructStripedFile.setup:94 » IO Failed on local exception: java.io.IO...
  TestReconstructStripedFile.setup:94 » IO Failed on local exception: java.io.IO...
  TestReconstructStripedFile.setup:94 » IO Failed on local exception: java.io.IO...
  TestAbandonBlock.setUp:52 » IO Failed on local exception: java.io.IOException:...
  TestAbandonBlock.setUp:52 » IO Failed on local exception: java.io.IOException:...
  TestExternalBlockReader.testMisconfiguredExternalBlockReader:53 » IO Failed on...
  TestExternalBlockReader.testExternalBlockReader:273 » IO Failed on local excep...
  TestFileCreationClient.testClientTriggeredLeaseRecovery:56 » IO Failed on loca...
  TestFileCreationDelete.testFileCreationDeleteParent:44 » IO Failed on local ex...
  TestTraceAdmin.testCreateAndDestroySpanReceiver:67 » IO Failed on local except...
  TestTracing.startCluster:215 » IO Failed on local exception: java.io.IOExcepti...
  TestTracingShortCircuitLocalRead.testShortCircuitTraceHooks:81 » IO Failed on ...
  TestNetworkTopology.testInvalidNetworkTopologiesNotCachedInHdfs:321 » IO Faile...
  TestGenericRefresh.setUpBeforeClass:60 » IO Failed on local exception: java.io...
  TestJMXGet.testDataNode:154 » IO Failed on local exception: java.io.IOExceptio...
  TestJMXGet.testNameNode:96 » IO Failed on local exception: java.io.IOException...
  TestErasureCodingCLI.setUp:48 » IO Failed on local exception: java.io.IOExcept...
  TestErasureCodingCLI.tearDown:75->CLITestHelper.tearDown:125->CLITestHelper.displayResults:162->expandCommand:81
» NullPointer
  TestHDFSCLI.setUp:56 » IO Failed on local exception: java.io.IOException: Coul...
  TestHDFSCLI.tearDown:87->CLITestHelper.tearDown:125->CLITestHelper.displayResults:162->expandCommand:93
» NullPointer
  TestCryptoAdminCLI.setUp:72 » IO Failed on local exception: java.io.IOExceptio...
  TestCryptoAdminCLI.tearDown:96->CLITestHelper.tearDown:125->CLITestHelper.displayResults:162->expandCommand:117
» NullPointer
  TestAclCLI.setUp:40 » IO Failed on local exception: java.io.IOException: Could...
  TestAclCLI.tearDown:49->CLITestHelper.tearDown:125->CLITestHelper.displayResults:162->expandCommand:68
» NullPointer
  TestDeleteCLI.setUp:47 » IO Failed on local exception: java.io.IOException: Co...
  TestDeleteCLI.tearDown:68->CLITestHelper.tearDown:125->CLITestHelper.displayResults:162->expandCommand:79
» NullPointer
  TestXAttrCLI.setUp:49 » IO Failed on local exception: java.io.IOException: Cou...
  TestXAttrCLI.tearDown:77->CLITestHelper.tearDown:125->CLITestHelper.displayResults:162->expandCommand:83
» NullPointer
  TestCacheAdminCLI.setUp:63 » IO Failed on local exception: java.io.IOException...
  TestRefreshCallQueue.setUp:71 » IO Failed on local exception: java.io.IOExcept...
  TestWebHdfsFileContextMainOperations.clusterSetupAtBeginning:77 » IO Failed on...
  TestFcHdfsSetUMask.clusterSetupAtBegining:90 » IO Failed on local exception: j...
  TestHDFSContractConcat.createCluster:36 » IO Failed on local exception: java.i...
  TestHDFSContractRootDirectory.createCluster:37 » IO Failed on local exception:...
  TestHDFSContractRename.createCluster:33 » IO Failed on local exception: java.i...
  TestHDFSContractSetTimes.createCluster:33 » IO Failed on local exception: java...
  TestHDFSContractOpen.createCluster:36 » IO Failed on local exception: java.io....
  TestHDFSContractAppend.createCluster:29 » IO Failed on local exception: java.i...
  TestHDFSContractCreate.createCluster:33 » IO Failed on local exception: java.i...
  TestHDFSContractGetFileStatus.createCluster:34 » IO Failed on local exception:...
  TestHDFSContractSeek.createCluster:36 » IO Failed on local exception: java.io....
  TestHDFSContractDelete.createCluster:36 » IO Failed on local exception: java.i...
  TestHDFSContractMkdir.createCluster:36 » IO Failed on local exception: java.io...
  TestResolveHdfsSymlink.setUp:61 » IO Failed on local exception: java.io.IOExce...
  TestSymlinkHdfsDisable.testSymlinkHdfsDisable:41 » IO Failed on local exceptio...
  TestStickyBit.init:68->initCluster:72 » IO Failed on local exception: java.io....
  TestUrlStreamHandler.testDfsUrls:56 » IO Failed on local exception: java.io.IO...
  TestLoadGenerator.testLoadGenerator:152 » IO Failed on local exception: java.i...
  TestViewFsWithXAttrs.clusterSetupAtBeginning:61 » IO Failed on local exception...
  TestViewFsDefaultValue.clusterSetupAtBegining:85 » IO Failed on local exceptio...
  TestViewFsDefaultValue.cleanup:217 NullPointer
  TestViewFsHdfs.clusterSetupAtBegining:56 » IO Failed on local exception: java....
  TestViewFsWithAcls.clusterSetupAtBeginning:67 » IO Failed on local exception: ...
  TestViewFsFileStatusHdfs.clusterSetupAtBegining:65 » IO Failed on local except...
  TestViewFsFileStatusHdfs.cleanup:121 NullPointer
  TestViewFileSystemHdfs.clusterSetupAtBegining:65 » IO Failed on local exceptio...
  TestViewFileSystemWithXAttrs.clusterSetupAtBeginning:62 » IO Failed on local e...
  TestViewFileSystemWithAcls.clusterSetupAtBeginning:67 » IO Failed on local exc...
  TestViewFileSystemAtHdfsRoot.clusterSetupAtBegining:58 » IO Failed on local ex...
  TestViewFsAtHdfsRoot.clusterSetupAtBegining:59 » IO Failed on local exception:...
  TestHDFSFileContextMainOperations.clusterSetupAtBegining:59 » IO Failed on loc...
  TestSymlinkHdfsFileContext>TestSymlinkHdfs.beforeClassSetup:92 » IO Failed on ...
  TestGlobPaths.setUp:71 » IO Failed on local exception: java.io.IOException: Co...
  TestSymlinkHdfsFileSystem>TestSymlinkHdfs.beforeClassSetup:92 » IO Failed on l...
  TestHdfsTextCommand.setUp:54 » IO Failed on local exception: java.io.IOExcepti...
  TestSWebHdfsFileContextMainOperations.clusterSetupAtBeginning:84 » IO Failed o...
  TestFcHdfsPermission.clusterSetupAtBegining:58 » IO Failed on local exception:...
  TestEnhancedByteBufferAccess.testZeroCopyReadsNoFallback:250 » IO Failed on lo...
  TestEnhancedByteBufferAccess.testShortZeroCopyReads:194 » IO Failed on local e...
  TestEnhancedByteBufferAccess.testFallbackRead:528 » IO Failed on local excepti...
  TestEnhancedByteBufferAccess.testZeroCopyMmapCache:341 » IO Failed on local ex...
  TestEnhancedByteBufferAccess.testHdfsFallbackReads:444 » IO Failed on local ex...
  TestEnhancedByteBufferAccess.testClientMmapDisable:730 » IO Failed on local ex...
  TestEnhancedByteBufferAccess.testZeroCopyReads:147 » IO Failed on local except...
  TestEnhancedByteBufferAccess.testZeroCopyReadOfCachedData:608 » IO Failed on l...
  TestFcHdfsCreateMkdir.clusterSetupAtBegining:51 » IO Failed on local exception...
  TestUnbuffer.testUnbufferClosesSockets:60 » IO Failed on local exception: java...
  TestUnbuffer.testOpenManyFilesViaTcp:106 » IO Failed on local exception: java....

Tests run: 3444, Failures: 17, Errors: 1090, Skipped: 8

[INFO]                                                                         
[INFO] ------------------------------------------------------------------------
[INFO] Skipping Apache Hadoop HDFS Native Client
[INFO] This project has been banned from the build due to previous failures.
[INFO] ------------------------------------------------------------------------
[INFO]                                                                         
[INFO] ------------------------------------------------------------------------
[INFO] Skipping Apache Hadoop HttpFS
[INFO] This project has been banned from the build due to previous failures.
[INFO] ------------------------------------------------------------------------
[INFO]                                                                         
[INFO] ------------------------------------------------------------------------
[INFO] Skipping Apache Hadoop HDFS BookKeeper Journal
[INFO] This project has been banned from the build due to previous failures.
[INFO] ------------------------------------------------------------------------
[INFO]                                                                         
[INFO] ------------------------------------------------------------------------
[INFO] Skipping Apache Hadoop HDFS-NFS
[INFO] This project has been banned from the build due to previous failures.
[INFO] ------------------------------------------------------------------------
[INFO]                                                                         
[INFO] ------------------------------------------------------------------------
[INFO] Building Apache Hadoop HDFS Project 3.0.0-SNAPSHOT
[INFO] ------------------------------------------------------------------------
[INFO] 
[INFO] --- maven-clean-plugin:2.5:clean (default-clean) @ hadoop-hdfs-project ---
[INFO] Deleting <https://builds.apache.org/job/Hadoop-Hdfs-trunk/ws/hadoop-hdfs-project/target>
[INFO] 
[INFO] --- maven-antrun-plugin:1.7:run (create-testdirs) @ hadoop-hdfs-project ---
[INFO] Executing tasks

main:
    [mkdir] Created dir: <https://builds.apache.org/job/Hadoop-Hdfs-trunk/ws/hadoop-hdfs-project/target/test-dir>
[INFO] Executed tasks
[INFO] 
[INFO] --- maven-source-plugin:2.3:jar-no-fork (hadoop-java-sources) @ hadoop-hdfs-project
---
[INFO] 
[INFO] --- maven-source-plugin:2.3:test-jar-no-fork (hadoop-java-sources) @ hadoop-hdfs-project
---
[INFO] 
[INFO] --- maven-enforcer-plugin:1.3.1:enforce (dist-enforce) @ hadoop-hdfs-project ---
[INFO] 
[INFO] --- maven-site-plugin:3.5:attach-descriptor (attach-descriptor) @ hadoop-hdfs-project
---
[INFO] 
[INFO] --- maven-javadoc-plugin:2.8.1:jar (module-javadocs) @ hadoop-hdfs-project ---
[INFO] Skipping javadoc generation
[INFO] 
[INFO] --- maven-enforcer-plugin:1.3.1:enforce (depcheck) @ hadoop-hdfs-project ---
[INFO] 
[INFO] --- maven-checkstyle-plugin:2.15:checkstyle (default-cli) @ hadoop-hdfs-project ---
[INFO] 
[INFO] --- findbugs-maven-plugin:3.0.0:findbugs (default-cli) @ hadoop-hdfs-project ---
[INFO] ------------------------------------------------------------------------
[INFO] Reactor Summary:
[INFO] 
[INFO] Apache Hadoop HDFS Client ......................... SUCCESS [04:58 min]
[INFO] Apache Hadoop HDFS ................................ FAILURE [  03:20 h]
[INFO] Apache Hadoop HDFS Native Client .................. SKIPPED
[INFO] Apache Hadoop HttpFS .............................. SKIPPED
[INFO] Apache Hadoop HDFS BookKeeper Journal ............. SKIPPED
[INFO] Apache Hadoop HDFS-NFS ............................ SKIPPED
[INFO] Apache Hadoop HDFS Project ........................ SUCCESS [  0.071 s]
[INFO] ------------------------------------------------------------------------
[INFO] BUILD FAILURE
[INFO] ------------------------------------------------------------------------
[INFO] Total time: 03:25 h
[INFO] Finished at: 2016-03-11T08:45:12+00:00
[INFO] Final Memory: 68M/684M
[INFO] ------------------------------------------------------------------------
[ERROR] Failed to execute goal org.apache.maven.plugins:maven-surefire-plugin:2.17:test (default-test)
on project hadoop-hdfs: There was a timeout or other error in the fork -> [Help 1]
[ERROR] 
[ERROR] To see the full stack trace of the errors, re-run Maven with the -e switch.
[ERROR] Re-run Maven using the -X switch to enable full debug logging.
[ERROR] 
[ERROR] For more information about the errors and possible solutions, please read the following
articles:
[ERROR] [Help 1] http://cwiki.apache.org/confluence/display/MAVEN/MojoFailureException
[ERROR] 
[ERROR] After correcting the problems, you can resume the build with the command
[ERROR]   mvn <goals> -rf :hadoop-hdfs
Build step 'Execute shell' marked build as failure
Archiving artifacts
Recording test results

Mime
View raw message