hadoop-hdfs-dev mailing list archives

Site index · List index
Message view « Date » · « Thread »
Top « Date » · « Thread »
From Apache Jenkins Server <jenk...@builds.apache.org>
Subject Build failed in Jenkins: Hadoop-Hdfs-trunk-Java8 #992
Date Fri, 11 Mar 2016 15:19:09 GMT
See <https://builds.apache.org/job/Hadoop-Hdfs-trunk-Java8/992/changes>

Changes:

[aajisaka] MAPREDUCE-6520. Migrate MR Client test cases part 1.

------------------------------------------
[...truncated 68568 lines...]
  TestReservedRawPaths.setup:76 » IO Failed on local exception: java.io.IOExcept...
  TestReservedRawPaths.setup:76 » IO Failed on local exception: java.io.IOExcept...
  TestReservedRawPaths.setup:76 » IO Failed on local exception: java.io.IOExcept...
  TestReservedRawPaths.setup:76 » IO Failed on local exception: java.io.IOExcept...
  TestReservedRawPaths.setup:76 » IO Failed on local exception: java.io.IOExcept...
  TestReservedRawPaths.setup:76 » IO Failed on local exception: java.io.IOExcept...
  TestReservedRawPaths.setup:76 » IO Failed on local exception: java.io.IOExcept...
  TestListFilesInDFS.testSetUp:42 » IO Failed on local exception: java.io.IOExce...
  TestParallelShortCircuitReadUnCached.setupCluster:66->TestParallelReadUtil.setupCluster:70
» IO
  TestParallelShortCircuitReadUnCached.teardownCluster:78->TestParallelReadUtil.teardownCluster:393
» NullPointer
  TestDFSHAAdminMiniCluster.setup:74 » IO Failed on local exception: java.io.IOE...
  TestDFSHAAdminMiniCluster.setup:74 » IO Failed on local exception: java.io.IOE...
  TestDFSHAAdminMiniCluster.setup:74 » IO Failed on local exception: java.io.IOE...
  TestDFSHAAdminMiniCluster.setup:74 » IO Failed on local exception: java.io.IOE...
  TestDFSHAAdminMiniCluster.setup:74 » IO Failed on local exception: java.io.IOE...
  TestDFSHAAdminMiniCluster.setup:74 » IO Failed on local exception: java.io.IOE...
  TestStoragePolicyCommands.clusterSetUp:48 » IO Failed on local exception: java...
  TestStoragePolicyCommands.clusterSetUp:48 » IO Failed on local exception: java...
  TestDFSZKFailoverController.setup:90 » IO Failed on local exception: java.io.I...
  TestDFSZKFailoverController.setup:90 » IO Failed on local exception: java.io.I...
  TestDFSZKFailoverController.setup:90 » IO Failed on local exception: java.io.I...
  TestDFSZKFailoverController.setup:90 » IO Failed on local exception: java.io.I...
  TestDFSAdmin.setUp:75->restartCluster:92 » IO Failed on local exception: java....
  TestDFSAdmin.setUp:75->restartCluster:92 » IO Failed on local exception: java....
  TestDFSAdmin.setUp:75->restartCluster:92 » IO Failed on local exception: java....
  TestDFSAdmin.setUp:75->restartCluster:92 » IO Failed on local exception: java....
  TestOfflineImageViewerForXAttr.createOriginalFSImage:74 » IO Failed on local e...
  TestOfflineImageViewerWithStripedBlocks.setup:61 » IO Failed on local exceptio...
  TestOfflineImageViewer.createOriginalFSImage:118 » IO Failed on local exceptio...
  TestOfflineImageViewerForContentSummary.createOriginalFSImage:68 » IO Failed o...
  TestOfflineImageViewerForAcl.createOriginalFSImage:102 » IO Failed on local ex...
  TestDelegationTokenFetcher.testDelegationTokenWithoutRenewerViaRPC:122 » IO Fa...
  TestDebugAdmin.setUp:51 » IO Failed on local exception: java.io.IOException: C...
  TestDebugAdmin.setUp:51 » IO Failed on local exception: java.io.IOException: C...
  TestDebugAdmin.setUp:51 » IO Failed on local exception: java.io.IOException: C...
  TestGetGroups.setUpNameNode:40 » IO Failed on local exception: java.io.IOExcep...
  TestGetGroups.setUpNameNode:40 » IO Failed on local exception: java.io.IOExcep...
  TestGetGroups.setUpNameNode:40 » IO Failed on local exception: java.io.IOExcep...
  TestGetGroups.setUpNameNode:40 » IO Failed on local exception: java.io.IOExcep...
  TestGetGroups.setUpNameNode:40 » IO Failed on local exception: java.io.IOExcep...
  TestGetGroups.setUpNameNode:40 » IO Failed on local exception: java.io.IOExcep...
  TestDFSAdminWithHA.testSetBalancerBandwidth:189->setUpHaCluster:84 » IO Failed...
  TestDFSAdminWithHA.testSetSafeMode:117->setUpHaCluster:84 » IO Failed on local...
  TestDFSAdminWithHA.testRefreshUserToGroupsMappings:224->setUpHaCluster:84 » IO
  TestDFSAdminWithHA.testSetNegativeBalancerBandwidth:198->setUpHaCluster:84 » IO
  TestDFSAdminWithHA.testRefreshSuperUserGroupsConfiguration:233->setUpHaCluster:84 »
IO
  TestDFSAdminWithHA.testRefreshServiceAcl:215->setUpHaCluster:84 » IO Failed on...
  TestDFSAdminWithHA.testRestoreFailedStorage:160->setUpHaCluster:84 » IO Failed...
  TestDFSAdminWithHA.testMetaSave:205->setUpHaCluster:84 » IO Failed on local ex...
  TestDFSAdminWithHA.testRefreshNodes:180->setUpHaCluster:84 » IO Failed on loca...
  TestDFSAdminWithHA.testRefreshCallQueue:243->setUpHaCluster:84 » IO Failed on ...
  TestDFSAdminWithHA.testSaveNamespace:145->setUpHaCluster:84 » IO Failed on loc...
  TestOfflineEditsViewer.setUp:88 » IO Failed on local exception: java.io.IOExce...
  TestOfflineEditsViewer.setUp:88 » IO Failed on local exception: java.io.IOExce...
  TestOfflineEditsViewer.setUp:88 » IO Failed on local exception: java.io.IOExce...
  TestOfflineEditsViewer.setUp:88 » IO Failed on local exception: java.io.IOExce...
  TestHDFSFileSystemContract.setUp:39 » IO Failed on local exception: java.io.IO...
  TestHDFSFileSystemContract.setUp:39 » IO Failed on local exception: java.io.IO...
  TestHDFSFileSystemContract.setUp:39 » IO Failed on local exception: java.io.IO...
  TestHDFSFileSystemContract.setUp:39 » IO Failed on local exception: java.io.IO...
  TestHDFSFileSystemContract.setUp:39 » IO Failed on local exception: java.io.IO...
  TestHDFSFileSystemContract.setUp:39 » IO Failed on local exception: java.io.IO...
  TestHDFSFileSystemContract.setUp:39 » IO Failed on local exception: java.io.IO...
  TestHDFSFileSystemContract.setUp:39 » IO Failed on local exception: java.io.IO...
  TestHDFSFileSystemContract.setUp:39 » IO Failed on local exception: java.io.IO...
  TestHDFSFileSystemContract.setUp:39 » IO Failed on local exception: java.io.IO...
  TestHDFSFileSystemContract.setUp:39 » IO Failed on local exception: java.io.IO...
  TestHDFSFileSystemContract.setUp:39 » IO Failed on local exception: java.io.IO...
  TestHDFSFileSystemContract.setUp:39 » IO Failed on local exception: java.io.IO...
  TestHDFSFileSystemContract.setUp:39 » IO Failed on local exception: java.io.IO...
  TestHDFSFileSystemContract.setUp:39 » IO Failed on local exception: java.io.IO...
  TestHDFSFileSystemContract.setUp:39 » IO Failed on local exception: java.io.IO...
  TestHDFSFileSystemContract.setUp:39 » IO Failed on local exception: java.io.IO...
  TestHDFSFileSystemContract.setUp:39 » IO Failed on local exception: java.io.IO...
  TestHDFSFileSystemContract.setUp:39 » IO Failed on local exception: java.io.IO...
  TestHDFSFileSystemContract.setUp:39 » IO Failed on local exception: java.io.IO...
  TestHDFSFileSystemContract.setUp:39 » IO Failed on local exception: java.io.IO...
  TestHDFSFileSystemContract.setUp:39 » IO Failed on local exception: java.io.IO...
  TestHDFSFileSystemContract.setUp:39 » IO Failed on local exception: java.io.IO...
  TestHDFSFileSystemContract.setUp:39 » IO Failed on local exception: java.io.IO...
  TestHDFSFileSystemContract.setUp:39 » IO Failed on local exception: java.io.IO...
  TestHDFSFileSystemContract.setUp:39 » IO Failed on local exception: java.io.IO...
  TestHDFSFileSystemContract.setUp:39 » IO Failed on local exception: java.io.IO...
  TestHDFSFileSystemContract.setUp:39 » IO Failed on local exception: java.io.IO...
  TestHDFSFileSystemContract.setUp:39 » IO Failed on local exception: java.io.IO...
  TestHDFSFileSystemContract.setUp:39 » IO Failed on local exception: java.io.IO...
  TestHDFSFileSystemContract.setUp:39 » IO Failed on local exception: java.io.IO...
  TestHDFSFileSystemContract.setUp:39 » IO Failed on local exception: java.io.IO...
  TestHDFSFileSystemContract.setUp:39 » IO Failed on local exception: java.io.IO...
  TestHDFSFileSystemContract.setUp:39 » IO Failed on local exception: java.io.IO...
  TestHDFSFileSystemContract.setUp:39 » IO Failed on local exception: java.io.IO...
  TestHDFSFileSystemContract.setUp:39 » IO Failed on local exception: java.io.IO...
  TestHDFSFileSystemContract.setUp:39 » IO Failed on local exception: java.io.IO...
  TestHDFSFileSystemContract.setUp:39 » IO Failed on local exception: java.io.IO...
  TestHDFSFileSystemContract.setUp:39 » IO Failed on local exception: java.io.IO...
  TestHDFSFileSystemContract.setUp:39 » IO Failed on local exception: java.io.IO...
  TestHDFSFileSystemContract.setUp:39 » IO Failed on local exception: java.io.IO...
  TestHDFSFileSystemContract.setUp:39 » IO Failed on local exception: java.io.IO...
  TestHDFSFileSystemContract.setUp:39 » IO Failed on local exception: java.io.IO...
  TestHDFSFileSystemContract.setUp:39 » IO Failed on local exception: java.io.IO...
  TestClose.testWriteAfterClose:38 » IO Failed on local exception: java.io.IOExc...
  TestFetchImage.testFetchImage:58 » IO Failed on local exception: java.io.IOExc...
  TestInjectionForSimulatedStorage.testInjection:130 » IO Failed on local except...
  TestBlocksScheduledCounter.testBlocksScheduledCounter:56 » IO Failed on local ...
  TestFileAppend.testSimpleFlush:178 » IO Failed on local exception: java.io.IOE...
  TestFileAppend.testFailedAppendBlockRejection:515 » IO Failed on local excepti...
  TestFileAppend.testAppendAfterSoftLimit:428 » IO Failed on local exception: ja...
  TestFileAppend.testMultiAppend2:568 » IO Failed on local exception: java.io.IO...
  TestFileAppend.testAppendCorruptedBlock:640 » IO Failed on local exception: ja...
  TestFileAppend.testBreakHardlinksIfNeeded:112 » IO Failed on local exception: ...
  TestFileAppend.testComplexFlush:231 » IO Failed on local exception: java.io.IO...
  TestFileAppend.testMultipleAppends:376 » IO Failed on local exception: java.io...
  TestFileAppend.testFileNotFound »  Unexpected exception, expected<java.io.File...
  TestFileAppend.testAppend2Twice:332 » IO Failed on local exception: java.io.IO...
  TestFileAppend.testAppend2AfterSoftLimit:468 » IO Failed on local exception: j...
  TestFileAppend.testAppendTwice:293 » IO Failed on local exception: java.io.IOE...
  TestRollingUpgradeRollback.testRollbackCommand:97 » IO Failed on local excepti...
  TestRollingUpgradeRollback.testRollbackWithQJM:159 » IO Failed on local except...
  TestRollingUpgradeRollback.testRollbackWithHAQJM:211 » IO Failed on local exce...
  TestLease.testLeaseAfterRename:166 » IO Failed on local exception: java.io.IOE...
  TestLease.testLeaseAfterRenameAndRecreate:263 » IO Failed on local exception: ...
  TestLease.testLease:301 » IO Failed on local exception: java.io.IOException: C...
  TestLease.testLeaseAbort:78 » IO Failed on local exception: java.io.IOExceptio...
  TestRemoteBlockReader2>TestBlockReaderBase.setup:58 » IO Failed on local excep...
  TestRemoteBlockReader2>TestBlockReaderBase.shutdown:71 » NullPointer
  TestNetworkTopology.testInvalidNetworkTopologiesNotCachedInHdfs:322 » IO Faile...
  TestGenericRefresh.setUpBeforeClass:60 » IO Failed on local exception: java.io...
  TestTracingShortCircuitLocalRead.testShortCircuitTraceHooks:83 » IO Failed on ...
  TestTraceAdmin.testCreateAndDestroySpanReceiver:68 » IO Failed on local except...
  TestTracing.startCluster:217 » IO Failed on local exception: java.io.IOExcepti...
  TestRollingFileSystemSinkWithHdfs.setupHdfs:58 » IO Failed on local exception:...
  TestRollingFileSystemSinkWithHdfs.setupHdfs:58 » IO Failed on local exception:...
  TestRollingFileSystemSinkWithHdfs.setupHdfs:58 » IO Failed on local exception:...
  TestRollingFileSystemSinkWithHdfs.setupHdfs:58 » IO Failed on local exception:...
  TestRollingFileSystemSinkWithHdfs.setupHdfs:58 » IO Failed on local exception:...
  TestRollingFileSystemSinkWithHdfs.setupHdfs:58 » IO Failed on local exception:...
  TestRollingFileSystemSinkWithHdfs.setupHdfs:58 » IO Failed on local exception:...
  TestRollingFileSystemSinkWithHdfs.setupHdfs:58 » IO Failed on local exception:...
  TestRollingFileSystemSinkWithHdfs.setupHdfs:58 » IO Failed on local exception:...
  TestRollingFileSystemSinkWithHdfs.setupHdfs:58 » IO Failed on local exception:...
  TestRollingFileSystemSinkWithHdfs.setupHdfs:58 » IO Failed on local exception:...
  TestRollingFileSystemSinkWithSecureHdfs.testMissingPropertiesWithSecureHDFS:141 » IO
  TestRollingFileSystemSinkWithSecureHdfs.testWithSecureHDFS:91 » IO Failed on l...
  TestDeleteCLI.setUp:47 » IO Failed on local exception: java.io.IOException: Co...
  TestDeleteCLI.tearDown:68->CLITestHelper.tearDown:125->CLITestHelper.displayResults:162->expandCommand:79
» NullPointer
  TestHDFSCLI.setUp:59 » IO Failed on local exception: java.io.IOException: Coul...
  TestHDFSCLI.tearDown:87->CLITestHelper.tearDown:125->CLITestHelper.displayResults:162->expandCommand:93
» NullPointer
  TestAclCLI.setUp:40 » IO Failed on local exception: java.io.IOException: Could...
  TestAclCLI.tearDown:49->CLITestHelper.tearDown:125->CLITestHelper.displayResults:162->expandCommand:68
» NullPointer
  TestErasureCodingCLI.setUp:49 » IO Failed on local exception: java.io.IOExcept...
  TestErasureCodingCLI.tearDown:75->CLITestHelper.tearDown:125->CLITestHelper.displayResults:162->expandCommand:81
» NullPointer
  TestCacheAdminCLI.setUp:63 » IO Failed on local exception: java.io.IOException...
  TestXAttrCLI.setUp:49 » IO Failed on local exception: java.io.IOException: Cou...
  TestXAttrCLI.tearDown:77->CLITestHelper.tearDown:125->CLITestHelper.displayResults:162->expandCommand:83
» NullPointer
  TestCryptoAdminCLI.setUp:72 » IO Failed on local exception: java.io.IOExceptio...
  TestCryptoAdminCLI.tearDown:96->CLITestHelper.tearDown:125->CLITestHelper.displayResults:162->expandCommand:117
» NullPointer
  TestPermission.testFilePermission:186 » IO Failed on local exception: java.io....
  TestPermission.testCreate:128 » IO Failed on local exception: java.io.IOExcept...
  TestRefreshUserMappings.setUp:94 » IO Failed on local exception: java.io.IOExc...
  TestRefreshUserMappings.setUp:94 » IO Failed on local exception: java.io.IOExc...
  TestPermissionSymlinks.beforeClassSetUp:78 » IO Failed on local exception: jav...
  TestJMXGet.testDataNode:154 » IO Failed on local exception: java.io.IOExceptio...
  TestJMXGet.testNameNode:96 » IO Failed on local exception: java.io.IOException...

Tests run: 3202, Failures: 23, Errors: 1986, Skipped: 7

[INFO]                                                                         
[INFO] ------------------------------------------------------------------------
[INFO] Skipping Apache Hadoop HDFS Native Client
[INFO] This project has been banned from the build due to previous failures.
[INFO] ------------------------------------------------------------------------
[INFO]                                                                         
[INFO] ------------------------------------------------------------------------
[INFO] Skipping Apache Hadoop HttpFS
[INFO] This project has been banned from the build due to previous failures.
[INFO] ------------------------------------------------------------------------
[INFO]                                                                         
[INFO] ------------------------------------------------------------------------
[INFO] Skipping Apache Hadoop HDFS BookKeeper Journal
[INFO] This project has been banned from the build due to previous failures.
[INFO] ------------------------------------------------------------------------
[INFO]                                                                         
[INFO] ------------------------------------------------------------------------
[INFO] Skipping Apache Hadoop HDFS-NFS
[INFO] This project has been banned from the build due to previous failures.
[INFO] ------------------------------------------------------------------------
[INFO]                                                                         
[INFO] ------------------------------------------------------------------------
[INFO] Building Apache Hadoop HDFS Project 3.0.0-SNAPSHOT
[INFO] ------------------------------------------------------------------------
[INFO] 
[INFO] --- maven-clean-plugin:2.5:clean (default-clean) @ hadoop-hdfs-project ---
[INFO] Deleting <https://builds.apache.org/job/Hadoop-Hdfs-trunk-Java8/ws/hadoop-hdfs-project/target>
[INFO] 
[INFO] --- maven-antrun-plugin:1.7:run (create-testdirs) @ hadoop-hdfs-project ---
[INFO] Executing tasks

main:
    [mkdir] Created dir: <https://builds.apache.org/job/Hadoop-Hdfs-trunk-Java8/ws/hadoop-hdfs-project/target/test-dir>
[INFO] Executed tasks
[INFO] 
[INFO] --- maven-source-plugin:2.3:jar-no-fork (hadoop-java-sources) @ hadoop-hdfs-project
---
[INFO] 
[INFO] --- maven-source-plugin:2.3:test-jar-no-fork (hadoop-java-sources) @ hadoop-hdfs-project
---
[INFO] 
[INFO] --- maven-enforcer-plugin:1.3.1:enforce (dist-enforce) @ hadoop-hdfs-project ---
[INFO] 
[INFO] --- maven-site-plugin:3.5:attach-descriptor (attach-descriptor) @ hadoop-hdfs-project
---
[INFO] 
[INFO] --- maven-javadoc-plugin:2.8.1:jar (module-javadocs) @ hadoop-hdfs-project ---
[INFO] Not executing Javadoc as the project is not a Java classpath-capable package
[INFO] 
[INFO] --- maven-enforcer-plugin:1.3.1:enforce (depcheck) @ hadoop-hdfs-project ---
[INFO] 
[INFO] --- maven-checkstyle-plugin:2.15:checkstyle (default-cli) @ hadoop-hdfs-project ---
[INFO] 
[INFO] --- findbugs-maven-plugin:3.0.0:findbugs (default-cli) @ hadoop-hdfs-project ---
[INFO] ------------------------------------------------------------------------
[INFO] Reactor Summary:
[INFO] 
[INFO] Apache Hadoop HDFS Client ......................... SUCCESS [03:57 min]
[INFO] Apache Hadoop HDFS ................................ FAILURE [  01:27 h]
[INFO] Apache Hadoop HDFS Native Client .................. SKIPPED
[INFO] Apache Hadoop HttpFS .............................. SKIPPED
[INFO] Apache Hadoop HDFS BookKeeper Journal ............. SKIPPED
[INFO] Apache Hadoop HDFS-NFS ............................ SKIPPED
[INFO] Apache Hadoop HDFS Project ........................ SUCCESS [  0.082 s]
[INFO] ------------------------------------------------------------------------
[INFO] BUILD FAILURE
[INFO] ------------------------------------------------------------------------
[INFO] Total time: 01:31 h
[INFO] Finished at: 2016-03-11T15:17:52+00:00
[INFO] Final Memory: 57M/802M
[INFO] ------------------------------------------------------------------------
[ERROR] Failed to execute goal org.apache.maven.plugins:maven-surefire-plugin:2.17:test (default-test)
on project hadoop-hdfs: ExecutionException: java.lang.RuntimeException: The forked VM terminated
without properly saying goodbye. VM crash or System.exit called?
[ERROR] Command was /bin/sh -c cd <https://builds.apache.org/job/Hadoop-Hdfs-trunk-Java8/ws/hadoop-hdfs-project/hadoop-hdfs>
&& /home/jenkins/tools/java/jdk1.8.0/jre/bin/java -Xmx2048m -XX:MaxPermSize=768m -XX:+HeapDumpOnOutOfMemoryError
-jar <https://builds.apache.org/job/Hadoop-Hdfs-trunk-Java8/ws/hadoop-hdfs-project/hadoop-hdfs/target/surefire/surefirebooter3081073308390262519.jar>
<https://builds.apache.org/job/Hadoop-Hdfs-trunk-Java8/ws/hadoop-hdfs-project/hadoop-hdfs/target/surefire/surefire3815841914350222351tmp>
<https://builds.apache.org/job/Hadoop-Hdfs-trunk-Java8/ws/hadoop-hdfs-project/hadoop-hdfs/target/surefire/surefire_3965848982256653135924tmp>
[ERROR] -> [Help 1]
[ERROR] 
[ERROR] To see the full stack trace of the errors, re-run Maven with the -e switch.
[ERROR] Re-run Maven using the -X switch to enable full debug logging.
[ERROR] 
[ERROR] For more information about the errors and possible solutions, please read the following
articles:
[ERROR] [Help 1] http://cwiki.apache.org/confluence/display/MAVEN/MojoFailureException
[ERROR] 
[ERROR] After correcting the problems, you can resume the build with the command
[ERROR]   mvn <goals> -rf :hadoop-hdfs
Build step 'Execute shell' marked build as failure
Archiving artifacts
Recording test results

Mime
View raw message