hadoop-hdfs-dev mailing list archives

Site index · List index
Message view « Date » · « Thread »
Top « Date » · « Thread »
From Apache Jenkins Server <jenk...@builds.apache.org>
Subject Hadoop-Hdfs-trunk-Java8 - Build # 1006 - Still Failing
Date Thu, 17 Mar 2016 15:39:39 GMT
See https://builds.apache.org/job/Hadoop-Hdfs-trunk-Java8/1006/

###################################################################################
########################## LAST 60 LINES OF THE CONSOLE ###########################
[...truncated 5863 lines...]
[INFO] 
[INFO] --- maven-antrun-plugin:1.7:run (create-testdirs) @ hadoop-hdfs-project ---
[INFO] Executing tasks

main:
    [mkdir] Created dir: /home/jenkins/jenkins-slave/workspace/Hadoop-Hdfs-trunk-Java8/hadoop-hdfs-project/target/test-dir
[INFO] Executed tasks
[INFO] 
[INFO] --- maven-source-plugin:2.3:jar-no-fork (hadoop-java-sources) @ hadoop-hdfs-project
---
[INFO] 
[INFO] --- maven-source-plugin:2.3:test-jar-no-fork (hadoop-java-sources) @ hadoop-hdfs-project
---
[INFO] 
[INFO] --- maven-enforcer-plugin:1.3.1:enforce (dist-enforce) @ hadoop-hdfs-project ---
[INFO] 
[INFO] --- maven-site-plugin:3.5:attach-descriptor (attach-descriptor) @ hadoop-hdfs-project
---
[INFO] 
[INFO] --- maven-javadoc-plugin:2.8.1:jar (module-javadocs) @ hadoop-hdfs-project ---
[INFO] Not executing Javadoc as the project is not a Java classpath-capable package
[INFO] 
[INFO] --- maven-enforcer-plugin:1.3.1:enforce (depcheck) @ hadoop-hdfs-project ---
[INFO] 
[INFO] --- maven-checkstyle-plugin:2.15:checkstyle (default-cli) @ hadoop-hdfs-project ---
[INFO] 
[INFO] --- findbugs-maven-plugin:3.0.0:findbugs (default-cli) @ hadoop-hdfs-project ---
[INFO] ------------------------------------------------------------------------
[INFO] Reactor Summary:
[INFO] 
[INFO] Apache Hadoop HDFS Client ......................... SUCCESS [04:35 min]
[INFO] Apache Hadoop HDFS ................................ FAILURE [  03:15 h]
[INFO] Apache Hadoop HDFS Native Client .................. SKIPPED
[INFO] Apache Hadoop HttpFS .............................. SKIPPED
[INFO] Apache Hadoop HDFS BookKeeper Journal ............. SKIPPED
[INFO] Apache Hadoop HDFS-NFS ............................ SKIPPED
[INFO] Apache Hadoop HDFS Project ........................ SUCCESS [  0.106 s]
[INFO] ------------------------------------------------------------------------
[INFO] BUILD FAILURE
[INFO] ------------------------------------------------------------------------
[INFO] Total time: 03:20 h
[INFO] Finished at: 2016-03-17T15:39:02+00:00
[INFO] Final Memory: 71M/461M
[INFO] ------------------------------------------------------------------------
[ERROR] Failed to execute goal org.apache.maven.plugins:maven-surefire-plugin:2.17:test (default-test)
on project hadoop-hdfs: ExecutionException: java.lang.RuntimeException: The forked VM terminated
without properly saying goodbye. VM crash or System.exit called?
[ERROR] Command was /bin/sh -c cd /home/jenkins/jenkins-slave/workspace/Hadoop-Hdfs-trunk-Java8/hadoop-hdfs-project/hadoop-hdfs
&& /home/jenkins/tools/java/jdk1.8.0/jre/bin/java -Xmx2048m -XX:MaxPermSize=768m -XX:+HeapDumpOnOutOfMemoryError
-jar /home/jenkins/jenkins-slave/workspace/Hadoop-Hdfs-trunk-Java8/hadoop-hdfs-project/hadoop-hdfs/target/surefire/surefirebooter3783773465383751000.jar
/home/jenkins/jenkins-slave/workspace/Hadoop-Hdfs-trunk-Java8/hadoop-hdfs-project/hadoop-hdfs/target/surefire/surefire6002940627814818622tmp
/home/jenkins/jenkins-slave/workspace/Hadoop-Hdfs-trunk-Java8/hadoop-hdfs-project/hadoop-hdfs/target/surefire/surefire_3692178717498982223817tmp
[ERROR] -> [Help 1]
[ERROR] 
[ERROR] To see the full stack trace of the errors, re-run Maven with the -e switch.
[ERROR] Re-run Maven using the -X switch to enable full debug logging.
[ERROR] 
[ERROR] For more information about the errors and possible solutions, please read the following
articles:
[ERROR] [Help 1] http://cwiki.apache.org/confluence/display/MAVEN/MojoFailureException
[ERROR] 
[ERROR] After correcting the problems, you can resume the build with the command
[ERROR]   mvn <goals> -rf :hadoop-hdfs
Build step 'Execute shell' marked build as failure
Archiving artifacts
Recording test results
Sending e-mails to: hdfs-dev@hadoop.apache.org
Email was triggered for: Failure - Any
Sending email for trigger: Failure - Any



###################################################################################
############################## FAILED TESTS (if any) ##############################
3 tests failed.
FAILED:  org.apache.hadoop.hdfs.TestLeaseRecoveryStriped.testLeaseRecovery

Error Message:
failed testCase at i=0, blockLengths=[196608, 393216, 458752, 655360, 524288, 262144, 720896,
524288, 196608]
java.lang.NoClassDefFoundError: org/apache/hadoop/util/IdentityHashStore$Visitor
 at org.apache.hadoop.hdfs.BlockReaderFactory.build(BlockReaderFactory.java:372)
 at org.apache.hadoop.hdfs.BlockReaderTestUtil.getBlockReader(BlockReaderTestUtil.java:216)
 at org.apache.hadoop.hdfs.StripedFileTestUtil.checkData(StripedFileTestUtil.java:440)
 at org.apache.hadoop.hdfs.TestLeaseRecoveryStriped.runTest(TestLeaseRecoveryStriped.java:164)
 at org.apache.hadoop.hdfs.TestLeaseRecoveryStriped.testLeaseRecovery(TestLeaseRecoveryStriped.java:148)
 at sun.reflect.NativeMethodAccessorImpl.invoke0(Native Method)
 at sun.reflect.NativeMethodAccessorImpl.invoke(NativeMethodAccessorImpl.java:62)
 at sun.reflect.DelegatingMethodAccessorImpl.invoke(DelegatingMethodAccessorImpl.java:43)
 at java.lang.reflect.Method.invoke(Method.java:483)
 at org.junit.runners.model.FrameworkMethod$1.runReflectiveCall(FrameworkMethod.java:47)
 at org.junit.internal.runners.model.ReflectiveCallable.run(ReflectiveCallable.java:12)
 at org.junit.runners.model.FrameworkMethod.invokeExplosively(FrameworkMethod.java:44)
 at org.junit.internal.runners.statements.InvokeMethod.evaluate(InvokeMethod.java:17)
 at org.junit.internal.runners.statements.RunBefores.evaluate(RunBefores.java:26)
 at org.junit.internal.runners.statements.RunAfters.evaluate(RunAfters.java:27)
 at org.junit.runners.ParentRunner.runLeaf(ParentRunner.java:271)
 at org.junit.runners.BlockJUnit4ClassRunner.runChild(BlockJUnit4ClassRunner.java:70)
 at org.junit.runners.BlockJUnit4ClassRunner.runChild(BlockJUnit4ClassRunner.java:50)
 at org.junit.runners.ParentRunner$3.run(ParentRunner.java:238)
 at org.junit.runners.ParentRunner$1.schedule(ParentRunner.java:63)
 at org.junit.runners.ParentRunner.runChildren(ParentRunner.java:236)
 at org.junit.runners.ParentRunner.access$000(ParentRunner.java:53)
 at org.junit.runners.ParentRunner$2.evaluate(ParentRunner.java:229)
 at org.junit.runners.ParentRunner.run(ParentRunner.java:309)
 at org.apache.maven.surefire.junit4.JUnit4Provider.execute(JUnit4Provider.java:264)
 at org.apache.maven.surefire.junit4.JUnit4Provider.executeTestSet(JUnit4Provider.java:153)
 at org.apache.maven.surefire.junit4.JUnit4Provider.invoke(JUnit4Provider.java:124)
 at org.apache.maven.surefire.booter.ForkedBooter.invokeProviderInSameClassLoader(ForkedBooter.java:200)
 at org.apache.maven.surefire.booter.ForkedBooter.runSuitesInProcess(ForkedBooter.java:153)
 at org.apache.maven.surefire.booter.ForkedBooter.main(ForkedBooter.java:103)
Caused by: java.lang.ClassNotFoundException: org.apache.hadoop.util.IdentityHashStore$Visitor
 at java.net.URLClassLoader$1.run(URLClassLoader.java:372)
 at java.net.URLClassLoader$1.run(URLClassLoader.java:361)
 at java.security.AccessController.doPrivileged(Native Method)
 at java.net.URLClassLoader.findClass(URLClassLoader.java:360)
 at java.lang.ClassLoader.loadClass(ClassLoader.java:424)
 at sun.misc.Launcher$AppClassLoader.loadClass(Launcher.java:308)
 at java.lang.ClassLoader.loadClass(ClassLoader.java:357)
 ... 30 more


Stack Trace:
java.lang.AssertionError: failed testCase at i=0, blockLengths=[196608, 393216, 458752, 655360,
524288, 262144, 720896, 524288, 196608]
java.lang.NoClassDefFoundError: org/apache/hadoop/util/IdentityHashStore$Visitor
	at org.apache.hadoop.hdfs.BlockReaderFactory.build(BlockReaderFactory.java:372)
	at org.apache.hadoop.hdfs.BlockReaderTestUtil.getBlockReader(BlockReaderTestUtil.java:216)
	at org.apache.hadoop.hdfs.StripedFileTestUtil.checkData(StripedFileTestUtil.java:440)
	at org.apache.hadoop.hdfs.TestLeaseRecoveryStriped.runTest(TestLeaseRecoveryStriped.java:164)
	at org.apache.hadoop.hdfs.TestLeaseRecoveryStriped.testLeaseRecovery(TestLeaseRecoveryStriped.java:148)
	at sun.reflect.NativeMethodAccessorImpl.invoke0(Native Method)
	at sun.reflect.NativeMethodAccessorImpl.invoke(NativeMethodAccessorImpl.java:62)
	at sun.reflect.DelegatingMethodAccessorImpl.invoke(DelegatingMethodAccessorImpl.java:43)
	at java.lang.reflect.Method.invoke(Method.java:483)
	at org.junit.runners.model.FrameworkMethod$1.runReflectiveCall(FrameworkMethod.java:47)
	at org.junit.internal.runners.model.ReflectiveCallable.run(ReflectiveCallable.java:12)
	at org.junit.runners.model.FrameworkMethod.invokeExplosively(FrameworkMethod.java:44)
	at org.junit.internal.runners.statements.InvokeMethod.evaluate(InvokeMethod.java:17)
	at org.junit.internal.runners.statements.RunBefores.evaluate(RunBefores.java:26)
	at org.junit.internal.runners.statements.RunAfters.evaluate(RunAfters.java:27)
	at org.junit.runners.ParentRunner.runLeaf(ParentRunner.java:271)
	at org.junit.runners.BlockJUnit4ClassRunner.runChild(BlockJUnit4ClassRunner.java:70)
	at org.junit.runners.BlockJUnit4ClassRunner.runChild(BlockJUnit4ClassRunner.java:50)
	at org.junit.runners.ParentRunner$3.run(ParentRunner.java:238)
	at org.junit.runners.ParentRunner$1.schedule(ParentRunner.java:63)
	at org.junit.runners.ParentRunner.runChildren(ParentRunner.java:236)
	at org.junit.runners.ParentRunner.access$000(ParentRunner.java:53)
	at org.junit.runners.ParentRunner$2.evaluate(ParentRunner.java:229)
	at org.junit.runners.ParentRunner.run(ParentRunner.java:309)
	at org.apache.maven.surefire.junit4.JUnit4Provider.execute(JUnit4Provider.java:264)
	at org.apache.maven.surefire.junit4.JUnit4Provider.executeTestSet(JUnit4Provider.java:153)
	at org.apache.maven.surefire.junit4.JUnit4Provider.invoke(JUnit4Provider.java:124)
	at org.apache.maven.surefire.booter.ForkedBooter.invokeProviderInSameClassLoader(ForkedBooter.java:200)
	at org.apache.maven.surefire.booter.ForkedBooter.runSuitesInProcess(ForkedBooter.java:153)
	at org.apache.maven.surefire.booter.ForkedBooter.main(ForkedBooter.java:103)
Caused by: java.lang.ClassNotFoundException: org.apache.hadoop.util.IdentityHashStore$Visitor
	at java.net.URLClassLoader$1.run(URLClassLoader.java:372)
	at java.net.URLClassLoader$1.run(URLClassLoader.java:361)
	at java.security.AccessController.doPrivileged(Native Method)
	at java.net.URLClassLoader.findClass(URLClassLoader.java:360)
	at java.lang.ClassLoader.loadClass(ClassLoader.java:424)
	at sun.misc.Launcher$AppClassLoader.loadClass(Launcher.java:308)
	at java.lang.ClassLoader.loadClass(ClassLoader.java:357)
	... 30 more

	at org.junit.Assert.fail(Assert.java:88)
	at org.apache.hadoop.hdfs.TestLeaseRecoveryStriped.testLeaseRecovery(TestLeaseRecoveryStriped.java:153)


FAILED:  org.apache.hadoop.hdfs.TestLeaseRecoveryStriped.testLeaseRecovery

Error Message:
org/apache/hadoop/util/IntrusiveCollection$IntrusiveIterator

Stack Trace:
java.lang.NoClassDefFoundError: org/apache/hadoop/util/IntrusiveCollection$IntrusiveIterator
	at org.apache.hadoop.util.IntrusiveCollection.iterator(IntrusiveCollection.java:213)
	at org.apache.hadoop.util.IntrusiveCollection.clear(IntrusiveCollection.java:368)
	at org.apache.hadoop.hdfs.server.blockmanagement.DatanodeManager.clearPendingCachingCommands(DatanodeManager.java:1645)
	at org.apache.hadoop.hdfs.server.namenode.FSNamesystem.stopActiveServices(FSNamesystem.java:1186)
	at org.apache.hadoop.hdfs.server.namenode.FSNamesystem.close(FSNamesystem.java:1531)
	at org.apache.hadoop.hdfs.server.namenode.NameNode.stopCommonServices(NameNode.java:787)
	at org.apache.hadoop.hdfs.server.namenode.NameNode.stop(NameNode.java:966)
	at org.apache.hadoop.hdfs.MiniDFSCluster.stopAndJoinNameNode(MiniDFSCluster.java:1965)
	at org.apache.hadoop.hdfs.MiniDFSCluster.shutdown(MiniDFSCluster.java:1911)
	at org.apache.hadoop.hdfs.MiniDFSCluster.shutdown(MiniDFSCluster.java:1882)
	at org.apache.hadoop.hdfs.MiniDFSCluster.shutdown(MiniDFSCluster.java:1875)
	at org.apache.hadoop.hdfs.TestLeaseRecoveryStriped.tearDown(TestLeaseRecoveryStriped.java:105)


FAILED:  org.apache.hadoop.hdfs.server.namenode.TestCommitBlockWithInvalidGenStamp.testCommitWithInvalidGenStamp

Error Message:
org/apache/hadoop/util/ShutdownHookManager

Stack Trace:
java.lang.NoClassDefFoundError: org/apache/hadoop/util/ShutdownHookManager
	at java.net.URLClassLoader$1.run(URLClassLoader.java:372)
	at java.net.URLClassLoader$1.run(URLClassLoader.java:361)
	at java.security.AccessController.doPrivileged(Native Method)
	at java.net.URLClassLoader.findClass(URLClassLoader.java:360)
	at java.lang.ClassLoader.loadClass(ClassLoader.java:424)
	at sun.misc.Launcher$AppClassLoader.loadClass(Launcher.java:308)
	at java.lang.ClassLoader.loadClass(ClassLoader.java:357)
	at org.apache.hadoop.hdfs.MiniDFSCluster.shutdown(MiniDFSCluster.java:1913)
	at org.apache.hadoop.hdfs.MiniDFSCluster.shutdown(MiniDFSCluster.java:1882)
	at org.apache.hadoop.hdfs.MiniDFSCluster.shutdown(MiniDFSCluster.java:1875)
	at org.apache.hadoop.hdfs.MiniDFSCluster.initMiniDFSCluster(MiniDFSCluster.java:854)
	at org.apache.hadoop.hdfs.MiniDFSCluster.<init>(MiniDFSCluster.java:482)
	at org.apache.hadoop.hdfs.MiniDFSCluster$Builder.build(MiniDFSCluster.java:441)
	at org.apache.hadoop.hdfs.server.namenode.TestCommitBlockWithInvalidGenStamp.setUp(TestCommitBlockWithInvalidGenStamp.java:50)



Mime
  • Unnamed multipart/mixed (inline, None, 0 bytes)
View raw message