hadoop-hdfs-dev mailing list archives

Site index · List index
Message view « Date » · « Thread »
Top « Date » · « Thread »
From Apache Jenkins Server <jenk...@builds.apache.org>
Subject Hadoop-Hdfs-trunk - Build # 2802 - Still Failing
Date Thu, 04 Feb 2016 23:15:54 GMT
See https://builds.apache.org/job/Hadoop-Hdfs-trunk/2802/

###################################################################################
########################## LAST 60 LINES OF THE CONSOLE ###########################
[...truncated 5296 lines...]
[INFO] --- maven-antrun-plugin:1.7:run (create-testdirs) @ hadoop-hdfs-project ---
[INFO] Executing tasks

main:
    [mkdir] Created dir: /home/jenkins/jenkins-slave/workspace/Hadoop-Hdfs-trunk/hadoop-hdfs-project/target/test-dir
[INFO] Executed tasks
[INFO] 
[INFO] --- maven-source-plugin:2.3:jar-no-fork (hadoop-java-sources) @ hadoop-hdfs-project
---
[INFO] 
[INFO] --- maven-source-plugin:2.3:test-jar-no-fork (hadoop-java-sources) @ hadoop-hdfs-project
---
[INFO] 
[INFO] --- maven-enforcer-plugin:1.3.1:enforce (dist-enforce) @ hadoop-hdfs-project ---
[INFO] 
[INFO] --- maven-site-plugin:3.4:attach-descriptor (attach-descriptor) @ hadoop-hdfs-project
---
[INFO] 
[INFO] --- maven-javadoc-plugin:2.8.1:jar (module-javadocs) @ hadoop-hdfs-project ---
[INFO] Skipping javadoc generation
[INFO] 
[INFO] --- maven-enforcer-plugin:1.3.1:enforce (depcheck) @ hadoop-hdfs-project ---
[INFO] 
[INFO] --- maven-checkstyle-plugin:2.15:checkstyle (default-cli) @ hadoop-hdfs-project ---
[INFO] 
[INFO] --- findbugs-maven-plugin:3.0.0:findbugs (default-cli) @ hadoop-hdfs-project ---
[INFO] ------------------------------------------------------------------------
[INFO] Reactor Summary:
[INFO] 
[INFO] Apache Hadoop HDFS Client ......................... SUCCESS [04:15 min]
[INFO] Apache Hadoop HDFS ................................ FAILURE [  03:21 h]
[INFO] Apache Hadoop HDFS Native Client .................. SKIPPED
[INFO] Apache Hadoop HttpFS .............................. SKIPPED
[INFO] Apache Hadoop HDFS BookKeeper Journal ............. SKIPPED
[INFO] Apache Hadoop HDFS-NFS ............................ SKIPPED
[INFO] Apache Hadoop HDFS Project ........................ SUCCESS [  0.064 s]
[INFO] ------------------------------------------------------------------------
[INFO] BUILD FAILURE
[INFO] ------------------------------------------------------------------------
[INFO] Total time: 03:25 h
[INFO] Finished at: 2016-02-04T23:15:46+00:00
[INFO] Final Memory: 70M/1575M
[INFO] ------------------------------------------------------------------------
[ERROR] Failed to execute goal org.apache.maven.plugins:maven-surefire-plugin:2.17:test (default-test)
on project hadoop-hdfs: There are test failures.
[ERROR] 
[ERROR] Please refer to /home/jenkins/jenkins-slave/workspace/Hadoop-Hdfs-trunk/hadoop-hdfs-project/hadoop-hdfs/target/surefire-reports
for the individual test results.
[ERROR] -> [Help 1]
[ERROR] 
[ERROR] To see the full stack trace of the errors, re-run Maven with the -e switch.
[ERROR] Re-run Maven using the -X switch to enable full debug logging.
[ERROR] 
[ERROR] For more information about the errors and possible solutions, please read the following
articles:
[ERROR] [Help 1] http://cwiki.apache.org/confluence/display/MAVEN/MojoFailureException
[ERROR] 
[ERROR] After correcting the problems, you can resume the build with the command
[ERROR]   mvn <goals> -rf :hadoop-hdfs
Build step 'Execute shell' marked build as failure
Archiving artifacts
Recording test results
Sending e-mails to: hdfs-dev@hadoop.apache.org
Email was triggered for: Failure - Any
Sending email for trigger: Failure - Any



###################################################################################
############################## FAILED TESTS (if any) ##############################
1 tests failed.
FAILED:  org.apache.hadoop.hdfs.TestDFSUpgradeFromImage.testUpgradeFromRel1BBWImage

Error Message:
Cannot obtain block length for LocatedBlock{BP-1420961826-67.195.81.145-1454625375996:blk_7162739548153522810_1020;
getBlockSize()=1024; corrupt=false; offset=0; locs=[DatanodeInfoWithStorage[127.0.0.1:44442,DS-56960af5-921c-42eb-9440-04b78707ae8b,DISK]]}

Stack Trace:
java.io.IOException: Cannot obtain block length for LocatedBlock{BP-1420961826-67.195.81.145-1454625375996:blk_7162739548153522810_1020;
getBlockSize()=1024; corrupt=false; offset=0; locs=[DatanodeInfoWithStorage[127.0.0.1:44442,DS-56960af5-921c-42eb-9440-04b78707ae8b,DISK]]}
	at org.apache.hadoop.hdfs.DFSInputStream.readBlockLength(DFSInputStream.java:435)
	at org.apache.hadoop.hdfs.DFSInputStream.fetchLocatedBlocksAndGetLastBlockLength(DFSInputStream.java:345)
	at org.apache.hadoop.hdfs.DFSInputStream.openInfo(DFSInputStream.java:277)
	at org.apache.hadoop.hdfs.DFSInputStream.<init>(DFSInputStream.java:267)
	at org.apache.hadoop.hdfs.DFSClient.open(DFSClient.java:1048)
	at org.apache.hadoop.hdfs.DFSClient.open(DFSClient.java:1013)
	at org.apache.hadoop.hdfs.TestDFSUpgradeFromImage.dfsOpenFileWithRetries(TestDFSUpgradeFromImage.java:178)
	at org.apache.hadoop.hdfs.TestDFSUpgradeFromImage.verifyDir(TestDFSUpgradeFromImage.java:214)
	at org.apache.hadoop.hdfs.TestDFSUpgradeFromImage.verifyFileSystem(TestDFSUpgradeFromImage.java:229)
	at org.apache.hadoop.hdfs.TestDFSUpgradeFromImage.upgradeAndVerify(TestDFSUpgradeFromImage.java:606)
	at org.apache.hadoop.hdfs.TestDFSUpgradeFromImage.testUpgradeFromRel1BBWImage(TestDFSUpgradeFromImage.java:628)



Mime
  • Unnamed multipart/mixed (inline, None, 0 bytes)
View raw message