hadoop-hdfs-dev mailing list archives

Site index · List index
Message view « Date » · « Thread »
Top « Date » · « Thread »
From Apache Jenkins Server <jenk...@builds.apache.org>
Subject Build failed in Jenkins: Hadoop-Hdfs-trunk #2799
Date Thu, 04 Feb 2016 03:26:16 GMT
See <https://builds.apache.org/job/Hadoop-Hdfs-trunk/2799/changes>

Changes:

[jing9] HDFS-9748. Avoid duplication in pendingReplications when

[shv] Move HDFS-9601 to branch-2.8.0 in CHANGES.txt. (shv)

[zhezhang] HDFS-9658. Erasure Coding: allow to use multiple EC policies in striping

[shv] HDFS-9503. Use generic option -fs for NNThroughputBenchmark instead of

[zhezhang] HADOOP-12041. Implement another Reed-Solomon coder in pure Java.

------------------------------------------
[...truncated 5102 lines...]
Tests run: 10, Failures: 0, Errors: 0, Skipped: 0, Time elapsed: 0.314 sec - in org.apache.hadoop.hdfs.TestDFSStripedOutputStreamWithFailure040
Running org.apache.hadoop.hdfs.TestDFSStripedOutputStreamWithFailure170
Tests run: 10, Failures: 0, Errors: 0, Skipped: 0, Time elapsed: 42.072 sec - in org.apache.hadoop.hdfs.TestDFSStripedOutputStreamWithFailure170
Running org.apache.hadoop.hdfs.TestClientReportBadBlock
Tests run: 3, Failures: 0, Errors: 0, Skipped: 0, Time elapsed: 7.954 sec - in org.apache.hadoop.hdfs.TestClientReportBadBlock
Running org.apache.hadoop.hdfs.TestWriteConfigurationToDFS
Tests run: 1, Failures: 0, Errors: 0, Skipped: 0, Time elapsed: 5.769 sec - in org.apache.hadoop.hdfs.TestWriteConfigurationToDFS
Running org.apache.hadoop.hdfs.TestEncryptionZonesWithKMS
Tests run: 23, Failures: 0, Errors: 0, Skipped: 0, Time elapsed: 62.949 sec - in org.apache.hadoop.hdfs.TestEncryptionZonesWithKMS
Running org.apache.hadoop.hdfs.TestFileStatus
Tests run: 5, Failures: 0, Errors: 0, Skipped: 0, Time elapsed: 4.46 sec - in org.apache.hadoop.hdfs.TestFileStatus
Running org.apache.hadoop.hdfs.TestSmallBlock
Tests run: 2, Failures: 0, Errors: 0, Skipped: 0, Time elapsed: 6.182 sec - in org.apache.hadoop.hdfs.TestSmallBlock
Running org.apache.hadoop.hdfs.web.TestWebHDFS
Tests run: 19, Failures: 0, Errors: 0, Skipped: 0, Time elapsed: 116.516 sec - in org.apache.hadoop.hdfs.web.TestWebHDFS
Running org.apache.hadoop.hdfs.web.TestWebHdfsWithMultipleNameNodes
Tests run: 1, Failures: 0, Errors: 0, Skipped: 0, Time elapsed: 9.524 sec - in org.apache.hadoop.hdfs.web.TestWebHdfsWithMultipleNameNodes
Running org.apache.hadoop.hdfs.web.TestAuthFilter
Tests run: 3, Failures: 0, Errors: 0, Skipped: 0, Time elapsed: 0.738 sec - in org.apache.hadoop.hdfs.web.TestAuthFilter
Running org.apache.hadoop.hdfs.web.TestWebHdfsFileSystemContract
Tests run: 52, Failures: 0, Errors: 0, Skipped: 0, Time elapsed: 28.002 sec - in org.apache.hadoop.hdfs.web.TestWebHdfsFileSystemContract
Running org.apache.hadoop.hdfs.web.TestWebHdfsTokens
Tests run: 11, Failures: 0, Errors: 0, Skipped: 0, Time elapsed: 9.421 sec - in org.apache.hadoop.hdfs.web.TestWebHdfsTokens
Running org.apache.hadoop.hdfs.web.TestJsonUtil
Tests run: 8, Failures: 0, Errors: 0, Skipped: 0, Time elapsed: 0.631 sec - in org.apache.hadoop.hdfs.web.TestJsonUtil
Running org.apache.hadoop.hdfs.web.TestFSMainOperationsWebHdfs
Tests run: 52, Failures: 0, Errors: 0, Skipped: 0, Time elapsed: 10.667 sec - in org.apache.hadoop.hdfs.web.TestFSMainOperationsWebHdfs
Running org.apache.hadoop.hdfs.web.TestWebHDFSAcl
Tests run: 64, Failures: 0, Errors: 0, Skipped: 1, Time elapsed: 29.504 sec - in org.apache.hadoop.hdfs.web.TestWebHDFSAcl
Running org.apache.hadoop.hdfs.web.TestWebHdfsUrl
Tests run: 6, Failures: 0, Errors: 0, Skipped: 0, Time elapsed: 2.007 sec - in org.apache.hadoop.hdfs.web.TestWebHdfsUrl
Running org.apache.hadoop.hdfs.web.TestWebHDFSForHA
Tests run: 6, Failures: 0, Errors: 0, Skipped: 0, Time elapsed: 15.062 sec - in org.apache.hadoop.hdfs.web.TestWebHDFSForHA
Running org.apache.hadoop.hdfs.web.TestHttpsFileSystem
Tests run: 1, Failures: 0, Errors: 0, Skipped: 0, Time elapsed: 6.687 sec - in org.apache.hadoop.hdfs.web.TestHttpsFileSystem
Running org.apache.hadoop.hdfs.web.resources.TestParam
Tests run: 29, Failures: 0, Errors: 0, Skipped: 0, Time elapsed: 0.712 sec - in org.apache.hadoop.hdfs.web.resources.TestParam
Running org.apache.hadoop.hdfs.web.TestWebHdfsWithAuthenticationFilter
Tests run: 1, Failures: 0, Errors: 0, Skipped: 0, Time elapsed: 5.359 sec - in org.apache.hadoop.hdfs.web.TestWebHdfsWithAuthenticationFilter
Running org.apache.hadoop.hdfs.web.TestWebHDFSXAttr
Tests run: 12, Failures: 0, Errors: 0, Skipped: 0, Time elapsed: 16.962 sec - in org.apache.hadoop.hdfs.web.TestWebHDFSXAttr
Running org.apache.hadoop.hdfs.web.TestWebHdfsTimeouts
Tests run: 8, Failures: 0, Errors: 0, Skipped: 0, Time elapsed: 1.821 sec - in org.apache.hadoop.hdfs.web.TestWebHdfsTimeouts
Running org.apache.hadoop.hdfs.TestClientBlockVerification
Tests run: 4, Failures: 0, Errors: 0, Skipped: 0, Time elapsed: 5.177 sec - in org.apache.hadoop.hdfs.TestClientBlockVerification
Running org.apache.hadoop.hdfs.TestDFSStripedOutputStreamWithFailure130
Tests run: 10, Failures: 0, Errors: 0, Skipped: 0, Time elapsed: 105.983 sec - in org.apache.hadoop.hdfs.TestDFSStripedOutputStreamWithFailure130
Running org.apache.hadoop.hdfs.TestHDFSTrash
Tests run: 2, Failures: 0, Errors: 0, Skipped: 0, Time elapsed: 5.568 sec - in org.apache.hadoop.hdfs.TestHDFSTrash
Running org.apache.hadoop.net.TestNetworkTopology
Tests run: 10, Failures: 0, Errors: 0, Skipped: 0, Time elapsed: 9.117 sec - in org.apache.hadoop.net.TestNetworkTopology
Running org.apache.hadoop.security.TestPermission
Tests run: 3, Failures: 0, Errors: 0, Skipped: 0, Time elapsed: 6.25 sec - in org.apache.hadoop.security.TestPermission
Running org.apache.hadoop.security.TestRefreshUserMappings
Tests run: 2, Failures: 0, Errors: 0, Skipped: 0, Time elapsed: 5.803 sec - in org.apache.hadoop.security.TestRefreshUserMappings
Running org.apache.hadoop.security.TestPermissionSymlinks
Tests run: 15, Failures: 0, Errors: 0, Skipped: 0, Time elapsed: 5.588 sec - in org.apache.hadoop.security.TestPermissionSymlinks
Running org.apache.hadoop.cli.TestDeleteCLI
Tests run: 1, Failures: 0, Errors: 0, Skipped: 0, Time elapsed: 7.2 sec - in org.apache.hadoop.cli.TestDeleteCLI
Running org.apache.hadoop.cli.TestCacheAdminCLI
Tests run: 1, Failures: 0, Errors: 0, Skipped: 0, Time elapsed: 6.764 sec - in org.apache.hadoop.cli.TestCacheAdminCLI
Running org.apache.hadoop.cli.TestAclCLI
Tests run: 1, Failures: 0, Errors: 0, Skipped: 0, Time elapsed: 5.865 sec - in org.apache.hadoop.cli.TestAclCLI
Running org.apache.hadoop.cli.TestHDFSCLI
Tests run: 1, Failures: 0, Errors: 0, Skipped: 0, Time elapsed: 34.737 sec - in org.apache.hadoop.cli.TestHDFSCLI
Running org.apache.hadoop.cli.TestCryptoAdminCLI
Tests run: 1, Failures: 0, Errors: 0, Skipped: 0, Time elapsed: 6.916 sec - in org.apache.hadoop.cli.TestCryptoAdminCLI
Running org.apache.hadoop.cli.TestXAttrCLI
Tests run: 1, Failures: 0, Errors: 0, Skipped: 0, Time elapsed: 7.065 sec - in org.apache.hadoop.cli.TestXAttrCLI
Running org.apache.hadoop.cli.TestErasureCodingCLI
Tests run: 1, Failures: 0, Errors: 0, Skipped: 0, Time elapsed: 7.048 sec - in org.apache.hadoop.cli.TestErasureCodingCLI
Running org.apache.hadoop.tools.TestJMXGet
Tests run: 2, Failures: 0, Errors: 0, Skipped: 0, Time elapsed: 5.613 sec - in org.apache.hadoop.tools.TestJMXGet
Running org.apache.hadoop.tools.TestTools
Tests run: 5, Failures: 0, Errors: 0, Skipped: 0, Time elapsed: 1.496 sec - in org.apache.hadoop.tools.TestTools
Running org.apache.hadoop.tools.TestHdfsConfigFields
Tests run: 2, Failures: 0, Errors: 0, Skipped: 0, Time elapsed: 0.671 sec - in org.apache.hadoop.tools.TestHdfsConfigFields
Running org.apache.hadoop.fs.TestFcHdfsCreateMkdir
Tests run: 8, Failures: 0, Errors: 0, Skipped: 0, Time elapsed: 4.648 sec - in org.apache.hadoop.fs.TestFcHdfsCreateMkdir
Running org.apache.hadoop.fs.viewfs.TestViewFsWithXAttrs
Tests run: 1, Failures: 0, Errors: 0, Skipped: 0, Time elapsed: 4.596 sec - in org.apache.hadoop.fs.viewfs.TestViewFsWithXAttrs
Running org.apache.hadoop.fs.viewfs.TestViewFileSystemAtHdfsRoot
Tests run: 60, Failures: 0, Errors: 0, Skipped: 0, Time elapsed: 9.613 sec - in org.apache.hadoop.fs.viewfs.TestViewFileSystemAtHdfsRoot
Running org.apache.hadoop.fs.viewfs.TestViewFsAtHdfsRoot
Tests run: 58, Failures: 0, Errors: 0, Skipped: 0, Time elapsed: 8.61 sec - in org.apache.hadoop.fs.viewfs.TestViewFsAtHdfsRoot
Running org.apache.hadoop.fs.viewfs.TestViewFsHdfs
Tests run: 58, Failures: 0, Errors: 0, Skipped: 0, Time elapsed: 8.167 sec - in org.apache.hadoop.fs.viewfs.TestViewFsHdfs
Running org.apache.hadoop.fs.viewfs.TestViewFsWithAcls
Tests run: 1, Failures: 0, Errors: 0, Skipped: 0, Time elapsed: 4.519 sec - in org.apache.hadoop.fs.viewfs.TestViewFsWithAcls
Running org.apache.hadoop.fs.viewfs.TestViewFsDefaultValue
Tests run: 7, Failures: 0, Errors: 0, Skipped: 0, Time elapsed: 4.057 sec - in org.apache.hadoop.fs.viewfs.TestViewFsDefaultValue
Running org.apache.hadoop.fs.viewfs.TestViewFileSystemWithXAttrs
Tests run: 1, Failures: 0, Errors: 0, Skipped: 0, Time elapsed: 4.624 sec - in org.apache.hadoop.fs.viewfs.TestViewFileSystemWithXAttrs
Running org.apache.hadoop.fs.viewfs.TestViewFsFileStatusHdfs
Tests run: 2, Failures: 0, Errors: 0, Skipped: 0, Time elapsed: 4.346 sec - in org.apache.hadoop.fs.viewfs.TestViewFsFileStatusHdfs
Running org.apache.hadoop.fs.viewfs.TestViewFileSystemHdfs
Tests run: 60, Failures: 0, Errors: 0, Skipped: 0, Time elapsed: 9.705 sec - in org.apache.hadoop.fs.viewfs.TestViewFileSystemHdfs
Running org.apache.hadoop.fs.viewfs.TestViewFileSystemWithAcls
Tests run: 1, Failures: 0, Errors: 0, Skipped: 0, Time elapsed: 4.642 sec - in org.apache.hadoop.fs.viewfs.TestViewFileSystemWithAcls
Running org.apache.hadoop.fs.TestFcHdfsSetUMask
Tests run: 12, Failures: 0, Errors: 0, Skipped: 0, Time elapsed: 4.843 sec - in org.apache.hadoop.fs.TestFcHdfsSetUMask
Running org.apache.hadoop.fs.TestSymlinkHdfsFileSystem
Tests run: 74, Failures: 0, Errors: 0, Skipped: 2, Time elapsed: 9.669 sec - in org.apache.hadoop.fs.TestSymlinkHdfsFileSystem
Running org.apache.hadoop.fs.TestEnhancedByteBufferAccess
Tests run: 10, Failures: 0, Errors: 0, Skipped: 1, Time elapsed: 15.558 sec - in org.apache.hadoop.fs.TestEnhancedByteBufferAccess
Running org.apache.hadoop.fs.TestWebHdfsFileContextMainOperations
Tests run: 60, Failures: 0, Errors: 0, Skipped: 0, Time elapsed: 11.139 sec - in org.apache.hadoop.fs.TestWebHdfsFileContextMainOperations
Running org.apache.hadoop.fs.TestFcHdfsPermission
Tests run: 4, Failures: 0, Errors: 0, Skipped: 0, Time elapsed: 4.723 sec - in org.apache.hadoop.fs.TestFcHdfsPermission
Running org.apache.hadoop.fs.TestHDFSFileContextMainOperations
Tests run: 68, Failures: 0, Errors: 0, Skipped: 0, Time elapsed: 8.035 sec - in org.apache.hadoop.fs.TestHDFSFileContextMainOperations
Running org.apache.hadoop.fs.TestHdfsNativeCodeLoader
Tests run: 1, Failures: 0, Errors: 0, Skipped: 0, Time elapsed: 0.198 sec - in org.apache.hadoop.fs.TestHdfsNativeCodeLoader
Running org.apache.hadoop.fs.TestSWebHdfsFileContextMainOperations
Tests run: 60, Failures: 0, Errors: 0, Skipped: 0, Time elapsed: 88.783 sec - in org.apache.hadoop.fs.TestSWebHdfsFileContextMainOperations
Running org.apache.hadoop.fs.TestUrlStreamHandler
Tests run: 2, Failures: 0, Errors: 0, Skipped: 0, Time elapsed: 4.788 sec - in org.apache.hadoop.fs.TestUrlStreamHandler
Running org.apache.hadoop.fs.TestResolveHdfsSymlink
Tests run: 4, Failures: 0, Errors: 0, Skipped: 0, Time elapsed: 4.102 sec - in org.apache.hadoop.fs.TestResolveHdfsSymlink
Running org.apache.hadoop.fs.permission.TestStickyBit
Tests run: 6, Failures: 0, Errors: 0, Skipped: 0, Time elapsed: 8.602 sec - in org.apache.hadoop.fs.permission.TestStickyBit
Running org.apache.hadoop.fs.shell.TestHdfsTextCommand
Tests run: 1, Failures: 0, Errors: 0, Skipped: 0, Time elapsed: 4.665 sec - in org.apache.hadoop.fs.shell.TestHdfsTextCommand
Running org.apache.hadoop.fs.contract.hdfs.TestHDFSContractDelete
Tests run: 8, Failures: 0, Errors: 0, Skipped: 0, Time elapsed: 4.977 sec - in org.apache.hadoop.fs.contract.hdfs.TestHDFSContractDelete
Running org.apache.hadoop.fs.contract.hdfs.TestHDFSContractSetTimes
Tests run: 1, Failures: 0, Errors: 0, Skipped: 0, Time elapsed: 4.151 sec - in org.apache.hadoop.fs.contract.hdfs.TestHDFSContractSetTimes
Running org.apache.hadoop.fs.contract.hdfs.TestHDFSContractRename
Tests run: 6, Failures: 0, Errors: 0, Skipped: 0, Time elapsed: 5.055 sec - in org.apache.hadoop.fs.contract.hdfs.TestHDFSContractRename
Running org.apache.hadoop.fs.contract.hdfs.TestHDFSContractOpen
Tests run: 6, Failures: 0, Errors: 0, Skipped: 0, Time elapsed: 4.993 sec - in org.apache.hadoop.fs.contract.hdfs.TestHDFSContractOpen
Running org.apache.hadoop.fs.contract.hdfs.TestHDFSContractGetFileStatus
Tests run: 1, Failures: 0, Errors: 0, Skipped: 0, Time elapsed: 4.117 sec - in org.apache.hadoop.fs.contract.hdfs.TestHDFSContractGetFileStatus
Running org.apache.hadoop.fs.contract.hdfs.TestHDFSContractMkdir
Tests run: 5, Failures: 0, Errors: 0, Skipped: 0, Time elapsed: 4.958 sec - in org.apache.hadoop.fs.contract.hdfs.TestHDFSContractMkdir
Running org.apache.hadoop.fs.contract.hdfs.TestHDFSContractSeek
Tests run: 10, Failures: 0, Errors: 0, Skipped: 0, Time elapsed: 7.376 sec - in org.apache.hadoop.fs.contract.hdfs.TestHDFSContractSeek
Running org.apache.hadoop.fs.contract.hdfs.TestHDFSContractCreate
Tests run: 6, Failures: 0, Errors: 0, Skipped: 0, Time elapsed: 5.093 sec - in org.apache.hadoop.fs.contract.hdfs.TestHDFSContractCreate
Running org.apache.hadoop.fs.contract.hdfs.TestHDFSContractRootDirectory
Tests run: 6, Failures: 0, Errors: 0, Skipped: 0, Time elapsed: 4.474 sec - in org.apache.hadoop.fs.contract.hdfs.TestHDFSContractRootDirectory
Running org.apache.hadoop.fs.contract.hdfs.TestHDFSContractConcat
Tests run: 4, Failures: 0, Errors: 0, Skipped: 0, Time elapsed: 4.96 sec - in org.apache.hadoop.fs.contract.hdfs.TestHDFSContractConcat
Running org.apache.hadoop.fs.contract.hdfs.TestHDFSContractAppend
Tests run: 5, Failures: 0, Errors: 0, Skipped: 0, Time elapsed: 5.241 sec - in org.apache.hadoop.fs.contract.hdfs.TestHDFSContractAppend
Running org.apache.hadoop.fs.loadGenerator.TestLoadGenerator
Tests run: 2, Failures: 0, Errors: 0, Skipped: 0, Time elapsed: 14.899 sec - in org.apache.hadoop.fs.loadGenerator.TestLoadGenerator
Running org.apache.hadoop.fs.TestGlobPaths
Tests run: 36, Failures: 0, Errors: 0, Skipped: 6, Time elapsed: 5.753 sec - in org.apache.hadoop.fs.TestGlobPaths
Running org.apache.hadoop.fs.TestSymlinkHdfsDisable
Tests run: 1, Failures: 0, Errors: 0, Skipped: 0, Time elapsed: 4.146 sec - in org.apache.hadoop.fs.TestSymlinkHdfsDisable
Running org.apache.hadoop.fs.TestSymlinkHdfsFileContext
Tests run: 71, Failures: 0, Errors: 0, Skipped: 0, Time elapsed: 9.588 sec - in org.apache.hadoop.fs.TestSymlinkHdfsFileContext
Running org.apache.hadoop.fs.TestUnbuffer
Tests run: 2, Failures: 0, Errors: 0, Skipped: 0, Time elapsed: 7.39 sec - in org.apache.hadoop.fs.TestUnbuffer
Running org.apache.hadoop.TestGenericRefresh
Tests run: 9, Failures: 0, Errors: 0, Skipped: 0, Time elapsed: 4.377 sec - in org.apache.hadoop.TestGenericRefresh

Results :

Failed tests: 
  TestDatanodeStartupFixesLegacyStorageIDs.testUpgradeFrom22FixesStorageIDs:115->runLayoutUpgradeTest:70->upgradeAndVerify:103
null

Tests run: 4156, Failures: 1, Errors: 0, Skipped: 17

[INFO]                                                                         
[INFO] ------------------------------------------------------------------------
[INFO] Skipping Apache Hadoop HDFS Native Client
[INFO] This project has been banned from the build due to previous failures.
[INFO] ------------------------------------------------------------------------
[INFO]                                                                         
[INFO] ------------------------------------------------------------------------
[INFO] Skipping Apache Hadoop HttpFS
[INFO] This project has been banned from the build due to previous failures.
[INFO] ------------------------------------------------------------------------
[INFO]                                                                         
[INFO] ------------------------------------------------------------------------
[INFO] Skipping Apache Hadoop HDFS BookKeeper Journal
[INFO] This project has been banned from the build due to previous failures.
[INFO] ------------------------------------------------------------------------
[INFO]                                                                         
[INFO] ------------------------------------------------------------------------
[INFO] Skipping Apache Hadoop HDFS-NFS
[INFO] This project has been banned from the build due to previous failures.
[INFO] ------------------------------------------------------------------------
[INFO]                                                                         
[INFO] ------------------------------------------------------------------------
[INFO] Building Apache Hadoop HDFS Project 3.0.0-SNAPSHOT
[INFO] ------------------------------------------------------------------------
[INFO] 
[INFO] --- maven-clean-plugin:2.5:clean (default-clean) @ hadoop-hdfs-project ---
[INFO] Deleting <https://builds.apache.org/job/Hadoop-Hdfs-trunk/ws/hadoop-hdfs-project/target>
[INFO] 
[INFO] --- maven-antrun-plugin:1.7:run (create-testdirs) @ hadoop-hdfs-project ---
[INFO] Executing tasks

main:
    [mkdir] Created dir: <https://builds.apache.org/job/Hadoop-Hdfs-trunk/ws/hadoop-hdfs-project/target/test-dir>
[INFO] Executed tasks
[INFO] 
[INFO] --- maven-source-plugin:2.3:jar-no-fork (hadoop-java-sources) @ hadoop-hdfs-project
---
[INFO] 
[INFO] --- maven-source-plugin:2.3:test-jar-no-fork (hadoop-java-sources) @ hadoop-hdfs-project
---
[INFO] 
[INFO] --- maven-enforcer-plugin:1.3.1:enforce (dist-enforce) @ hadoop-hdfs-project ---
[INFO] 
[INFO] --- maven-site-plugin:3.4:attach-descriptor (attach-descriptor) @ hadoop-hdfs-project
---
[INFO] 
[INFO] --- maven-javadoc-plugin:2.8.1:jar (module-javadocs) @ hadoop-hdfs-project ---
[INFO] Skipping javadoc generation
[INFO] 
[INFO] --- maven-enforcer-plugin:1.3.1:enforce (depcheck) @ hadoop-hdfs-project ---
[INFO] 
[INFO] --- maven-checkstyle-plugin:2.15:checkstyle (default-cli) @ hadoop-hdfs-project ---
[INFO] 
[INFO] --- findbugs-maven-plugin:3.0.0:findbugs (default-cli) @ hadoop-hdfs-project ---
[INFO] ------------------------------------------------------------------------
[INFO] Reactor Summary:
[INFO] 
[INFO] Apache Hadoop HDFS Client ......................... SUCCESS [03:53 min]
[INFO] Apache Hadoop HDFS ................................ FAILURE [  03:18 h]
[INFO] Apache Hadoop HDFS Native Client .................. SKIPPED
[INFO] Apache Hadoop HttpFS .............................. SKIPPED
[INFO] Apache Hadoop HDFS BookKeeper Journal ............. SKIPPED
[INFO] Apache Hadoop HDFS-NFS ............................ SKIPPED
[INFO] Apache Hadoop HDFS Project ........................ SUCCESS [  0.057 s]
[INFO] ------------------------------------------------------------------------
[INFO] BUILD FAILURE
[INFO] ------------------------------------------------------------------------
[INFO] Total time: 03:22 h
[INFO] Finished at: 2016-02-04T03:26:08+00:00
[INFO] Final Memory: 56M/801M
[INFO] ------------------------------------------------------------------------
[ERROR] Failed to execute goal org.apache.maven.plugins:maven-surefire-plugin:2.17:test (default-test)
on project hadoop-hdfs: There are test failures.
[ERROR] 
[ERROR] Please refer to <https://builds.apache.org/job/Hadoop-Hdfs-trunk/ws/hadoop-hdfs-project/hadoop-hdfs/target/surefire-reports>
for the individual test results.
[ERROR] -> [Help 1]
[ERROR] 
[ERROR] To see the full stack trace of the errors, re-run Maven with the -e switch.
[ERROR] Re-run Maven using the -X switch to enable full debug logging.
[ERROR] 
[ERROR] For more information about the errors and possible solutions, please read the following
articles:
[ERROR] [Help 1] http://cwiki.apache.org/confluence/display/MAVEN/MojoFailureException
[ERROR] 
[ERROR] After correcting the problems, you can resume the build with the command
[ERROR]   mvn <goals> -rf :hadoop-hdfs
Build step 'Execute shell' marked build as failure
Archiving artifacts
Recording test results

Mime
View raw message