hadoop-hdfs-dev mailing list archives

Site index · List index
Message view « Date » · « Thread »
Top « Date » · « Thread »
From Apache Jenkins Server <jenk...@builds.apache.org>
Subject Build failed in Jenkins: Hadoop-Hdfs-trunk #2812
Date Mon, 08 Feb 2016 20:45:27 GMT
See <https://builds.apache.org/job/Hadoop-Hdfs-trunk/2812/changes>

Changes:

[vvasudev] Revert "HADOOP-12749. Create a threadpoolexecutor that overrides

[vvasudev] HADOOP-12749. Create a threadpoolexecutor that overrides afterExecute to

------------------------------------------
[...truncated 5634 lines...]
Running org.apache.hadoop.hdfs.TestDFSStripedOutputStreamWithFailure180
Tests run: 10, Failures: 0, Errors: 0, Skipped: 0, Time elapsed: 128.312 sec - in org.apache.hadoop.hdfs.TestDFSStripedOutputStreamWithFailure180
Running org.apache.hadoop.hdfs.TestDFSStripedInputStream
Tests run: 4, Failures: 0, Errors: 0, Skipped: 0, Time elapsed: 34.04 sec - in org.apache.hadoop.hdfs.TestDFSStripedInputStream
Running org.apache.hadoop.hdfs.TestDisableConnCache
Tests run: 1, Failures: 0, Errors: 0, Skipped: 0, Time elapsed: 7.685 sec - in org.apache.hadoop.hdfs.TestDisableConnCache
Running org.apache.hadoop.hdfs.qjournal.TestSecureNNWithQJM
Tests run: 2, Failures: 0, Errors: 0, Skipped: 0, Time elapsed: 62.174 sec - in org.apache.hadoop.hdfs.qjournal.TestSecureNNWithQJM
Running org.apache.hadoop.hdfs.qjournal.server.TestJournalNode
Tests run: 6, Failures: 0, Errors: 0, Skipped: 0, Time elapsed: 16.42 sec - in org.apache.hadoop.hdfs.qjournal.server.TestJournalNode
Running org.apache.hadoop.hdfs.qjournal.server.TestJournal
Tests run: 12, Failures: 0, Errors: 0, Skipped: 0, Time elapsed: 4.909 sec - in org.apache.hadoop.hdfs.qjournal.server.TestJournal
Running org.apache.hadoop.hdfs.qjournal.server.TestJournalNodeMXBean
Tests run: 1, Failures: 0, Errors: 0, Skipped: 0, Time elapsed: 3.834 sec - in org.apache.hadoop.hdfs.qjournal.server.TestJournalNodeMXBean
Running org.apache.hadoop.hdfs.qjournal.client.TestQuorumJournalManagerUnit
Tests run: 6, Failures: 0, Errors: 0, Skipped: 0, Time elapsed: 2.312 sec - in org.apache.hadoop.hdfs.qjournal.client.TestQuorumJournalManagerUnit
Running org.apache.hadoop.hdfs.qjournal.client.TestQuorumJournalManager
Tests run: 21, Failures: 0, Errors: 0, Skipped: 0, Time elapsed: 54.504 sec - in org.apache.hadoop.hdfs.qjournal.client.TestQuorumJournalManager
Running org.apache.hadoop.hdfs.qjournal.client.TestSegmentRecoveryComparator
Tests run: 1, Failures: 0, Errors: 0, Skipped: 0, Time elapsed: 0.45 sec - in org.apache.hadoop.hdfs.qjournal.client.TestSegmentRecoveryComparator
Running org.apache.hadoop.hdfs.qjournal.client.TestIPCLoggerChannel
Tests run: 3, Failures: 0, Errors: 0, Skipped: 0, Time elapsed: 1.786 sec - in org.apache.hadoop.hdfs.qjournal.client.TestIPCLoggerChannel
Running org.apache.hadoop.hdfs.qjournal.client.TestEpochsAreUnique
Tests run: 1, Failures: 0, Errors: 0, Skipped: 0, Time elapsed: 13.692 sec - in org.apache.hadoop.hdfs.qjournal.client.TestEpochsAreUnique
Running org.apache.hadoop.hdfs.qjournal.client.TestQJMWithFaults
Tests run: 2, Failures: 0, Errors: 0, Skipped: 0, Time elapsed: 331.327 sec - in org.apache.hadoop.hdfs.qjournal.client.TestQJMWithFaults
Running org.apache.hadoop.hdfs.qjournal.client.TestQuorumCall
Tests run: 1, Failures: 0, Errors: 0, Skipped: 0, Time elapsed: 0.366 sec - in org.apache.hadoop.hdfs.qjournal.client.TestQuorumCall
Running org.apache.hadoop.hdfs.qjournal.TestMiniJournalCluster
Tests run: 1, Failures: 0, Errors: 0, Skipped: 0, Time elapsed: 4.206 sec - in org.apache.hadoop.hdfs.qjournal.TestMiniJournalCluster
Running org.apache.hadoop.hdfs.qjournal.TestNNWithQJM
Tests run: 3, Failures: 0, Errors: 0, Skipped: 0, Time elapsed: 14.524 sec - in org.apache.hadoop.hdfs.qjournal.TestNNWithQJM
Running org.apache.hadoop.hdfs.TestConnCache
Tests run: 1, Failures: 0, Errors: 0, Skipped: 0, Time elapsed: 7.042 sec - in org.apache.hadoop.hdfs.TestConnCache
Running org.apache.hadoop.hdfs.TestDFSStorageStateRecovery
Tests run: 3, Failures: 0, Errors: 0, Skipped: 0, Time elapsed: 117.457 sec - in org.apache.hadoop.hdfs.TestDFSStorageStateRecovery
Running org.apache.hadoop.hdfs.TestDFSInputStream
Tests run: 4, Failures: 0, Errors: 0, Skipped: 0, Time elapsed: 19.756 sec - in org.apache.hadoop.hdfs.TestDFSInputStream
Running org.apache.hadoop.hdfs.TestFileAppend
Tests run: 12, Failures: 0, Errors: 0, Skipped: 0, Time elapsed: 49.141 sec - in org.apache.hadoop.hdfs.TestFileAppend
Running org.apache.hadoop.hdfs.TestFileAppend3
Tests run: 15, Failures: 0, Errors: 0, Skipped: 0, Time elapsed: 107.66 sec - in org.apache.hadoop.hdfs.TestFileAppend3
Running org.apache.hadoop.hdfs.TestClientReportBadBlock
Tests run: 3, Failures: 0, Errors: 0, Skipped: 0, Time elapsed: 15.53 sec - in org.apache.hadoop.hdfs.TestClientReportBadBlock
Running org.apache.hadoop.hdfs.TestReadStripedFileWithDecoding
Tests run: 5, Failures: 0, Errors: 0, Skipped: 0, Time elapsed: 218.457 sec - in org.apache.hadoop.hdfs.TestReadStripedFileWithDecoding
Running org.apache.hadoop.hdfs.TestParallelShortCircuitReadNoChecksum
Tests run: 4, Failures: 0, Errors: 0, Skipped: 0, Time elapsed: 22.028 sec - in org.apache.hadoop.hdfs.TestParallelShortCircuitReadNoChecksum
Running org.apache.hadoop.hdfs.TestFileCreation
Tests run: 23, Failures: 0, Errors: 0, Skipped: 0, Time elapsed: 108.255 sec - in org.apache.hadoop.hdfs.TestFileCreation
Running org.apache.hadoop.hdfs.TestDFSRemove
Tests run: 1, Failures: 0, Errors: 0, Skipped: 0, Time elapsed: 19.019 sec - in org.apache.hadoop.hdfs.TestDFSRemove
Running org.apache.hadoop.hdfs.TestDFSClientSocketSize
Tests run: 3, Failures: 0, Errors: 0, Skipped: 0, Time elapsed: 9.766 sec - in org.apache.hadoop.hdfs.TestDFSClientSocketSize
Running org.apache.hadoop.hdfs.TestHdfsAdmin
Tests run: 2, Failures: 0, Errors: 0, Skipped: 0, Time elapsed: 6.438 sec - in org.apache.hadoop.hdfs.TestHdfsAdmin
Running org.apache.hadoop.hdfs.TestDFSStripedOutputStreamWithFailure130
Tests run: 10, Failures: 0, Errors: 0, Skipped: 0, Time elapsed: 0.464 sec - in org.apache.hadoop.hdfs.TestDFSStripedOutputStreamWithFailure130
Running org.apache.hadoop.hdfs.TestDFSUtil
Tests run: 31, Failures: 0, Errors: 0, Skipped: 0, Time elapsed: 4.165 sec - in org.apache.hadoop.hdfs.TestDFSUtil
Running org.apache.hadoop.hdfs.TestErasureCodeBenchmarkThroughput
Tests run: 3, Failures: 0, Errors: 0, Skipped: 0, Time elapsed: 17.782 sec - in org.apache.hadoop.hdfs.TestErasureCodeBenchmarkThroughput
Running org.apache.hadoop.hdfs.TestWriteBlockGetsBlockLengthHint
Tests run: 1, Failures: 0, Errors: 0, Skipped: 0, Time elapsed: 6.374 sec - in org.apache.hadoop.hdfs.TestWriteBlockGetsBlockLengthHint
Running org.apache.hadoop.hdfs.TestDataTransferKeepalive
Tests run: 4, Failures: 0, Errors: 0, Skipped: 0, Time elapsed: 24.134 sec - in org.apache.hadoop.hdfs.TestDataTransferKeepalive
Running org.apache.hadoop.hdfs.TestDFSStripedOutputStreamWithFailure060
Tests run: 10, Failures: 0, Errors: 0, Skipped: 0, Time elapsed: 0.464 sec - in org.apache.hadoop.hdfs.TestDFSStripedOutputStreamWithFailure060
Running org.apache.hadoop.hdfs.TestLease
Tests run: 5, Failures: 0, Errors: 0, Skipped: 0, Time elapsed: 14.951 sec - in org.apache.hadoop.hdfs.TestLease
Running org.apache.hadoop.hdfs.TestDFSStripedOutputStreamWithFailure
Tests run: 4, Failures: 0, Errors: 0, Skipped: 0, Time elapsed: 142.763 sec - in org.apache.hadoop.hdfs.TestDFSStripedOutputStreamWithFailure
Running org.apache.hadoop.hdfs.TestDFSStripedOutputStreamWithFailure070
Tests run: 10, Failures: 0, Errors: 0, Skipped: 0, Time elapsed: 0.465 sec - in org.apache.hadoop.hdfs.TestDFSStripedOutputStreamWithFailure070
Running org.apache.hadoop.hdfs.TestEncryptionZonesWithKMS
Tests run: 23, Failures: 0, Errors: 0, Skipped: 0, Time elapsed: 93.759 sec - in org.apache.hadoop.hdfs.TestEncryptionZonesWithKMS
Running org.apache.hadoop.hdfs.TestReconstructStripedFile
Tests run: 13, Failures: 0, Errors: 0, Skipped: 0, Time elapsed: 115.936 sec - in org.apache.hadoop.hdfs.TestReconstructStripedFile
Running org.apache.hadoop.hdfs.TestAbandonBlock
Tests run: 2, Failures: 0, Errors: 0, Skipped: 0, Time elapsed: 15.617 sec - in org.apache.hadoop.hdfs.TestAbandonBlock
Running org.apache.hadoop.hdfs.TestExternalBlockReader
Tests run: 2, Failures: 0, Errors: 0, Skipped: 0, Time elapsed: 10.703 sec - in org.apache.hadoop.hdfs.TestExternalBlockReader
Running org.apache.hadoop.hdfs.TestFileCreationClient
Tests run: 1, Failures: 0, Errors: 0, Skipped: 0, Time elapsed: 54.692 sec - in org.apache.hadoop.hdfs.TestFileCreationClient
Running org.apache.hadoop.hdfs.TestDFSStripedOutputStreamWithFailure020
Tests run: 10, Failures: 0, Errors: 0, Skipped: 0, Time elapsed: 60.708 sec - in org.apache.hadoop.hdfs.TestDFSStripedOutputStreamWithFailure020
Running org.apache.hadoop.hdfs.TestFileCreationDelete
Tests run: 1, Failures: 0, Errors: 0, Skipped: 0, Time elapsed: 19.436 sec - in org.apache.hadoop.hdfs.TestFileCreationDelete
Running org.apache.hadoop.tracing.TestTraceAdmin
Tests run: 1, Failures: 0, Errors: 0, Skipped: 0, Time elapsed: 7.385 sec - in org.apache.hadoop.tracing.TestTraceAdmin
Running org.apache.hadoop.tracing.TestTracing
Tests run: 1, Failures: 0, Errors: 0, Skipped: 0, Time elapsed: 10.337 sec - in org.apache.hadoop.tracing.TestTracing
Running org.apache.hadoop.tracing.TestTracingShortCircuitLocalRead
Tests run: 1, Failures: 0, Errors: 0, Skipped: 0, Time elapsed: 8.938 sec - in org.apache.hadoop.tracing.TestTracingShortCircuitLocalRead
Running org.apache.hadoop.net.TestNetworkTopology
Tests run: 10, Failures: 0, Errors: 0, Skipped: 0, Time elapsed: 13.308 sec - in org.apache.hadoop.net.TestNetworkTopology
Running org.apache.hadoop.TestGenericRefresh
Tests run: 9, Failures: 0, Errors: 0, Skipped: 0, Time elapsed: 6.521 sec - in org.apache.hadoop.TestGenericRefresh
Running org.apache.hadoop.tools.TestHdfsConfigFields
Tests run: 2, Failures: 0, Errors: 0, Skipped: 0, Time elapsed: 0.948 sec - in org.apache.hadoop.tools.TestHdfsConfigFields
Running org.apache.hadoop.tools.TestTools
Tests run: 5, Failures: 0, Errors: 0, Skipped: 0, Time elapsed: 2.585 sec - in org.apache.hadoop.tools.TestTools
Running org.apache.hadoop.tools.TestJMXGet
Tests run: 2, Failures: 0, Errors: 0, Skipped: 0, Time elapsed: 12.734 sec - in org.apache.hadoop.tools.TestJMXGet
Running org.apache.hadoop.cli.TestErasureCodingCLI
Tests run: 1, Failures: 0, Errors: 0, Skipped: 0, Time elapsed: 10.841 sec - in org.apache.hadoop.cli.TestErasureCodingCLI
Running org.apache.hadoop.cli.TestHDFSCLI
Tests run: 1, Failures: 0, Errors: 0, Skipped: 0, Time elapsed: 50.012 sec - in org.apache.hadoop.cli.TestHDFSCLI
Running org.apache.hadoop.cli.TestCryptoAdminCLI
Tests run: 1, Failures: 0, Errors: 0, Skipped: 0, Time elapsed: 9.67 sec - in org.apache.hadoop.cli.TestCryptoAdminCLI
Running org.apache.hadoop.cli.TestAclCLI
Tests run: 1, Failures: 0, Errors: 0, Skipped: 0, Time elapsed: 8.774 sec - in org.apache.hadoop.cli.TestAclCLI
Running org.apache.hadoop.cli.TestDeleteCLI
Tests run: 1, Failures: 0, Errors: 0, Skipped: 0, Time elapsed: 10.501 sec - in org.apache.hadoop.cli.TestDeleteCLI
Running org.apache.hadoop.cli.TestXAttrCLI
Tests run: 1, Failures: 0, Errors: 0, Skipped: 0, Time elapsed: 9.897 sec - in org.apache.hadoop.cli.TestXAttrCLI
Running org.apache.hadoop.cli.TestCacheAdminCLI
Tests run: 1, Failures: 0, Errors: 0, Skipped: 0, Time elapsed: 9.957 sec - in org.apache.hadoop.cli.TestCacheAdminCLI
Running org.apache.hadoop.TestRefreshCallQueue
Tests run: 1, Failures: 0, Errors: 0, Skipped: 0, Time elapsed: 7.099 sec - in org.apache.hadoop.TestRefreshCallQueue
Running org.apache.hadoop.fs.TestWebHdfsFileContextMainOperations
Tests run: 60, Failures: 0, Errors: 0, Skipped: 0, Time elapsed: 14.355 sec - in org.apache.hadoop.fs.TestWebHdfsFileContextMainOperations
Running org.apache.hadoop.fs.TestFcHdfsSetUMask
Tests run: 12, Failures: 0, Errors: 0, Skipped: 0, Time elapsed: 7.753 sec - in org.apache.hadoop.fs.TestFcHdfsSetUMask
Running org.apache.hadoop.fs.contract.hdfs.TestHDFSContractConcat
Tests run: 4, Failures: 0, Errors: 0, Skipped: 0, Time elapsed: 8.215 sec - in org.apache.hadoop.fs.contract.hdfs.TestHDFSContractConcat
Running org.apache.hadoop.fs.contract.hdfs.TestHDFSContractRootDirectory
Tests run: 6, Failures: 0, Errors: 0, Skipped: 0, Time elapsed: 7.644 sec - in org.apache.hadoop.fs.contract.hdfs.TestHDFSContractRootDirectory
Running org.apache.hadoop.fs.contract.hdfs.TestHDFSContractRename
Tests run: 6, Failures: 0, Errors: 0, Skipped: 0, Time elapsed: 7.514 sec - in org.apache.hadoop.fs.contract.hdfs.TestHDFSContractRename
Running org.apache.hadoop.fs.contract.hdfs.TestHDFSContractSetTimes
Tests run: 1, Failures: 0, Errors: 0, Skipped: 0, Time elapsed: 7.944 sec - in org.apache.hadoop.fs.contract.hdfs.TestHDFSContractSetTimes
Running org.apache.hadoop.fs.contract.hdfs.TestHDFSContractOpen
Tests run: 6, Failures: 0, Errors: 0, Skipped: 0, Time elapsed: 9.157 sec - in org.apache.hadoop.fs.contract.hdfs.TestHDFSContractOpen
Running org.apache.hadoop.fs.contract.hdfs.TestHDFSContractAppend
Tests run: 5, Failures: 0, Errors: 0, Skipped: 0, Time elapsed: 10.506 sec - in org.apache.hadoop.fs.contract.hdfs.TestHDFSContractAppend
Running org.apache.hadoop.fs.contract.hdfs.TestHDFSContractCreate
Tests run: 6, Failures: 0, Errors: 0, Skipped: 0, Time elapsed: 8.445 sec - in org.apache.hadoop.fs.contract.hdfs.TestHDFSContractCreate
Running org.apache.hadoop.fs.contract.hdfs.TestHDFSContractGetFileStatus
Tests run: 1, Failures: 0, Errors: 0, Skipped: 0, Time elapsed: 6.561 sec - in org.apache.hadoop.fs.contract.hdfs.TestHDFSContractGetFileStatus
Running org.apache.hadoop.fs.contract.hdfs.TestHDFSContractSeek
Tests run: 10, Failures: 0, Errors: 0, Skipped: 0, Time elapsed: 11.145 sec - in org.apache.hadoop.fs.contract.hdfs.TestHDFSContractSeek
Running org.apache.hadoop.fs.contract.hdfs.TestHDFSContractDelete
Tests run: 8, Failures: 0, Errors: 0, Skipped: 0, Time elapsed: 9.773 sec - in org.apache.hadoop.fs.contract.hdfs.TestHDFSContractDelete
Running org.apache.hadoop.fs.contract.hdfs.TestHDFSContractMkdir
Tests run: 5, Failures: 0, Errors: 0, Skipped: 0, Time elapsed: 10.283 sec - in org.apache.hadoop.fs.contract.hdfs.TestHDFSContractMkdir
Running org.apache.hadoop.fs.TestResolveHdfsSymlink
Tests run: 4, Failures: 0, Errors: 0, Skipped: 0, Time elapsed: 8.557 sec - in org.apache.hadoop.fs.TestResolveHdfsSymlink
Running org.apache.hadoop.fs.TestSymlinkHdfsDisable
Tests run: 1, Failures: 0, Errors: 0, Skipped: 0, Time elapsed: 6.678 sec - in org.apache.hadoop.fs.TestSymlinkHdfsDisable
Running org.apache.hadoop.fs.permission.TestStickyBit
Tests run: 6, Failures: 0, Errors: 0, Skipped: 0, Time elapsed: 16.817 sec - in org.apache.hadoop.fs.permission.TestStickyBit
Running org.apache.hadoop.fs.TestUrlStreamHandler
Tests run: 2, Failures: 0, Errors: 0, Skipped: 0, Time elapsed: 8.073 sec - in org.apache.hadoop.fs.TestUrlStreamHandler
Running org.apache.hadoop.fs.loadGenerator.TestLoadGenerator

Results :

Failed tests: 
  TestDataNodeVolumeFailure.testUnderReplicationAfterVolFailure:403 There is no under replicated
block after volume failure
  TestBlockReplacement.testDeletedBlockWhenAddBlockIsInEdit:436 The block should be only on
1 datanode  expected:<1> but was:<2>

Tests in error: 
  TestFsDatasetImpl.testRemoveVolumeBeingWritten:623 »  test timed out after 300...
  TestEncryptionZones.testStartFileRetry:1094 »  test timed out after 120000 mil...

Tests run: 3570, Failures: 2, Errors: 2, Skipped: 8

[INFO]                                                                         
[INFO] ------------------------------------------------------------------------
[INFO] Skipping Apache Hadoop HDFS Native Client
[INFO] This project has been banned from the build due to previous failures.
[INFO] ------------------------------------------------------------------------
[INFO]                                                                         
[INFO] ------------------------------------------------------------------------
[INFO] Skipping Apache Hadoop HttpFS
[INFO] This project has been banned from the build due to previous failures.
[INFO] ------------------------------------------------------------------------
[INFO]                                                                         
[INFO] ------------------------------------------------------------------------
[INFO] Skipping Apache Hadoop HDFS BookKeeper Journal
[INFO] This project has been banned from the build due to previous failures.
[INFO] ------------------------------------------------------------------------
[INFO]                                                                         
[INFO] ------------------------------------------------------------------------
[INFO] Skipping Apache Hadoop HDFS-NFS
[INFO] This project has been banned from the build due to previous failures.
[INFO] ------------------------------------------------------------------------
[INFO]                                                                         
[INFO] ------------------------------------------------------------------------
[INFO] Building Apache Hadoop HDFS Project 3.0.0-SNAPSHOT
[INFO] ------------------------------------------------------------------------
[INFO] 
[INFO] --- maven-clean-plugin:2.5:clean (default-clean) @ hadoop-hdfs-project ---
[INFO] Deleting <https://builds.apache.org/job/Hadoop-Hdfs-trunk/ws/hadoop-hdfs-project/target>
[INFO] 
[INFO] --- maven-antrun-plugin:1.7:run (create-testdirs) @ hadoop-hdfs-project ---
[INFO] Executing tasks

main:
    [mkdir] Created dir: <https://builds.apache.org/job/Hadoop-Hdfs-trunk/ws/hadoop-hdfs-project/target/test-dir>
[INFO] Executed tasks
[INFO] 
[INFO] --- maven-source-plugin:2.3:jar-no-fork (hadoop-java-sources) @ hadoop-hdfs-project
---
[INFO] 
[INFO] --- maven-source-plugin:2.3:test-jar-no-fork (hadoop-java-sources) @ hadoop-hdfs-project
---
[INFO] 
[INFO] --- maven-enforcer-plugin:1.3.1:enforce (dist-enforce) @ hadoop-hdfs-project ---
[INFO] 
[INFO] --- maven-site-plugin:3.4:attach-descriptor (attach-descriptor) @ hadoop-hdfs-project
---
[INFO] 
[INFO] --- maven-javadoc-plugin:2.8.1:jar (module-javadocs) @ hadoop-hdfs-project ---
[INFO] Skipping javadoc generation
[INFO] 
[INFO] --- maven-enforcer-plugin:1.3.1:enforce (depcheck) @ hadoop-hdfs-project ---
[INFO] 
[INFO] --- maven-checkstyle-plugin:2.15:checkstyle (default-cli) @ hadoop-hdfs-project ---
[INFO] 
[INFO] --- findbugs-maven-plugin:3.0.0:findbugs (default-cli) @ hadoop-hdfs-project ---
[INFO] ------------------------------------------------------------------------
[INFO] Reactor Summary:
[INFO] 
[INFO] Apache Hadoop HDFS Client ......................... SUCCESS [05:33 min]
[INFO] Apache Hadoop HDFS ................................ FAILURE [  04:51 h]
[INFO] Apache Hadoop HDFS Native Client .................. SKIPPED
[INFO] Apache Hadoop HttpFS .............................. SKIPPED
[INFO] Apache Hadoop HDFS BookKeeper Journal ............. SKIPPED
[INFO] Apache Hadoop HDFS-NFS ............................ SKIPPED
[INFO] Apache Hadoop HDFS Project ........................ SUCCESS [  0.089 s]
[INFO] ------------------------------------------------------------------------
[INFO] BUILD FAILURE
[INFO] ------------------------------------------------------------------------
[INFO] Total time: 04:57 h
[INFO] Finished at: 2016-02-08T20:45:13+00:00
[INFO] Final Memory: 70M/759M
[INFO] ------------------------------------------------------------------------
[ERROR] Failed to execute goal org.apache.maven.plugins:maven-surefire-plugin:2.17:test (default-test)
on project hadoop-hdfs: ExecutionException: java.lang.RuntimeException: java.lang.RuntimeException:
java.io.IOException: Stream Closed -> [Help 1]
[ERROR] 
[ERROR] To see the full stack trace of the errors, re-run Maven with the -e switch.
[ERROR] Re-run Maven using the -X switch to enable full debug logging.
[ERROR] 
[ERROR] For more information about the errors and possible solutions, please read the following
articles:
[ERROR] [Help 1] http://cwiki.apache.org/confluence/display/MAVEN/MojoFailureException
[ERROR] 
[ERROR] After correcting the problems, you can resume the build with the command
[ERROR]   mvn <goals> -rf :hadoop-hdfs
Build step 'Execute shell' marked build as failure
Archiving artifacts
Recording test results

Mime
View raw message