hadoop-hdfs-dev mailing list archives

Site index · List index
Message view « Date » · « Thread »
Top « Date » · « Thread »
From Apache Jenkins Server <jenk...@builds.apache.org>
Subject Hadoop-Hdfs-trunk - Build # 2826 - Still Failing
Date Fri, 12 Feb 2016 11:55:54 GMT
See https://builds.apache.org/job/Hadoop-Hdfs-trunk/2826/

###################################################################################
########################## LAST 60 LINES OF THE CONSOLE ###########################
[...truncated 6413 lines...]
[INFO] --- maven-antrun-plugin:1.7:run (create-testdirs) @ hadoop-hdfs-project ---
[INFO] Executing tasks

main:
    [mkdir] Created dir: /home/jenkins/jenkins-slave/workspace/Hadoop-Hdfs-trunk/hadoop-hdfs-project/target/test-dir
[INFO] Executed tasks
[INFO] 
[INFO] --- maven-source-plugin:2.3:jar-no-fork (hadoop-java-sources) @ hadoop-hdfs-project
---
[INFO] 
[INFO] --- maven-source-plugin:2.3:test-jar-no-fork (hadoop-java-sources) @ hadoop-hdfs-project
---
[INFO] 
[INFO] --- maven-enforcer-plugin:1.3.1:enforce (dist-enforce) @ hadoop-hdfs-project ---
[INFO] 
[INFO] --- maven-site-plugin:3.4:attach-descriptor (attach-descriptor) @ hadoop-hdfs-project
---
[INFO] 
[INFO] --- maven-javadoc-plugin:2.8.1:jar (module-javadocs) @ hadoop-hdfs-project ---
[INFO] Skipping javadoc generation
[INFO] 
[INFO] --- maven-enforcer-plugin:1.3.1:enforce (depcheck) @ hadoop-hdfs-project ---
[INFO] 
[INFO] --- maven-checkstyle-plugin:2.15:checkstyle (default-cli) @ hadoop-hdfs-project ---
[INFO] 
[INFO] --- findbugs-maven-plugin:3.0.0:findbugs (default-cli) @ hadoop-hdfs-project ---
[INFO] ------------------------------------------------------------------------
[INFO] Reactor Summary:
[INFO] 
[INFO] Apache Hadoop HDFS Client ......................... SUCCESS [06:23 min]
[INFO] Apache Hadoop HDFS ................................ FAILURE [  04:55 h]
[INFO] Apache Hadoop HDFS Native Client .................. SKIPPED
[INFO] Apache Hadoop HttpFS .............................. SKIPPED
[INFO] Apache Hadoop HDFS BookKeeper Journal ............. SKIPPED
[INFO] Apache Hadoop HDFS-NFS ............................ SKIPPED
[INFO] Apache Hadoop HDFS Project ........................ SUCCESS [  0.070 s]
[INFO] ------------------------------------------------------------------------
[INFO] BUILD FAILURE
[INFO] ------------------------------------------------------------------------
[INFO] Total time: 05:01 h
[INFO] Finished at: 2016-02-12T11:55:40+00:00
[INFO] Final Memory: 56M/733M
[INFO] ------------------------------------------------------------------------
[ERROR] Failed to execute goal org.apache.maven.plugins:maven-surefire-plugin:2.17:test (default-test)
on project hadoop-hdfs: There are test failures.
[ERROR] 
[ERROR] Please refer to /home/jenkins/jenkins-slave/workspace/Hadoop-Hdfs-trunk/hadoop-hdfs-project/hadoop-hdfs/target/surefire-reports
for the individual test results.
[ERROR] -> [Help 1]
[ERROR] 
[ERROR] To see the full stack trace of the errors, re-run Maven with the -e switch.
[ERROR] Re-run Maven using the -X switch to enable full debug logging.
[ERROR] 
[ERROR] For more information about the errors and possible solutions, please read the following
articles:
[ERROR] [Help 1] http://cwiki.apache.org/confluence/display/MAVEN/MojoFailureException
[ERROR] 
[ERROR] After correcting the problems, you can resume the build with the command
[ERROR]   mvn <goals> -rf :hadoop-hdfs
Build step 'Execute shell' marked build as failure
Archiving artifacts
Recording test results
Sending e-mails to: hdfs-dev@hadoop.apache.org
Email was triggered for: Failure - Any
Sending email for trigger: Failure - Any



###################################################################################
############################## FAILED TESTS (if any) ##############################
7 tests failed.
FAILED:  org.apache.hadoop.hdfs.server.datanode.TestBlockReplacement.testDeletedBlockWhenAddBlockIsInEdit

Error Message:
The block should be only on 1 datanode  expected:<1> but was:<2>

Stack Trace:
java.lang.AssertionError: The block should be only on 1 datanode  expected:<1> but was:<2>
	at org.junit.Assert.fail(Assert.java:88)
	at org.junit.Assert.failNotEquals(Assert.java:743)
	at org.junit.Assert.assertEquals(Assert.java:118)
	at org.junit.Assert.assertEquals(Assert.java:555)
	at org.apache.hadoop.hdfs.server.datanode.TestBlockReplacement.testDeletedBlockWhenAddBlockIsInEdit(TestBlockReplacement.java:436)


FAILED:  org.apache.hadoop.hdfs.server.datanode.TestBlockScanner.testVolumeIteratorWithCaching

Error Message:
test timed out after 60000 milliseconds

Stack Trace:
java.lang.Exception: test timed out after 60000 milliseconds
	at java.lang.Thread.sleep(Native Method)
	at org.apache.hadoop.hdfs.DFSOutputStream.completeFile(DFSOutputStream.java:812)
	at org.apache.hadoop.hdfs.DFSOutputStream.closeImpl(DFSOutputStream.java:776)
	at org.apache.hadoop.hdfs.DFSOutputStream.close(DFSOutputStream.java:747)
	at org.apache.hadoop.fs.FSDataOutputStream$PositionCache.close(FSDataOutputStream.java:72)
	at org.apache.hadoop.fs.FSDataOutputStream.close(FSDataOutputStream.java:101)
	at org.apache.hadoop.hdfs.DFSTestUtil.createFile(DFSTestUtil.java:427)
	at org.apache.hadoop.hdfs.DFSTestUtil.createFile(DFSTestUtil.java:376)
	at org.apache.hadoop.hdfs.DFSTestUtil.createFile(DFSTestUtil.java:369)
	at org.apache.hadoop.hdfs.DFSTestUtil.createFile(DFSTestUtil.java:362)
	at org.apache.hadoop.hdfs.server.datanode.TestBlockScanner$TestContext.createFiles(TestBlockScanner.java:129)
	at org.apache.hadoop.hdfs.server.datanode.TestBlockScanner.testVolumeIteratorImpl(TestBlockScanner.java:159)
	at org.apache.hadoop.hdfs.server.datanode.TestBlockScanner.testVolumeIteratorWithCaching(TestBlockScanner.java:250)


FAILED:  org.apache.hadoop.hdfs.server.datanode.TestBlockScanner.testScanRateLimit

Error Message:
Cannot remove data directory: /home/jenkins/jenkins-slave/workspace/Hadoop-Hdfs-trunk/hadoop-hdfs-project/hadoop-hdfs/target/test/data/dfs/datapath
'/home/jenkins/jenkins-slave/workspace/Hadoop-Hdfs-trunk/hadoop-hdfs-project/hadoop-hdfs/target/test/data/dfs/data':

 absolute:/home/jenkins/jenkins-slave/workspace/Hadoop-Hdfs-trunk/hadoop-hdfs-project/hadoop-hdfs/target/test/data/dfs/data
 permissions: drwx
path '/home/jenkins/jenkins-slave/workspace/Hadoop-Hdfs-trunk/hadoop-hdfs-project/hadoop-hdfs/target/test/data/dfs':

 absolute:/home/jenkins/jenkins-slave/workspace/Hadoop-Hdfs-trunk/hadoop-hdfs-project/hadoop-hdfs/target/test/data/dfs
 permissions: drwx
path '/home/jenkins/jenkins-slave/workspace/Hadoop-Hdfs-trunk/hadoop-hdfs-project/hadoop-hdfs/target/test/data':

 absolute:/home/jenkins/jenkins-slave/workspace/Hadoop-Hdfs-trunk/hadoop-hdfs-project/hadoop-hdfs/target/test/data
 permissions: drwx
path '/home/jenkins/jenkins-slave/workspace/Hadoop-Hdfs-trunk/hadoop-hdfs-project/hadoop-hdfs/target/test':

 absolute:/home/jenkins/jenkins-slave/workspace/Hadoop-Hdfs-trunk/hadoop-hdfs-project/hadoop-hdfs/target/test
 permissions: drwx
path '/home/jenkins/jenkins-slave/workspace/Hadoop-Hdfs-trunk/hadoop-hdfs-project/hadoop-hdfs/target':

 absolute:/home/jenkins/jenkins-slave/workspace/Hadoop-Hdfs-trunk/hadoop-hdfs-project/hadoop-hdfs/target
 permissions: drwx
path '/home/jenkins/jenkins-slave/workspace/Hadoop-Hdfs-trunk/hadoop-hdfs-project/hadoop-hdfs':

 absolute:/home/jenkins/jenkins-slave/workspace/Hadoop-Hdfs-trunk/hadoop-hdfs-project/hadoop-hdfs
 permissions: drwx
path '/home/jenkins/jenkins-slave/workspace/Hadoop-Hdfs-trunk/hadoop-hdfs-project': 
 absolute:/home/jenkins/jenkins-slave/workspace/Hadoop-Hdfs-trunk/hadoop-hdfs-project
 permissions: drwx
path '/home/jenkins/jenkins-slave/workspace/Hadoop-Hdfs-trunk': 
 absolute:/home/jenkins/jenkins-slave/workspace/Hadoop-Hdfs-trunk
 permissions: drwx
path '/home/jenkins/jenkins-slave/workspace': 
 absolute:/home/jenkins/jenkins-slave/workspace
 permissions: drwx
path '/home/jenkins/jenkins-slave': 
 absolute:/home/jenkins/jenkins-slave
 permissions: drwx
path '/home/jenkins': 
 absolute:/home/jenkins
 permissions: drwx
path '/home': 
 absolute:/home
 permissions: dr-x
path '/': 
 absolute:/
 permissions: dr-x


Stack Trace:
java.io.IOException: Cannot remove data directory: /home/jenkins/jenkins-slave/workspace/Hadoop-Hdfs-trunk/hadoop-hdfs-project/hadoop-hdfs/target/test/data/dfs/datapath
'/home/jenkins/jenkins-slave/workspace/Hadoop-Hdfs-trunk/hadoop-hdfs-project/hadoop-hdfs/target/test/data/dfs/data':

	absolute:/home/jenkins/jenkins-slave/workspace/Hadoop-Hdfs-trunk/hadoop-hdfs-project/hadoop-hdfs/target/test/data/dfs/data
	permissions: drwx
path '/home/jenkins/jenkins-slave/workspace/Hadoop-Hdfs-trunk/hadoop-hdfs-project/hadoop-hdfs/target/test/data/dfs':

	absolute:/home/jenkins/jenkins-slave/workspace/Hadoop-Hdfs-trunk/hadoop-hdfs-project/hadoop-hdfs/target/test/data/dfs
	permissions: drwx
path '/home/jenkins/jenkins-slave/workspace/Hadoop-Hdfs-trunk/hadoop-hdfs-project/hadoop-hdfs/target/test/data':

	absolute:/home/jenkins/jenkins-slave/workspace/Hadoop-Hdfs-trunk/hadoop-hdfs-project/hadoop-hdfs/target/test/data
	permissions: drwx
path '/home/jenkins/jenkins-slave/workspace/Hadoop-Hdfs-trunk/hadoop-hdfs-project/hadoop-hdfs/target/test':

	absolute:/home/jenkins/jenkins-slave/workspace/Hadoop-Hdfs-trunk/hadoop-hdfs-project/hadoop-hdfs/target/test
	permissions: drwx
path '/home/jenkins/jenkins-slave/workspace/Hadoop-Hdfs-trunk/hadoop-hdfs-project/hadoop-hdfs/target':

	absolute:/home/jenkins/jenkins-slave/workspace/Hadoop-Hdfs-trunk/hadoop-hdfs-project/hadoop-hdfs/target
	permissions: drwx
path '/home/jenkins/jenkins-slave/workspace/Hadoop-Hdfs-trunk/hadoop-hdfs-project/hadoop-hdfs':

	absolute:/home/jenkins/jenkins-slave/workspace/Hadoop-Hdfs-trunk/hadoop-hdfs-project/hadoop-hdfs
	permissions: drwx
path '/home/jenkins/jenkins-slave/workspace/Hadoop-Hdfs-trunk/hadoop-hdfs-project': 
	absolute:/home/jenkins/jenkins-slave/workspace/Hadoop-Hdfs-trunk/hadoop-hdfs-project
	permissions: drwx
path '/home/jenkins/jenkins-slave/workspace/Hadoop-Hdfs-trunk': 
	absolute:/home/jenkins/jenkins-slave/workspace/Hadoop-Hdfs-trunk
	permissions: drwx
path '/home/jenkins/jenkins-slave/workspace': 
	absolute:/home/jenkins/jenkins-slave/workspace
	permissions: drwx
path '/home/jenkins/jenkins-slave': 
	absolute:/home/jenkins/jenkins-slave
	permissions: drwx
path '/home/jenkins': 
	absolute:/home/jenkins
	permissions: drwx
path '/home': 
	absolute:/home
	permissions: dr-x
path '/': 
	absolute:/
	permissions: dr-x

	at org.apache.hadoop.hdfs.MiniDFSCluster.initMiniDFSCluster(MiniDFSCluster.java:834)
	at org.apache.hadoop.hdfs.MiniDFSCluster.<init>(MiniDFSCluster.java:482)
	at org.apache.hadoop.hdfs.MiniDFSCluster$Builder.build(MiniDFSCluster.java:441)
	at org.apache.hadoop.hdfs.server.datanode.TestBlockScanner$TestContext.<init>(TestBlockScanner.java:96)
	at org.apache.hadoop.hdfs.server.datanode.TestBlockScanner.testScanRateLimit(TestBlockScanner.java:439)


FAILED:  org.apache.hadoop.hdfs.server.datanode.TestDataNodeVolumeFailure.testUnderReplicationAfterVolFailure

Error Message:
There is no under replicated block after volume failure

Stack Trace:
java.lang.AssertionError: There is no under replicated block after volume failure
	at org.junit.Assert.fail(Assert.java:88)
	at org.junit.Assert.assertTrue(Assert.java:41)
	at org.apache.hadoop.hdfs.server.datanode.TestDataNodeVolumeFailure.testUnderReplicationAfterVolFailure(TestDataNodeVolumeFailure.java:403)


FAILED:  org.apache.hadoop.hdfs.server.datanode.TestDirectoryScanner.testThrottling

Error Message:
test timed out after 300000 milliseconds

Stack Trace:
java.lang.Exception: test timed out after 300000 milliseconds
	at java.lang.Object.wait(Native Method)
	at java.lang.Object.wait(Object.java:503)
	at org.apache.hadoop.hdfs.DataStreamer.waitAndQueuePacket(DataStreamer.java:804)
	at org.apache.hadoop.hdfs.DFSOutputStream.enqueueCurrentPacket(DFSOutputStream.java:423)
	at org.apache.hadoop.hdfs.DFSOutputStream.enqueueCurrentPacketFull(DFSOutputStream.java:432)
	at org.apache.hadoop.hdfs.DFSOutputStream.writeChunk(DFSOutputStream.java:418)
	at org.apache.hadoop.fs.FSOutputSummer.writeChecksumChunks(FSOutputSummer.java:217)
	at org.apache.hadoop.fs.FSOutputSummer.write1(FSOutputSummer.java:125)
	at org.apache.hadoop.fs.FSOutputSummer.write(FSOutputSummer.java:111)
	at org.apache.hadoop.fs.FSDataOutputStream$PositionCache.write(FSDataOutputStream.java:57)
	at java.io.DataOutputStream.write(DataOutputStream.java:107)
	at org.apache.hadoop.hdfs.DFSTestUtil.createFile(DFSTestUtil.java:418)
	at org.apache.hadoop.hdfs.DFSTestUtil.createFile(DFSTestUtil.java:376)
	at org.apache.hadoop.hdfs.server.datanode.TestDirectoryScanner.createFile(TestDirectoryScanner.java:108)
	at org.apache.hadoop.hdfs.server.datanode.TestDirectoryScanner.testThrottling(TestDirectoryScanner.java:584)


FAILED:  org.apache.hadoop.hdfs.server.datanode.fsdataset.impl.TestFsDatasetImpl.testRemoveVolumeBeingWritten

Error Message:
test timed out after 30000 milliseconds

Stack Trace:
java.lang.Exception: test timed out after 30000 milliseconds
	at sun.misc.Unsafe.park(Native Method)
	at java.util.concurrent.locks.LockSupport.park(LockSupport.java:186)
	at java.util.concurrent.locks.AbstractQueuedSynchronizer.parkAndCheckInterrupt(AbstractQueuedSynchronizer.java:834)
	at java.util.concurrent.locks.AbstractQueuedSynchronizer.doAcquireSharedInterruptibly(AbstractQueuedSynchronizer.java:994)
	at java.util.concurrent.locks.AbstractQueuedSynchronizer.acquireSharedInterruptibly(AbstractQueuedSynchronizer.java:1303)
	at java.util.concurrent.CountDownLatch.await(CountDownLatch.java:236)
	at org.apache.hadoop.hdfs.server.datanode.fsdataset.impl.TestFsDatasetImpl.testRemoveVolumeBeingWritten(TestFsDatasetImpl.java:623)


FAILED:  org.apache.hadoop.metrics2.sink.TestRollingFileSystemSinkWithHdfs.testFlushThread

Error Message:
The flusher thread didn't flush the log contents. Expected at least 236 bytes in the log file,
but got 160

Stack Trace:
java.lang.AssertionError: The flusher thread didn't flush the log contents. Expected at least
236 bytes in the log file, but got 160
	at org.junit.Assert.fail(Assert.java:88)
	at org.junit.Assert.assertTrue(Assert.java:41)
	at org.apache.hadoop.metrics2.sink.TestRollingFileSystemSinkWithHdfs.testFlushThread(TestRollingFileSystemSinkWithHdfs.java:280)



Mime
  • Unnamed multipart/mixed (inline, None, 0 bytes)
View raw message