hadoop-hdfs-dev mailing list archives

Site index · List index
Message view « Date » · « Thread »
Top « Date » · « Thread »
From Apache Jenkins Server <jenk...@builds.apache.org>
Subject Build failed in Jenkins: Hadoop-Hdfs-trunk-Java8 #925
Date Sun, 21 Feb 2016 12:04:34 GMT
See <https://builds.apache.org/job/Hadoop-Hdfs-trunk-Java8/925/changes>

Changes:

[arp] HDFS-9839. Reduce verbosity of processReport logging. (Contributed by

------------------------------------------
[...truncated 5719 lines...]
Tests run: 3, Failures: 0, Errors: 0, Skipped: 0, Time elapsed: 3.702 sec - in org.apache.hadoop.hdfs.util.TestStripedBlockUtil
Java HotSpot(TM) 64-Bit Server VM warning: ignoring option MaxPermSize=768m; support was removed
in 8.0
Running org.apache.hadoop.hdfs.util.TestXMLUtils
Tests run: 6, Failures: 0, Errors: 0, Skipped: 0, Time elapsed: 0.085 sec - in org.apache.hadoop.hdfs.util.TestXMLUtils
Java HotSpot(TM) 64-Bit Server VM warning: ignoring option MaxPermSize=768m; support was removed
in 8.0
Running org.apache.hadoop.hdfs.util.TestLightWeightHashSet
Tests run: 14, Failures: 0, Errors: 0, Skipped: 0, Time elapsed: 0.276 sec - in org.apache.hadoop.hdfs.util.TestLightWeightHashSet
Java HotSpot(TM) 64-Bit Server VM warning: ignoring option MaxPermSize=768m; support was removed
in 8.0
Running org.apache.hadoop.hdfs.util.TestMD5FileUtils
Tests run: 5, Failures: 0, Errors: 0, Skipped: 0, Time elapsed: 0.425 sec - in org.apache.hadoop.hdfs.util.TestMD5FileUtils
Java HotSpot(TM) 64-Bit Server VM warning: ignoring option MaxPermSize=768m; support was removed
in 8.0
Running org.apache.hadoop.hdfs.util.TestLightWeightLinkedSet
Tests run: 17, Failures: 0, Errors: 0, Skipped: 0, Time elapsed: 0.256 sec - in org.apache.hadoop.hdfs.util.TestLightWeightLinkedSet
Java HotSpot(TM) 64-Bit Server VM warning: ignoring option MaxPermSize=768m; support was removed
in 8.0
Running org.apache.hadoop.hdfs.util.TestAtomicFileOutputStream
Tests run: 4, Failures: 0, Errors: 0, Skipped: 1, Time elapsed: 0.446 sec - in org.apache.hadoop.hdfs.util.TestAtomicFileOutputStream
Java HotSpot(TM) 64-Bit Server VM warning: ignoring option MaxPermSize=768m; support was removed
in 8.0
Running org.apache.hadoop.hdfs.TestLease
Tests run: 5, Failures: 0, Errors: 0, Skipped: 0, Time elapsed: 14.48 sec - in org.apache.hadoop.hdfs.TestLease
Java HotSpot(TM) 64-Bit Server VM warning: ignoring option MaxPermSize=768m; support was removed
in 8.0
Running org.apache.hadoop.hdfs.TestInjectionForSimulatedStorage
Tests run: 1, Failures: 0, Errors: 0, Skipped: 0, Time elapsed: 15.786 sec - in org.apache.hadoop.hdfs.TestInjectionForSimulatedStorage
Java HotSpot(TM) 64-Bit Server VM warning: ignoring option MaxPermSize=768m; support was removed
in 8.0
Running org.apache.hadoop.hdfs.TestHFlush
Tests run: 14, Failures: 0, Errors: 0, Skipped: 0, Time elapsed: 44.58 sec - in org.apache.hadoop.hdfs.TestHFlush
Java HotSpot(TM) 64-Bit Server VM warning: ignoring option MaxPermSize=768m; support was removed
in 8.0
Running org.apache.hadoop.hdfs.TestErasureCodingPolicies
Tests run: 9, Failures: 0, Errors: 0, Skipped: 0, Time elapsed: 18.11 sec - in org.apache.hadoop.hdfs.TestErasureCodingPolicies
Java HotSpot(TM) 64-Bit Server VM warning: ignoring option MaxPermSize=768m; support was removed
in 8.0
Running org.apache.hadoop.hdfs.TestRemoteBlockReader
Tests run: 1, Failures: 0, Errors: 0, Skipped: 0, Time elapsed: 5.716 sec - in org.apache.hadoop.hdfs.TestRemoteBlockReader
Java HotSpot(TM) 64-Bit Server VM warning: ignoring option MaxPermSize=768m; support was removed
in 8.0
Running org.apache.hadoop.hdfs.TestHdfsAdmin
Tests run: 2, Failures: 0, Errors: 0, Skipped: 0, Time elapsed: 5.992 sec - in org.apache.hadoop.hdfs.TestHdfsAdmin
Java HotSpot(TM) 64-Bit Server VM warning: ignoring option MaxPermSize=768m; support was removed
in 8.0
Running org.apache.hadoop.hdfs.TestDistributedFileSystem
Tests run: 18, Failures: 0, Errors: 0, Skipped: 0, Time elapsed: 61.286 sec - in org.apache.hadoop.hdfs.TestDistributedFileSystem
Java HotSpot(TM) 64-Bit Server VM warning: ignoring option MaxPermSize=768m; support was removed
in 8.0
Running org.apache.hadoop.hdfs.TestRollingUpgradeRollback
Tests run: 3, Failures: 0, Errors: 0, Skipped: 0, Time elapsed: 13.427 sec - in org.apache.hadoop.hdfs.TestRollingUpgradeRollback
Java HotSpot(TM) 64-Bit Server VM warning: ignoring option MaxPermSize=768m; support was removed
in 8.0
Running org.apache.hadoop.hdfs.TestRollingUpgrade
Tests run: 12, Failures: 0, Errors: 0, Skipped: 0, Time elapsed: 129.676 sec - in org.apache.hadoop.hdfs.TestRollingUpgrade
Java HotSpot(TM) 64-Bit Server VM warning: ignoring option MaxPermSize=768m; support was removed
in 8.0
Running org.apache.hadoop.hdfs.TestDatanodeDeath
Tests run: 4, Failures: 0, Errors: 0, Skipped: 0, Time elapsed: 68.237 sec - in org.apache.hadoop.hdfs.TestDatanodeDeath
Java HotSpot(TM) 64-Bit Server VM warning: ignoring option MaxPermSize=768m; support was removed
in 8.0
Running org.apache.hadoop.hdfs.TestCrcCorruption
Tests run: 4, Failures: 0, Errors: 0, Skipped: 0, Time elapsed: 18.999 sec - in org.apache.hadoop.hdfs.TestCrcCorruption
Java HotSpot(TM) 64-Bit Server VM warning: ignoring option MaxPermSize=768m; support was removed
in 8.0
Running org.apache.hadoop.hdfs.TestFsShellPermission
Tests run: 1, Failures: 0, Errors: 0, Skipped: 0, Time elapsed: 5.563 sec - in org.apache.hadoop.hdfs.TestFsShellPermission
Java HotSpot(TM) 64-Bit Server VM warning: ignoring option MaxPermSize=768m; support was removed
in 8.0
Running org.apache.hadoop.hdfs.protocol.TestLocatedBlock
Tests run: 1, Failures: 0, Errors: 0, Skipped: 0, Time elapsed: 0.282 sec - in org.apache.hadoop.hdfs.protocol.TestLocatedBlock
Java HotSpot(TM) 64-Bit Server VM warning: ignoring option MaxPermSize=768m; support was removed
in 8.0
Running org.apache.hadoop.hdfs.protocol.TestLayoutVersion
Tests run: 11, Failures: 0, Errors: 0, Skipped: 0, Time elapsed: 0.27 sec - in org.apache.hadoop.hdfs.protocol.TestLayoutVersion
Java HotSpot(TM) 64-Bit Server VM warning: ignoring option MaxPermSize=768m; support was removed
in 8.0
Running org.apache.hadoop.hdfs.protocol.datatransfer.sasl.TestSaslDataTransfer
Tests run: 8, Failures: 0, Errors: 0, Skipped: 0, Time elapsed: 42.139 sec - in org.apache.hadoop.hdfs.protocol.datatransfer.sasl.TestSaslDataTransfer
Java HotSpot(TM) 64-Bit Server VM warning: ignoring option MaxPermSize=768m; support was removed
in 8.0
Running org.apache.hadoop.hdfs.protocol.datatransfer.TestPacketReceiver
Tests run: 1, Failures: 0, Errors: 0, Skipped: 0, Time elapsed: 0.404 sec - in org.apache.hadoop.hdfs.protocol.datatransfer.TestPacketReceiver
Java HotSpot(TM) 64-Bit Server VM warning: ignoring option MaxPermSize=768m; support was removed
in 8.0
Running org.apache.hadoop.hdfs.protocol.TestAnnotations
Tests run: 1, Failures: 0, Errors: 0, Skipped: 0, Time elapsed: 0.135 sec - in org.apache.hadoop.hdfs.protocol.TestAnnotations
Java HotSpot(TM) 64-Bit Server VM warning: ignoring option MaxPermSize=768m; support was removed
in 8.0
Running org.apache.hadoop.hdfs.protocol.TestBlockListAsLongs
Tests run: 7, Failures: 0, Errors: 0, Skipped: 0, Time elapsed: 1.019 sec - in org.apache.hadoop.hdfs.protocol.TestBlockListAsLongs
Java HotSpot(TM) 64-Bit Server VM warning: ignoring option MaxPermSize=768m; support was removed
in 8.0
Running org.apache.hadoop.hdfs.TestDFSStripedOutputStreamWithFailure170
Tests run: 10, Failures: 0, Errors: 0, Skipped: 0, Time elapsed: 55.174 sec - in org.apache.hadoop.hdfs.TestDFSStripedOutputStreamWithFailure170
Java HotSpot(TM) 64-Bit Server VM warning: ignoring option MaxPermSize=768m; support was removed
in 8.0
Running org.apache.hadoop.hdfs.TestDFSStripedOutputStreamWithFailure190
Tests run: 10, Failures: 0, Errors: 0, Skipped: 0, Time elapsed: 0.311 sec - in org.apache.hadoop.hdfs.TestDFSStripedOutputStreamWithFailure190
Java HotSpot(TM) 64-Bit Server VM warning: ignoring option MaxPermSize=768m; support was removed
in 8.0
Running org.apache.hadoop.hdfs.TestDFSAddressConfig
Tests run: 1, Failures: 0, Errors: 0, Skipped: 0, Time elapsed: 5.74 sec - in org.apache.hadoop.hdfs.TestDFSAddressConfig
Java HotSpot(TM) 64-Bit Server VM warning: ignoring option MaxPermSize=768m; support was removed
in 8.0
Running org.apache.hadoop.hdfs.TestDFSConfigKeys
Tests run: 1, Failures: 0, Errors: 0, Skipped: 0, Time elapsed: 0.203 sec - in org.apache.hadoop.hdfs.TestDFSConfigKeys
Java HotSpot(TM) 64-Bit Server VM warning: ignoring option MaxPermSize=768m; support was removed
in 8.0
Running org.apache.hadoop.hdfs.TestParallelUnixDomainRead
Tests run: 4, Failures: 0, Errors: 0, Skipped: 0, Time elapsed: 39.025 sec - in org.apache.hadoop.hdfs.TestParallelUnixDomainRead
Java HotSpot(TM) 64-Bit Server VM warning: ignoring option MaxPermSize=768m; support was removed
in 8.0
Running org.apache.hadoop.hdfs.TestDFSStripedOutputStreamWithFailure140
Tests run: 10, Failures: 0, Errors: 0, Skipped: 0, Time elapsed: 0.295 sec - in org.apache.hadoop.hdfs.TestDFSStripedOutputStreamWithFailure140
Java HotSpot(TM) 64-Bit Server VM warning: ignoring option MaxPermSize=768m; support was removed
in 8.0
Running org.apache.hadoop.hdfs.TestDFSStripedOutputStreamWithFailure100
Tests run: 10, Failures: 0, Errors: 0, Skipped: 0, Time elapsed: 51.244 sec - in org.apache.hadoop.hdfs.TestDFSStripedOutputStreamWithFailure100
Java HotSpot(TM) 64-Bit Server VM warning: ignoring option MaxPermSize=768m; support was removed
in 8.0
Running org.apache.hadoop.hdfs.TestReplication
Tests run: 9, Failures: 0, Errors: 0, Skipped: 0, Time elapsed: 58.64 sec - in org.apache.hadoop.hdfs.TestReplication
Java HotSpot(TM) 64-Bit Server VM warning: ignoring option MaxPermSize=768m; support was removed
in 8.0
Running org.apache.hadoop.hdfs.TestRead
Tests run: 3, Failures: 0, Errors: 0, Skipped: 0, Time elapsed: 8.716 sec - in org.apache.hadoop.hdfs.TestRead
Java HotSpot(TM) 64-Bit Server VM warning: ignoring option MaxPermSize=768m; support was removed
in 8.0
Running org.apache.hadoop.hdfs.TestPipelines
Tests run: 1, Failures: 0, Errors: 0, Skipped: 0, Time elapsed: 6.487 sec - in org.apache.hadoop.hdfs.TestPipelines
Java HotSpot(TM) 64-Bit Server VM warning: ignoring option MaxPermSize=768m; support was removed
in 8.0
Running org.apache.hadoop.hdfs.TestDFSStripedOutputStreamWithFailure
Tests run: 4, Failures: 0, Errors: 0, Skipped: 0, Time elapsed: 119.921 sec - in org.apache.hadoop.hdfs.TestDFSStripedOutputStreamWithFailure
Java HotSpot(TM) 64-Bit Server VM warning: ignoring option MaxPermSize=768m; support was removed
in 8.0
Running org.apache.hadoop.hdfs.TestDeprecatedKeys
Tests run: 1, Failures: 0, Errors: 0, Skipped: 0, Time elapsed: 0.496 sec - in org.apache.hadoop.hdfs.TestDeprecatedKeys
Java HotSpot(TM) 64-Bit Server VM warning: ignoring option MaxPermSize=768m; support was removed
in 8.0
Running org.apache.hadoop.hdfs.TestAclsEndToEnd
Tests run: 9, Failures: 0, Errors: 0, Skipped: 0, Time elapsed: 85.339 sec - in org.apache.hadoop.hdfs.TestAclsEndToEnd
Java HotSpot(TM) 64-Bit Server VM warning: ignoring option MaxPermSize=768m; support was removed
in 8.0
Running org.apache.hadoop.hdfs.TestParallelShortCircuitReadNoChecksum
Tests run: 4, Failures: 0, Errors: 0, Skipped: 0, Time elapsed: 13.753 sec - in org.apache.hadoop.hdfs.TestParallelShortCircuitReadNoChecksum
Java HotSpot(TM) 64-Bit Server VM warning: ignoring option MaxPermSize=768m; support was removed
in 8.0
Running org.apache.hadoop.hdfs.TestParallelShortCircuitRead
Tests run: 4, Failures: 0, Errors: 0, Skipped: 0, Time elapsed: 13.842 sec - in org.apache.hadoop.hdfs.TestParallelShortCircuitRead
Java HotSpot(TM) 64-Bit Server VM warning: ignoring option MaxPermSize=768m; support was removed
in 8.0
Running org.apache.hadoop.hdfs.TestHDFSTrash
Tests run: 2, Failures: 0, Errors: 0, Skipped: 0, Time elapsed: 6.535 sec - in org.apache.hadoop.hdfs.TestHDFSTrash
Java HotSpot(TM) 64-Bit Server VM warning: ignoring option MaxPermSize=768m; support was removed
in 8.0
Running org.apache.hadoop.hdfs.TestFileAppend
Tests run: 12, Failures: 0, Errors: 0, Skipped: 0, Time elapsed: 43.872 sec - in org.apache.hadoop.hdfs.TestFileAppend
Java HotSpot(TM) 64-Bit Server VM warning: ignoring option MaxPermSize=768m; support was removed
in 8.0
Running org.apache.hadoop.hdfs.TestDFSRemove
Tests run: 1, Failures: 0, Errors: 0, Skipped: 0, Time elapsed: 16.92 sec - in org.apache.hadoop.hdfs.TestDFSRemove
Java HotSpot(TM) 64-Bit Server VM warning: ignoring option MaxPermSize=768m; support was removed
in 8.0
Running org.apache.hadoop.hdfs.TestErasureCodingPolicyWithSnapshot
Tests run: 4, Failures: 0, Errors: 0, Skipped: 0, Time elapsed: 25.158 sec - in org.apache.hadoop.hdfs.TestErasureCodingPolicyWithSnapshot
Java HotSpot(TM) 64-Bit Server VM warning: ignoring option MaxPermSize=768m; support was removed
in 8.0
Running org.apache.hadoop.hdfs.TestDFSRollback
Tests run: 1, Failures: 0, Errors: 0, Skipped: 0, Time elapsed: 18.762 sec - in org.apache.hadoop.hdfs.TestDFSRollback
Java HotSpot(TM) 64-Bit Server VM warning: ignoring option MaxPermSize=768m; support was removed
in 8.0
Running org.apache.hadoop.hdfs.TestReadWhileWriting
Tests run: 1, Failures: 0, Errors: 0, Skipped: 0, Time elapsed: 7.678 sec - in org.apache.hadoop.hdfs.TestReadWhileWriting
Java HotSpot(TM) 64-Bit Server VM warning: ignoring option MaxPermSize=768m; support was removed
in 8.0
Running org.apache.hadoop.hdfs.TestConnCache
Tests run: 1, Failures: 0, Errors: 0, Skipped: 0, Time elapsed: 4.888 sec - in org.apache.hadoop.hdfs.TestConnCache
Java HotSpot(TM) 64-Bit Server VM warning: ignoring option MaxPermSize=768m; support was removed
in 8.0
Running org.apache.hadoop.hdfs.TestPersistBlocks
Tests run: 5, Failures: 0, Errors: 0, Skipped: 0, Time elapsed: 28.849 sec - in org.apache.hadoop.hdfs.TestPersistBlocks
Java HotSpot(TM) 64-Bit Server VM warning: ignoring option MaxPermSize=768m; support was removed
in 8.0
Running org.apache.hadoop.hdfs.TestSetrepDecreasing
Tests run: 1, Failures: 0, Errors: 0, Skipped: 0, Time elapsed: 18.203 sec - in org.apache.hadoop.hdfs.TestSetrepDecreasing
Java HotSpot(TM) 64-Bit Server VM warning: ignoring option MaxPermSize=768m; support was removed
in 8.0
Running org.apache.hadoop.hdfs.TestDatanodeLayoutUpgrade
Tests run: 1, Failures: 0, Errors: 0, Skipped: 0, Time elapsed: 5.992 sec - in org.apache.hadoop.hdfs.TestDatanodeLayoutUpgrade
Java HotSpot(TM) 64-Bit Server VM warning: ignoring option MaxPermSize=768m; support was removed
in 8.0
Running org.apache.hadoop.hdfs.TestFileCorruption
Tests run: 3, Failures: 0, Errors: 0, Skipped: 0, Time elapsed: 10.387 sec - in org.apache.hadoop.hdfs.TestFileCorruption
Java HotSpot(TM) 64-Bit Server VM warning: ignoring option MaxPermSize=768m; support was removed
in 8.0
Running org.apache.hadoop.hdfs.TestDFSStartupVersions
Tests run: 1, Failures: 0, Errors: 0, Skipped: 0, Time elapsed: 15.423 sec - in org.apache.hadoop.hdfs.TestDFSStartupVersions
Java HotSpot(TM) 64-Bit Server VM warning: ignoring option MaxPermSize=768m; support was removed
in 8.0
Running org.apache.hadoop.hdfs.TestWriteConfigurationToDFS
Tests run: 1, Failures: 0, Errors: 0, Skipped: 0, Time elapsed: 5.677 sec - in org.apache.hadoop.hdfs.TestWriteConfigurationToDFS
Java HotSpot(TM) 64-Bit Server VM warning: ignoring option MaxPermSize=768m; support was removed
in 8.0
Running org.apache.hadoop.hdfs.TestListFilesInDFS
Tests run: 2, Failures: 0, Errors: 0, Skipped: 0, Time elapsed: 5.549 sec - in org.apache.hadoop.hdfs.TestListFilesInDFS

Results :

Failed tests: 
  TestCacheDirectives.testExceedsCapacity:1503->checkPendingCachedEmpty:1480 Pending cached
list of 127.0.0.1:51634 is not empty, [{blockId=1073741841, replication=1, mark=false}]

Tests run: 4204, Failures: 1, Errors: 0, Skipped: 17

[INFO]                                                                         
[INFO] ------------------------------------------------------------------------
[INFO] Skipping Apache Hadoop HDFS Native Client
[INFO] This project has been banned from the build due to previous failures.
[INFO] ------------------------------------------------------------------------
[INFO]                                                                         
[INFO] ------------------------------------------------------------------------
[INFO] Skipping Apache Hadoop HttpFS
[INFO] This project has been banned from the build due to previous failures.
[INFO] ------------------------------------------------------------------------
[INFO]                                                                         
[INFO] ------------------------------------------------------------------------
[INFO] Skipping Apache Hadoop HDFS BookKeeper Journal
[INFO] This project has been banned from the build due to previous failures.
[INFO] ------------------------------------------------------------------------
[INFO]                                                                         
[INFO] ------------------------------------------------------------------------
[INFO] Skipping Apache Hadoop HDFS-NFS
[INFO] This project has been banned from the build due to previous failures.
[INFO] ------------------------------------------------------------------------
[INFO]                                                                         
[INFO] ------------------------------------------------------------------------
[INFO] Building Apache Hadoop HDFS Project 3.0.0-SNAPSHOT
[INFO] ------------------------------------------------------------------------
[INFO] 
[INFO] --- maven-clean-plugin:2.5:clean (default-clean) @ hadoop-hdfs-project ---
[INFO] Deleting <https://builds.apache.org/job/Hadoop-Hdfs-trunk-Java8/ws/hadoop-hdfs-project/target>
[INFO] 
[INFO] --- maven-antrun-plugin:1.7:run (create-testdirs) @ hadoop-hdfs-project ---
[INFO] Executing tasks

main:
    [mkdir] Created dir: <https://builds.apache.org/job/Hadoop-Hdfs-trunk-Java8/ws/hadoop-hdfs-project/target/test-dir>
[INFO] Executed tasks
[INFO] 
[INFO] --- maven-source-plugin:2.3:jar-no-fork (hadoop-java-sources) @ hadoop-hdfs-project
---
[INFO] 
[INFO] --- maven-source-plugin:2.3:test-jar-no-fork (hadoop-java-sources) @ hadoop-hdfs-project
---
[INFO] 
[INFO] --- maven-enforcer-plugin:1.3.1:enforce (dist-enforce) @ hadoop-hdfs-project ---
[INFO] 
[INFO] --- maven-site-plugin:3.4:attach-descriptor (attach-descriptor) @ hadoop-hdfs-project
---
[INFO] 
[INFO] --- maven-javadoc-plugin:2.8.1:jar (module-javadocs) @ hadoop-hdfs-project ---
[INFO] Not executing Javadoc as the project is not a Java classpath-capable package
[INFO] 
[INFO] --- maven-enforcer-plugin:1.3.1:enforce (depcheck) @ hadoop-hdfs-project ---
[INFO] 
[INFO] --- maven-checkstyle-plugin:2.15:checkstyle (default-cli) @ hadoop-hdfs-project ---
[INFO] 
[INFO] --- findbugs-maven-plugin:3.0.0:findbugs (default-cli) @ hadoop-hdfs-project ---
[INFO] ------------------------------------------------------------------------
[INFO] Reactor Summary:
[INFO] 
[INFO] Apache Hadoop HDFS Client ......................... SUCCESS [03:57 min]
[INFO] Apache Hadoop HDFS ................................ FAILURE [  04:13 h]
[INFO] Apache Hadoop HDFS Native Client .................. SKIPPED
[INFO] Apache Hadoop HttpFS .............................. SKIPPED
[INFO] Apache Hadoop HDFS BookKeeper Journal ............. SKIPPED
[INFO] Apache Hadoop HDFS-NFS ............................ SKIPPED
[INFO] Apache Hadoop HDFS Project ........................ SUCCESS [  0.067 s]
[INFO] ------------------------------------------------------------------------
[INFO] BUILD FAILURE
[INFO] ------------------------------------------------------------------------
[INFO] Total time: 04:17 h
[INFO] Finished at: 2016-02-21T12:04:17+00:00
[INFO] Final Memory: 56M/527M
[INFO] ------------------------------------------------------------------------
[ERROR] Failed to execute goal org.apache.maven.plugins:maven-surefire-plugin:2.17:test (default-test)
on project hadoop-hdfs: There are test failures.
[ERROR] 
[ERROR] Please refer to <https://builds.apache.org/job/Hadoop-Hdfs-trunk-Java8/ws/hadoop-hdfs-project/hadoop-hdfs/target/surefire-reports>
for the individual test results.
[ERROR] -> [Help 1]
[ERROR] 
[ERROR] To see the full stack trace of the errors, re-run Maven with the -e switch.
[ERROR] Re-run Maven using the -X switch to enable full debug logging.
[ERROR] 
[ERROR] For more information about the errors and possible solutions, please read the following
articles:
[ERROR] [Help 1] http://cwiki.apache.org/confluence/display/MAVEN/MojoFailureException
[ERROR] 
[ERROR] After correcting the problems, you can resume the build with the command
[ERROR]   mvn <goals> -rf :hadoop-hdfs
Build step 'Execute shell' marked build as failure
Archiving artifacts
Recording test results

Mime
View raw message