hadoop-hdfs-dev mailing list archives

Site index · List index
Message view « Date » · « Thread »
Top « Date » · « Thread »
From Apache Jenkins Server <jenk...@builds.apache.org>
Subject Hadoop-Hdfs-trunk - Build # 2859 - Still Failing
Date Mon, 22 Feb 2016 23:10:41 GMT
See https://builds.apache.org/job/Hadoop-Hdfs-trunk/2859/

###################################################################################
########################## LAST 60 LINES OF THE CONSOLE ###########################
[...truncated 5320 lines...]
[INFO] --- maven-antrun-plugin:1.7:run (create-testdirs) @ hadoop-hdfs-project ---
[INFO] Executing tasks

main:
    [mkdir] Created dir: /home/jenkins/jenkins-slave/workspace/Hadoop-Hdfs-trunk/hadoop-hdfs-project/target/test-dir
[INFO] Executed tasks
[INFO] 
[INFO] --- maven-source-plugin:2.3:jar-no-fork (hadoop-java-sources) @ hadoop-hdfs-project
---
[INFO] 
[INFO] --- maven-source-plugin:2.3:test-jar-no-fork (hadoop-java-sources) @ hadoop-hdfs-project
---
[INFO] 
[INFO] --- maven-enforcer-plugin:1.3.1:enforce (dist-enforce) @ hadoop-hdfs-project ---
[INFO] 
[INFO] --- maven-site-plugin:3.4:attach-descriptor (attach-descriptor) @ hadoop-hdfs-project
---
[INFO] 
[INFO] --- maven-javadoc-plugin:2.8.1:jar (module-javadocs) @ hadoop-hdfs-project ---
[INFO] Skipping javadoc generation
[INFO] 
[INFO] --- maven-enforcer-plugin:1.3.1:enforce (depcheck) @ hadoop-hdfs-project ---
[INFO] 
[INFO] --- maven-checkstyle-plugin:2.15:checkstyle (default-cli) @ hadoop-hdfs-project ---
[INFO] 
[INFO] --- findbugs-maven-plugin:3.0.0:findbugs (default-cli) @ hadoop-hdfs-project ---
[INFO] ------------------------------------------------------------------------
[INFO] Reactor Summary:
[INFO] 
[INFO] Apache Hadoop HDFS Client ......................... SUCCESS [04:29 min]
[INFO] Apache Hadoop HDFS ................................ FAILURE [  03:16 h]
[INFO] Apache Hadoop HDFS Native Client .................. SKIPPED
[INFO] Apache Hadoop HttpFS .............................. SKIPPED
[INFO] Apache Hadoop HDFS BookKeeper Journal ............. SKIPPED
[INFO] Apache Hadoop HDFS-NFS ............................ SKIPPED
[INFO] Apache Hadoop HDFS Project ........................ SUCCESS [  0.058 s]
[INFO] ------------------------------------------------------------------------
[INFO] BUILD FAILURE
[INFO] ------------------------------------------------------------------------
[INFO] Total time: 03:20 h
[INFO] Finished at: 2016-02-22T23:10:28+00:00
[INFO] Final Memory: 56M/676M
[INFO] ------------------------------------------------------------------------
[ERROR] Failed to execute goal org.apache.maven.plugins:maven-surefire-plugin:2.17:test (default-test)
on project hadoop-hdfs: There are test failures.
[ERROR] 
[ERROR] Please refer to /home/jenkins/jenkins-slave/workspace/Hadoop-Hdfs-trunk/hadoop-hdfs-project/hadoop-hdfs/target/surefire-reports
for the individual test results.
[ERROR] -> [Help 1]
[ERROR] 
[ERROR] To see the full stack trace of the errors, re-run Maven with the -e switch.
[ERROR] Re-run Maven using the -X switch to enable full debug logging.
[ERROR] 
[ERROR] For more information about the errors and possible solutions, please read the following
articles:
[ERROR] [Help 1] http://cwiki.apache.org/confluence/display/MAVEN/MojoFailureException
[ERROR] 
[ERROR] After correcting the problems, you can resume the build with the command
[ERROR]   mvn <goals> -rf :hadoop-hdfs
Build step 'Execute shell' marked build as failure
Archiving artifacts
Recording test results
Sending e-mails to: hdfs-dev@hadoop.apache.org
Email was triggered for: Failure - Any
Sending email for trigger: Failure - Any



###################################################################################
############################## FAILED TESTS (if any) ##############################
1 tests failed.
FAILED:  org.apache.hadoop.hdfs.server.namenode.ha.TestBootstrapStandbyWithQJM.testUpgradeWithFormat

Error Message:
java.lang.RuntimeException: java.net.SocketTimeoutException: Read timed out

Stack Trace:
java.io.IOException: java.lang.RuntimeException: java.net.SocketTimeoutException: Read timed
out
	at java.net.SocketInputStream.socketRead0(Native Method)
	at java.net.SocketInputStream.read(SocketInputStream.java:152)
	at java.net.SocketInputStream.read(SocketInputStream.java:122)
	at java.io.BufferedInputStream.fill(BufferedInputStream.java:235)
	at java.io.BufferedInputStream.read1(BufferedInputStream.java:275)
	at java.io.BufferedInputStream.read(BufferedInputStream.java:334)
	at sun.net.www.http.HttpClient.parseHTTPHeader(HttpClient.java:687)
	at sun.net.www.http.HttpClient.parseHTTP(HttpClient.java:633)
	at sun.net.www.protocol.http.HttpURLConnection.getInputStream(HttpURLConnection.java:1323)
	at java.net.HttpURLConnection.getResponseCode(HttpURLConnection.java:468)
	at org.apache.hadoop.hdfs.server.namenode.TransferFsImage.doGetUrl(TransferFsImage.java:438)
	at org.apache.hadoop.hdfs.server.namenode.TransferFsImage.getFileClient(TransferFsImage.java:423)
	at org.apache.hadoop.hdfs.server.namenode.TransferFsImage.downloadImageToStorage(TransferFsImage.java:143)
	at org.apache.hadoop.hdfs.server.namenode.ha.BootstrapStandby.downloadImage(BootstrapStandby.java:334)
	at org.apache.hadoop.hdfs.server.namenode.ha.BootstrapStandby.doRun(BootstrapStandby.java:222)
	at org.apache.hadoop.hdfs.server.namenode.ha.BootstrapStandby.access$000(BootstrapStandby.java:78)
	at org.apache.hadoop.hdfs.server.namenode.ha.BootstrapStandby$1.run(BootstrapStandby.java:114)
	at org.apache.hadoop.hdfs.server.namenode.ha.BootstrapStandby$1.run(BootstrapStandby.java:110)
	at org.apache.hadoop.security.SecurityUtil.doAsLoginUserOrFatal(SecurityUtil.java:444)
	at org.apache.hadoop.hdfs.server.namenode.ha.BootstrapStandby.run(BootstrapStandby.java:110)
	at org.apache.hadoop.util.ToolRunner.run(ToolRunner.java:76)
	at org.apache.hadoop.util.ToolRunner.run(ToolRunner.java:90)
	at org.apache.hadoop.hdfs.server.namenode.ha.BootstrapStandby.run(BootstrapStandby.java:445)
	at org.apache.hadoop.hdfs.server.namenode.ha.TestBootstrapStandbyWithQJM.testUpgrade(TestBootstrapStandbyWithQJM.java:183)
	at org.apache.hadoop.hdfs.server.namenode.ha.TestBootstrapStandbyWithQJM.testUpgradeWithFormat(TestBootstrapStandbyWithQJM.java:151)



Mime
  • Unnamed multipart/mixed (inline, None, 0 bytes)
View raw message