hadoop-hdfs-dev mailing list archives

Site index · List index
Message view « Date » · « Thread »
Top « Date » · « Thread »
From Apache Jenkins Server <jenk...@builds.apache.org>
Subject Hadoop-Hdfs-trunk - Build # 2797 - Still Failing
Date Wed, 03 Feb 2016 16:49:32 GMT
See https://builds.apache.org/job/Hadoop-Hdfs-trunk/2797/

###################################################################################
########################## LAST 60 LINES OF THE CONSOLE ###########################
[...truncated 5301 lines...]
[INFO] --- maven-clean-plugin:2.5:clean (default-clean) @ hadoop-hdfs-project ---
[INFO] Deleting /home/jenkins/jenkins-slave/workspace/Hadoop-Hdfs-trunk/hadoop-hdfs-project/target
[INFO] 
[INFO] --- maven-antrun-plugin:1.7:run (create-testdirs) @ hadoop-hdfs-project ---
[INFO] Executing tasks

main:
    [mkdir] Created dir: /home/jenkins/jenkins-slave/workspace/Hadoop-Hdfs-trunk/hadoop-hdfs-project/target/test-dir
[INFO] Executed tasks
[INFO] 
[INFO] --- maven-source-plugin:2.3:jar-no-fork (hadoop-java-sources) @ hadoop-hdfs-project
---
[INFO] 
[INFO] --- maven-source-plugin:2.3:test-jar-no-fork (hadoop-java-sources) @ hadoop-hdfs-project
---
[INFO] 
[INFO] --- maven-enforcer-plugin:1.3.1:enforce (dist-enforce) @ hadoop-hdfs-project ---
[INFO] 
[INFO] --- maven-site-plugin:3.4:attach-descriptor (attach-descriptor) @ hadoop-hdfs-project
---
[INFO] 
[INFO] --- maven-javadoc-plugin:2.8.1:jar (module-javadocs) @ hadoop-hdfs-project ---
[INFO] Skipping javadoc generation
[INFO] 
[INFO] --- maven-enforcer-plugin:1.3.1:enforce (depcheck) @ hadoop-hdfs-project ---
[INFO] 
[INFO] --- maven-checkstyle-plugin:2.15:checkstyle (default-cli) @ hadoop-hdfs-project ---
[INFO] 
[INFO] --- findbugs-maven-plugin:3.0.0:findbugs (default-cli) @ hadoop-hdfs-project ---
[INFO] ------------------------------------------------------------------------
[INFO] Reactor Summary:
[INFO] 
[INFO] Apache Hadoop HDFS Client ......................... SUCCESS [06:44 min]
[INFO] Apache Hadoop HDFS ................................ FAILURE [  05:11 h]
[INFO] Apache Hadoop HDFS Native Client .................. SKIPPED
[INFO] Apache Hadoop HttpFS .............................. SKIPPED
[INFO] Apache Hadoop HDFS BookKeeper Journal ............. SKIPPED
[INFO] Apache Hadoop HDFS-NFS ............................ SKIPPED
[INFO] Apache Hadoop HDFS Project ........................ SUCCESS [  0.156 s]
[INFO] ------------------------------------------------------------------------
[INFO] BUILD FAILURE
[INFO] ------------------------------------------------------------------------
[INFO] Total time: 05:18 h
[INFO] Finished at: 2016-02-03T16:49:19+00:00
[INFO] Final Memory: 69M/644M
[INFO] ------------------------------------------------------------------------
[ERROR] Failed to execute goal org.apache.maven.plugins:maven-surefire-plugin:2.17:test (default-test)
on project hadoop-hdfs: ExecutionException: java.lang.RuntimeException: java.lang.RuntimeException:
java.io.IOException: Stream Closed -> [Help 1]
[ERROR] 
[ERROR] To see the full stack trace of the errors, re-run Maven with the -e switch.
[ERROR] Re-run Maven using the -X switch to enable full debug logging.
[ERROR] 
[ERROR] For more information about the errors and possible solutions, please read the following
articles:
[ERROR] [Help 1] http://cwiki.apache.org/confluence/display/MAVEN/MojoFailureException
[ERROR] 
[ERROR] After correcting the problems, you can resume the build with the command
[ERROR]   mvn <goals> -rf :hadoop-hdfs
Build step 'Execute shell' marked build as failure
Archiving artifacts
Recording test results
Sending e-mails to: hdfs-dev@hadoop.apache.org
Email was triggered for: Failure - Any
Sending email for trigger: Failure - Any



###################################################################################
############################## FAILED TESTS (if any) ##############################
3 tests failed.
FAILED:  org.apache.hadoop.hdfs.TestDatanodeStartupFixesLegacyStorageIDs.testUpgradeFrom22FixesStorageIDs

Error Message:
null

Stack Trace:
java.lang.AssertionError: null
	at org.junit.Assert.fail(Assert.java:86)
	at org.junit.Assert.assertTrue(Assert.java:41)
	at org.junit.Assert.assertTrue(Assert.java:52)
	at org.apache.hadoop.hdfs.TestDatanodeStartupFixesLegacyStorageIDs$1.verifyClusterPostUpgrade(TestDatanodeStartupFixesLegacyStorageIDs.java:79)
	at org.apache.hadoop.hdfs.TestDFSUpgradeFromImage.upgradeAndVerify(TestDFSUpgradeFromImage.java:609)
	at org.apache.hadoop.hdfs.TestDatanodeStartupFixesLegacyStorageIDs.upgradeAndVerify(TestDatanodeStartupFixesLegacyStorageIDs.java:103)
	at org.apache.hadoop.hdfs.TestDatanodeStartupFixesLegacyStorageIDs.runLayoutUpgradeTest(TestDatanodeStartupFixesLegacyStorageIDs.java:70)
	at org.apache.hadoop.hdfs.TestDatanodeStartupFixesLegacyStorageIDs.testUpgradeFrom22FixesStorageIDs(TestDatanodeStartupFixesLegacyStorageIDs.java:115)


FAILED:  org.apache.hadoop.hdfs.TestErasureCodeBenchmarkThroughput.testECReadWrite

Error Message:
java.io.IOException: Data streamers failed while creating new block streams: [#1: failed,
blk_-9223372036854775743_1010, #3: failed, blk_-9223372036854775741_1010, #4: failed, blk_-9223372036854775740_1010,
#0: failed, blk_-9223372036854775744_1010, #2: failed, blk_-9223372036854775742_1010, #7:
failed, blk_-9223372036854775737_1010, #5: failed, blk_-9223372036854775739_1010]. There are
not enough healthy streamers.

Stack Trace:
java.util.concurrent.ExecutionException: java.io.IOException: Data streamers failed while
creating new block streams: [#1: failed, blk_-9223372036854775743_1010, #3: failed, blk_-9223372036854775741_1010,
#4: failed, blk_-9223372036854775740_1010, #0: failed, blk_-9223372036854775744_1010, #2:
failed, blk_-9223372036854775742_1010, #7: failed, blk_-9223372036854775737_1010, #5: failed,
blk_-9223372036854775739_1010]. There are not enough healthy streamers.
	at java.util.concurrent.FutureTask.report(FutureTask.java:122)
	at java.util.concurrent.FutureTask.get(FutureTask.java:188)
	at org.apache.hadoop.hdfs.ErasureCodeBenchmarkThroughput.doBenchmark(ErasureCodeBenchmarkThroughput.java:133)
	at org.apache.hadoop.hdfs.ErasureCodeBenchmarkThroughput.benchmark(ErasureCodeBenchmarkThroughput.java:158)
	at org.apache.hadoop.hdfs.ErasureCodeBenchmarkThroughput.run(ErasureCodeBenchmarkThroughput.java:258)
	at org.apache.hadoop.util.ToolRunner.run(ToolRunner.java:76)
	at org.apache.hadoop.hdfs.TestErasureCodeBenchmarkThroughput.runBenchmark(TestErasureCodeBenchmarkThroughput.java:66)
	at org.apache.hadoop.hdfs.TestErasureCodeBenchmarkThroughput.testECReadWrite(TestErasureCodeBenchmarkThroughput.java:103)
Caused by: java.io.IOException: Data streamers failed while creating new block streams: [#1:
failed, blk_-9223372036854775743_1010, #3: failed, blk_-9223372036854775741_1010, #4: failed,
blk_-9223372036854775740_1010, #0: failed, blk_-9223372036854775744_1010, #2: failed, blk_-9223372036854775742_1010,
#7: failed, blk_-9223372036854775737_1010, #5: failed, blk_-9223372036854775739_1010]. There
are not enough healthy streamers.
	at org.apache.hadoop.hdfs.DFSStripedOutputStream.checkStreamerFailures(DFSStripedOutputStream.java:631)
	at org.apache.hadoop.hdfs.DFSStripedOutputStream.writeChunk(DFSStripedOutputStream.java:547)
	at org.apache.hadoop.fs.FSOutputSummer.writeChecksumChunks(FSOutputSummer.java:217)
	at org.apache.hadoop.fs.FSOutputSummer.write1(FSOutputSummer.java:125)
	at org.apache.hadoop.fs.FSOutputSummer.write(FSOutputSummer.java:111)
	at org.apache.hadoop.fs.FSDataOutputStream$PositionCache.write(FSDataOutputStream.java:57)
	at java.io.DataOutputStream.write(DataOutputStream.java:107)
	at org.apache.hadoop.hdfs.ErasureCodeBenchmarkThroughput$WriteCallable.writeFile(ErasureCodeBenchmarkThroughput.java:318)
	at org.apache.hadoop.hdfs.ErasureCodeBenchmarkThroughput$WriteCallable.call(ErasureCodeBenchmarkThroughput.java:342)
	at org.apache.hadoop.hdfs.ErasureCodeBenchmarkThroughput$WriteCallable.call(ErasureCodeBenchmarkThroughput.java:297)
	at java.util.concurrent.FutureTask.run(FutureTask.java:262)
	at java.util.concurrent.Executors$RunnableAdapter.call(Executors.java:471)
	at java.util.concurrent.FutureTask.run(FutureTask.java:262)
	at java.util.concurrent.ThreadPoolExecutor.runWorker(ThreadPoolExecutor.java:1145)
	at java.util.concurrent.ThreadPoolExecutor$Worker.run(ThreadPoolExecutor.java:615)
	at java.lang.Thread.run(Thread.java:745)


FAILED:  org.apache.hadoop.hdfs.server.blockmanagement.TestBlockManagerSafeMode.testCheckSafeMode

Error Message:
expected:<EXTENSION> but was:<OFF>

Stack Trace:
java.lang.AssertionError: expected:<EXTENSION> but was:<OFF>
	at org.junit.Assert.fail(Assert.java:88)
	at org.junit.Assert.failNotEquals(Assert.java:743)
	at org.junit.Assert.assertEquals(Assert.java:118)
	at org.junit.Assert.assertEquals(Assert.java:144)
	at org.apache.hadoop.hdfs.server.blockmanagement.TestBlockManagerSafeMode.testCheckSafeMode(TestBlockManagerSafeMode.java:158)



Mime
  • Unnamed multipart/mixed (inline, None, 0 bytes)
View raw message