hadoop-hdfs-dev mailing list archives

Site index · List index
Message view « Date » · « Thread »
Top « Date » · « Thread »
From Apache Jenkins Server <jenk...@builds.apache.org>
Subject Build failed in Jenkins: Hadoop-Hdfs-trunk #2744
Date Wed, 20 Jan 2016 01:09:51 GMT
See <https://builds.apache.org/job/Hadoop-Hdfs-trunk/2744/changes>

Changes:

[wangda] HADOOP-12356. Fix computing CPU usage statistics on Windows. (Inigo

------------------------------------------
[...truncated 5239 lines...]
Running org.apache.hadoop.hdfs.TestDFSOutputStream
Tests run: 3, Failures: 0, Errors: 0, Skipped: 0, Time elapsed: 5.249 sec - in org.apache.hadoop.hdfs.TestDFSOutputStream
Running org.apache.hadoop.hdfs.TestSnapshotCommands
Tests run: 6, Failures: 0, Errors: 0, Skipped: 0, Time elapsed: 4.602 sec - in org.apache.hadoop.hdfs.TestSnapshotCommands
Running org.apache.hadoop.hdfs.TestSafeModeWithStripedFile
Tests run: 2, Failures: 0, Errors: 0, Skipped: 0, Time elapsed: 27.502 sec - in org.apache.hadoop.hdfs.TestSafeModeWithStripedFile
Running org.apache.hadoop.hdfs.TestDFSStripedOutputStreamWithFailure090
Tests run: 10, Failures: 0, Errors: 0, Skipped: 0, Time elapsed: 39.229 sec - in org.apache.hadoop.hdfs.TestDFSStripedOutputStreamWithFailure090
Running org.apache.hadoop.hdfs.TestSeekBug
Tests run: 4, Failures: 0, Errors: 0, Skipped: 0, Time elapsed: 6.946 sec - in org.apache.hadoop.hdfs.TestSeekBug
Running org.apache.hadoop.hdfs.TestDatanodeReport
Tests run: 1, Failures: 0, Errors: 0, Skipped: 0, Time elapsed: 21.201 sec - in org.apache.hadoop.hdfs.TestDatanodeReport
Running org.apache.hadoop.hdfs.TestDistributedFileSystem
Tests run: 18, Failures: 0, Errors: 0, Skipped: 0, Time elapsed: 44.67 sec - in org.apache.hadoop.hdfs.TestDistributedFileSystem
Running org.apache.hadoop.hdfs.security.TestDelegationToken
Tests run: 7, Failures: 0, Errors: 0, Skipped: 0, Time elapsed: 32.338 sec - in org.apache.hadoop.hdfs.security.TestDelegationToken
Running org.apache.hadoop.hdfs.security.token.block.TestBlockToken
Tests run: 6, Failures: 0, Errors: 0, Skipped: 0, Time elapsed: 7.493 sec - in org.apache.hadoop.hdfs.security.token.block.TestBlockToken
Running org.apache.hadoop.hdfs.security.TestDelegationTokenForProxyUser
Tests run: 2, Failures: 0, Errors: 0, Skipped: 0, Time elapsed: 6.158 sec - in org.apache.hadoop.hdfs.security.TestDelegationTokenForProxyUser
Running org.apache.hadoop.hdfs.security.TestClientProtocolWithDelegationToken
Tests run: 1, Failures: 0, Errors: 0, Skipped: 0, Time elapsed: 1.864 sec - in org.apache.hadoop.hdfs.security.TestClientProtocolWithDelegationToken
Running org.apache.hadoop.hdfs.TestDFSStripedOutputStreamWithFailure110
Tests run: 10, Failures: 0, Errors: 0, Skipped: 0, Time elapsed: 40.419 sec - in org.apache.hadoop.hdfs.TestDFSStripedOutputStreamWithFailure110
Running org.apache.hadoop.hdfs.crypto.TestHdfsCryptoStreams
Tests run: 14, Failures: 0, Errors: 0, Skipped: 0, Time elapsed: 26.924 sec - in org.apache.hadoop.hdfs.crypto.TestHdfsCryptoStreams
Running org.apache.hadoop.hdfs.TestWriteBlockGetsBlockLengthHint
Tests run: 1, Failures: 0, Errors: 0, Skipped: 0, Time elapsed: 4.448 sec - in org.apache.hadoop.hdfs.TestWriteBlockGetsBlockLengthHint
Running org.apache.hadoop.hdfs.TestErasureCodingPolicyWithSnapshot
Tests run: 4, Failures: 0, Errors: 0, Skipped: 0, Time elapsed: 19.811 sec - in org.apache.hadoop.hdfs.TestErasureCodingPolicyWithSnapshot
Running org.apache.hadoop.hdfs.TestParallelShortCircuitRead
Tests run: 4, Failures: 0, Errors: 0, Skipped: 0, Time elapsed: 15.006 sec - in org.apache.hadoop.hdfs.TestParallelShortCircuitRead
Running org.apache.hadoop.hdfs.TestDFSStripedOutputStreamWithFailure070
Tests run: 10, Failures: 0, Errors: 0, Skipped: 0, Time elapsed: 0.323 sec - in org.apache.hadoop.hdfs.TestDFSStripedOutputStreamWithFailure070
Running org.apache.hadoop.hdfs.TestAclsEndToEnd
Tests run: 9, Failures: 0, Errors: 0, Skipped: 0, Time elapsed: 60.109 sec - in org.apache.hadoop.hdfs.TestAclsEndToEnd
Running org.apache.hadoop.hdfs.TestDFSStripedOutputStreamWithFailure020
Tests run: 10, Failures: 0, Errors: 0, Skipped: 0, Time elapsed: 91.527 sec - in org.apache.hadoop.hdfs.TestDFSStripedOutputStreamWithFailure020
Running org.apache.hadoop.hdfs.TestFileStatus
Tests run: 5, Failures: 0, Errors: 0, Skipped: 0, Time elapsed: 4.452 sec - in org.apache.hadoop.hdfs.TestFileStatus
Running org.apache.hadoop.hdfs.TestDFSAddressConfig
Tests run: 1, Failures: 0, Errors: 0, Skipped: 0, Time elapsed: 4.975 sec - in org.apache.hadoop.hdfs.TestDFSAddressConfig
Running org.apache.hadoop.hdfs.TestRecoverStripedFile
Tests run: 13, Failures: 0, Errors: 0, Skipped: 0, Time elapsed: 76.815 sec - in org.apache.hadoop.hdfs.TestRecoverStripedFile
Running org.apache.hadoop.hdfs.TestFileLengthOnClusterRestart
Tests run: 1, Failures: 0, Errors: 0, Skipped: 0, Time elapsed: 11.119 sec - in org.apache.hadoop.hdfs.TestFileLengthOnClusterRestart
Running org.apache.hadoop.hdfs.TestPread
Tests run: 7, Failures: 0, Errors: 0, Skipped: 0, Time elapsed: 97.914 sec - in org.apache.hadoop.hdfs.TestPread
Running org.apache.hadoop.hdfs.TestFileAppend2
Tests run: 5, Failures: 0, Errors: 0, Skipped: 0, Time elapsed: 25.589 sec - in org.apache.hadoop.hdfs.TestFileAppend2
Running org.apache.hadoop.hdfs.TestCrcCorruption
Tests run: 4, Failures: 0, Errors: 0, Skipped: 0, Time elapsed: 16.621 sec - in org.apache.hadoop.hdfs.TestCrcCorruption
Running org.apache.hadoop.hdfs.TestGetFileChecksum
Tests run: 2, Failures: 0, Errors: 0, Skipped: 0, Time elapsed: 8.977 sec - in org.apache.hadoop.hdfs.TestGetFileChecksum
Running org.apache.hadoop.hdfs.TestLeaseRecovery2
Tests run: 7, Failures: 0, Errors: 0, Skipped: 0, Time elapsed: 70.683 sec - in org.apache.hadoop.hdfs.TestLeaseRecovery2
Running org.apache.hadoop.hdfs.TestDFSStripedOutputStreamWithFailure000
Tests run: 10, Failures: 0, Errors: 0, Skipped: 0, Time elapsed: 0.32 sec - in org.apache.hadoop.hdfs.TestDFSStripedOutputStreamWithFailure000
Running org.apache.hadoop.hdfs.TestWriteConfigurationToDFS
Tests run: 1, Failures: 0, Errors: 0, Skipped: 0, Time elapsed: 5.376 sec - in org.apache.hadoop.hdfs.TestWriteConfigurationToDFS
Running org.apache.hadoop.hdfs.TestRollingUpgrade
Tests run: 12, Failures: 0, Errors: 0, Skipped: 0, Time elapsed: 116.977 sec - in org.apache.hadoop.hdfs.TestRollingUpgrade
Running org.apache.hadoop.hdfs.TestReservedRawPaths
Tests run: 8, Failures: 0, Errors: 0, Skipped: 0, Time elapsed: 9.914 sec - in org.apache.hadoop.hdfs.TestReservedRawPaths
Running org.apache.hadoop.hdfs.TestListFilesInDFS
Tests run: 2, Failures: 0, Errors: 0, Skipped: 0, Time elapsed: 4.871 sec - in org.apache.hadoop.hdfs.TestListFilesInDFS
Running org.apache.hadoop.hdfs.TestParallelShortCircuitReadUnCached
Tests run: 4, Failures: 0, Errors: 0, Skipped: 0, Time elapsed: 35.169 sec - in org.apache.hadoop.hdfs.TestParallelShortCircuitReadUnCached
Running org.apache.hadoop.hdfs.tools.TestDFSHAAdminMiniCluster
Tests run: 6, Failures: 0, Errors: 0, Skipped: 0, Time elapsed: 7.461 sec - in org.apache.hadoop.hdfs.tools.TestDFSHAAdminMiniCluster
Running org.apache.hadoop.hdfs.tools.TestGetConf
Tests run: 10, Failures: 0, Errors: 0, Skipped: 0, Time elapsed: 1.334 sec - in org.apache.hadoop.hdfs.tools.TestGetConf
Running org.apache.hadoop.hdfs.tools.TestStoragePolicyCommands
Tests run: 1, Failures: 0, Errors: 0, Skipped: 0, Time elapsed: 4.69 sec - in org.apache.hadoop.hdfs.tools.TestStoragePolicyCommands
Running org.apache.hadoop.hdfs.tools.TestDFSZKFailoverController
Tests run: 4, Failures: 0, Errors: 0, Skipped: 0, Time elapsed: 14.592 sec - in org.apache.hadoop.hdfs.tools.TestDFSZKFailoverController
Running org.apache.hadoop.hdfs.tools.TestDFSAdmin
Tests run: 2, Failures: 0, Errors: 0, Skipped: 0, Time elapsed: 6.037 sec - in org.apache.hadoop.hdfs.tools.TestDFSAdmin
Running org.apache.hadoop.hdfs.tools.offlineImageViewer.TestOfflineImageViewerForXAttr
Tests run: 6, Failures: 0, Errors: 0, Skipped: 0, Time elapsed: 4.921 sec - in org.apache.hadoop.hdfs.tools.offlineImageViewer.TestOfflineImageViewerForXAttr
Running org.apache.hadoop.hdfs.tools.offlineImageViewer.TestOfflineImageViewerWithStripedBlocks
Tests run: 7, Failures: 0, Errors: 0, Skipped: 0, Time elapsed: 7.605 sec - in org.apache.hadoop.hdfs.tools.offlineImageViewer.TestOfflineImageViewerWithStripedBlocks
Running org.apache.hadoop.hdfs.tools.offlineImageViewer.TestOfflineImageViewer
Tests run: 8, Failures: 0, Errors: 0, Skipped: 0, Time elapsed: 5.611 sec - in org.apache.hadoop.hdfs.tools.offlineImageViewer.TestOfflineImageViewer
Running org.apache.hadoop.hdfs.tools.offlineImageViewer.TestOfflineImageViewerForContentSummary
Tests run: 6, Failures: 0, Errors: 0, Skipped: 0, Time elapsed: 5.544 sec - in org.apache.hadoop.hdfs.tools.offlineImageViewer.TestOfflineImageViewerForContentSummary
Running org.apache.hadoop.hdfs.tools.offlineImageViewer.TestOfflineImageViewerForAcl
Tests run: 2, Failures: 0, Errors: 0, Skipped: 0, Time elapsed: 5.311 sec - in org.apache.hadoop.hdfs.tools.offlineImageViewer.TestOfflineImageViewerForAcl
Running org.apache.hadoop.hdfs.tools.TestDFSHAAdmin
Tests run: 20, Failures: 0, Errors: 0, Skipped: 0, Time elapsed: 1.926 sec - in org.apache.hadoop.hdfs.tools.TestDFSHAAdmin
Running org.apache.hadoop.hdfs.tools.TestDelegationTokenFetcher
Tests run: 4, Failures: 0, Errors: 0, Skipped: 0, Time elapsed: 4.032 sec - in org.apache.hadoop.hdfs.tools.TestDelegationTokenFetcher
Running org.apache.hadoop.hdfs.tools.TestDebugAdmin
Tests run: 3, Failures: 0, Errors: 0, Skipped: 0, Time elapsed: 6.081 sec - in org.apache.hadoop.hdfs.tools.TestDebugAdmin
Running org.apache.hadoop.hdfs.tools.TestGetGroups
Tests run: 6, Failures: 0, Errors: 0, Skipped: 0, Time elapsed: 5.233 sec - in org.apache.hadoop.hdfs.tools.TestGetGroups
Running org.apache.hadoop.hdfs.tools.TestDFSAdminWithHA
Tests run: 11, Failures: 0, Errors: 0, Skipped: 0, Time elapsed: 20.281 sec - in org.apache.hadoop.hdfs.tools.TestDFSAdminWithHA
Running org.apache.hadoop.hdfs.tools.offlineEditsViewer.TestOfflineEditsViewer
Tests run: 4, Failures: 0, Errors: 0, Skipped: 0, Time elapsed: 13.642 sec - in org.apache.hadoop.hdfs.tools.offlineEditsViewer.TestOfflineEditsViewer
Running org.apache.hadoop.hdfs.TestHDFSFileSystemContract
Tests run: 44, Failures: 0, Errors: 0, Skipped: 0, Time elapsed: 53.934 sec - in org.apache.hadoop.hdfs.TestHDFSFileSystemContract
Running org.apache.hadoop.hdfs.TestClose
Tests run: 1, Failures: 0, Errors: 0, Skipped: 0, Time elapsed: 4.618 sec - in org.apache.hadoop.hdfs.TestClose
Running org.apache.hadoop.hdfs.TestFetchImage
Tests run: 1, Failures: 0, Errors: 0, Skipped: 0, Time elapsed: 4.316 sec - in org.apache.hadoop.hdfs.TestFetchImage
Running org.apache.hadoop.hdfs.TestInjectionForSimulatedStorage
Tests run: 1, Failures: 0, Errors: 0, Skipped: 0, Time elapsed: 15.363 sec - in org.apache.hadoop.hdfs.TestInjectionForSimulatedStorage
Running org.apache.hadoop.hdfs.TestBlocksScheduledCounter
Tests run: 1, Failures: 0, Errors: 0, Skipped: 0, Time elapsed: 4.73 sec - in org.apache.hadoop.hdfs.TestBlocksScheduledCounter
Running org.apache.hadoop.hdfs.protocolPB.TestPBHelper
Tests run: 30, Failures: 0, Errors: 0, Skipped: 0, Time elapsed: 0.708 sec - in org.apache.hadoop.hdfs.protocolPB.TestPBHelper
Running org.apache.hadoop.hdfs.TestFileAppend
Tests run: 11, Failures: 0, Errors: 0, Skipped: 0, Time elapsed: 24.004 sec - in org.apache.hadoop.hdfs.TestFileAppend
Running org.apache.hadoop.hdfs.TestRollingUpgradeRollback
Tests run: 3, Failures: 0, Errors: 0, Skipped: 0, Time elapsed: 10.704 sec - in org.apache.hadoop.hdfs.TestRollingUpgradeRollback
Running org.apache.hadoop.hdfs.TestLease
Tests run: 5, Failures: 0, Errors: 0, Skipped: 0, Time elapsed: 8.963 sec - in org.apache.hadoop.hdfs.TestLease
Running org.apache.hadoop.hdfs.TestRemoteBlockReader2
Tests run: 1, Failures: 0, Errors: 0, Skipped: 0, Time elapsed: 5.692 sec - in org.apache.hadoop.hdfs.TestRemoteBlockReader2
Running org.apache.hadoop.net.TestNetworkTopology
Tests run: 10, Failures: 0, Errors: 0, Skipped: 0, Time elapsed: 9.43 sec - in org.apache.hadoop.net.TestNetworkTopology
Running org.apache.hadoop.TestGenericRefresh
Tests run: 9, Failures: 0, Errors: 0, Skipped: 0, Time elapsed: 4.381 sec - in org.apache.hadoop.TestGenericRefresh
Running org.apache.hadoop.tracing.TestTracingShortCircuitLocalRead
Tests run: 1, Failures: 0, Errors: 0, Skipped: 0, Time elapsed: 5.003 sec - in org.apache.hadoop.tracing.TestTracingShortCircuitLocalRead
Running org.apache.hadoop.tracing.TestTraceAdmin
Tests run: 1, Failures: 0, Errors: 0, Skipped: 0, Time elapsed: 4.578 sec - in org.apache.hadoop.tracing.TestTraceAdmin
Running org.apache.hadoop.tracing.TestTracing
Tests run: 1, Failures: 0, Errors: 0, Skipped: 0, Time elapsed: 5.622 sec - in org.apache.hadoop.tracing.TestTracing
Running org.apache.hadoop.cli.TestDeleteCLI
Tests run: 1, Failures: 0, Errors: 0, Skipped: 0, Time elapsed: 7.275 sec - in org.apache.hadoop.cli.TestDeleteCLI
Running org.apache.hadoop.cli.TestHDFSCLI
Tests run: 1, Failures: 0, Errors: 0, Skipped: 0, Time elapsed: 34.71 sec - in org.apache.hadoop.cli.TestHDFSCLI
Running org.apache.hadoop.cli.TestAclCLI
Tests run: 1, Failures: 0, Errors: 0, Skipped: 0, Time elapsed: 6.181 sec - in org.apache.hadoop.cli.TestAclCLI
Running org.apache.hadoop.cli.TestErasureCodingCLI
Tests run: 1, Failures: 0, Errors: 0, Skipped: 0, Time elapsed: 7.202 sec - in org.apache.hadoop.cli.TestErasureCodingCLI
Running org.apache.hadoop.cli.TestCacheAdminCLI
Tests run: 1, Failures: 0, Errors: 0, Skipped: 0, Time elapsed: 7.568 sec - in org.apache.hadoop.cli.TestCacheAdminCLI
Running org.apache.hadoop.cli.TestXAttrCLI
Tests run: 1, Failures: 0, Errors: 0, Skipped: 0, Time elapsed: 7.421 sec - in org.apache.hadoop.cli.TestXAttrCLI
Running org.apache.hadoop.cli.TestCryptoAdminCLI
Tests run: 1, Failures: 0, Errors: 0, Skipped: 0, Time elapsed: 7.075 sec - in org.apache.hadoop.cli.TestCryptoAdminCLI
Running org.apache.hadoop.security.TestPermission
Tests run: 3, Failures: 0, Errors: 0, Skipped: 0, Time elapsed: 6.39 sec - in org.apache.hadoop.security.TestPermission
Running org.apache.hadoop.security.TestRefreshUserMappings
Tests run: 2, Failures: 0, Errors: 0, Skipped: 0, Time elapsed: 5.966 sec - in org.apache.hadoop.security.TestRefreshUserMappings
Running org.apache.hadoop.security.TestPermissionSymlinks
Tests run: 15, Failures: 0, Errors: 0, Skipped: 0, Time elapsed: 5.852 sec - in org.apache.hadoop.security.TestPermissionSymlinks
Running org.apache.hadoop.tools.TestTools
Tests run: 5, Failures: 0, Errors: 0, Skipped: 0, Time elapsed: 1.508 sec - in org.apache.hadoop.tools.TestTools
Running org.apache.hadoop.tools.TestHdfsConfigFields
Tests run: 2, Failures: 0, Errors: 0, Skipped: 0, Time elapsed: 0.676 sec - in org.apache.hadoop.tools.TestHdfsConfigFields
Running org.apache.hadoop.tools.TestJMXGet
Tests run: 2, Failures: 0, Errors: 0, Skipped: 0, Time elapsed: 5.885 sec - in org.apache.hadoop.tools.TestJMXGet

Results :

Tests in error: 
  TestBalancer.testManyBalancerSimultaneously:1657 » NoClassDefFound org/apache/...
  TestBalancer.testBalancerWithStripedFile:1788->doTestBalancerWithStripedFile:1821 »
NoClassDefFound

Tests run: 4137, Failures: 0, Errors: 2, Skipped: 17

[INFO]                                                                         
[INFO] ------------------------------------------------------------------------
[INFO] Skipping Apache Hadoop HDFS Native Client
[INFO] This project has been banned from the build due to previous failures.
[INFO] ------------------------------------------------------------------------
[INFO]                                                                         
[INFO] ------------------------------------------------------------------------
[INFO] Skipping Apache Hadoop HttpFS
[INFO] This project has been banned from the build due to previous failures.
[INFO] ------------------------------------------------------------------------
[INFO]                                                                         
[INFO] ------------------------------------------------------------------------
[INFO] Skipping Apache Hadoop HDFS BookKeeper Journal
[INFO] This project has been banned from the build due to previous failures.
[INFO] ------------------------------------------------------------------------
[INFO]                                                                         
[INFO] ------------------------------------------------------------------------
[INFO] Skipping Apache Hadoop HDFS-NFS
[INFO] This project has been banned from the build due to previous failures.
[INFO] ------------------------------------------------------------------------
[INFO]                                                                         
[INFO] ------------------------------------------------------------------------
[INFO] Building Apache Hadoop HDFS Project 3.0.0-SNAPSHOT
[INFO] ------------------------------------------------------------------------
[INFO] 
[INFO] --- maven-clean-plugin:2.5:clean (default-clean) @ hadoop-hdfs-project ---
[INFO] Deleting <https://builds.apache.org/job/Hadoop-Hdfs-trunk/ws/hadoop-hdfs-project/target>
[INFO] 
[INFO] --- maven-antrun-plugin:1.7:run (create-testdirs) @ hadoop-hdfs-project ---
[INFO] Executing tasks

main:
    [mkdir] Created dir: <https://builds.apache.org/job/Hadoop-Hdfs-trunk/ws/hadoop-hdfs-project/target/test-dir>
[INFO] Executed tasks
[INFO] 
[INFO] --- maven-source-plugin:2.3:jar-no-fork (hadoop-java-sources) @ hadoop-hdfs-project
---
[INFO] 
[INFO] --- maven-source-plugin:2.3:test-jar-no-fork (hadoop-java-sources) @ hadoop-hdfs-project
---
[INFO] 
[INFO] --- maven-enforcer-plugin:1.3.1:enforce (dist-enforce) @ hadoop-hdfs-project ---
[INFO] 
[INFO] --- maven-site-plugin:3.4:attach-descriptor (attach-descriptor) @ hadoop-hdfs-project
---
[INFO] 
[INFO] --- maven-javadoc-plugin:2.8.1:jar (module-javadocs) @ hadoop-hdfs-project ---
[INFO] Skipping javadoc generation
[INFO] 
[INFO] --- maven-enforcer-plugin:1.3.1:enforce (depcheck) @ hadoop-hdfs-project ---
[INFO] 
[INFO] --- maven-checkstyle-plugin:2.15:checkstyle (default-cli) @ hadoop-hdfs-project ---
[INFO] 
[INFO] --- findbugs-maven-plugin:3.0.0:findbugs (default-cli) @ hadoop-hdfs-project ---
[INFO] ------------------------------------------------------------------------
[INFO] Reactor Summary:
[INFO] 
[INFO] Apache Hadoop HDFS Client ......................... SUCCESS [03:59 min]
[INFO] Apache Hadoop HDFS ................................ FAILURE [  03:11 h]
[INFO] Apache Hadoop HDFS Native Client .................. SKIPPED
[INFO] Apache Hadoop HttpFS .............................. SKIPPED
[INFO] Apache Hadoop HDFS BookKeeper Journal ............. SKIPPED
[INFO] Apache Hadoop HDFS-NFS ............................ SKIPPED
[INFO] Apache Hadoop HDFS Project ........................ SUCCESS [  0.059 s]
[INFO] ------------------------------------------------------------------------
[INFO] BUILD FAILURE
[INFO] ------------------------------------------------------------------------
[INFO] Total time: 03:15 h
[INFO] Finished at: 2016-01-20T01:09:50+00:00
[INFO] Final Memory: 57M/589M
[INFO] ------------------------------------------------------------------------
[ERROR] Failed to execute goal org.apache.maven.plugins:maven-surefire-plugin:2.17:test (default-test)
on project hadoop-hdfs: There are test failures.
[ERROR] 
[ERROR] Please refer to <https://builds.apache.org/job/Hadoop-Hdfs-trunk/ws/hadoop-hdfs-project/hadoop-hdfs/target/surefire-reports>
for the individual test results.
[ERROR] -> [Help 1]
[ERROR] 
[ERROR] To see the full stack trace of the errors, re-run Maven with the -e switch.
[ERROR] Re-run Maven using the -X switch to enable full debug logging.
[ERROR] 
[ERROR] For more information about the errors and possible solutions, please read the following
articles:
[ERROR] [Help 1] http://cwiki.apache.org/confluence/display/MAVEN/MojoFailureException
[ERROR] 
[ERROR] After correcting the problems, you can resume the build with the command
[ERROR]   mvn <goals> -rf :hadoop-hdfs
Build step 'Execute shell' marked build as failure
Archiving artifacts
Recording test results

Mime
View raw message