hadoop-hdfs-dev mailing list archives

Site index · List index
Message view « Date » · « Thread »
Top « Date » · « Thread »
From Apache Jenkins Server <jenk...@builds.apache.org>
Subject Hadoop-Hdfs-trunk - Build # 2699 - Still Failing
Date Thu, 07 Jan 2016 10:07:50 GMT
See https://builds.apache.org/job/Hadoop-Hdfs-trunk/2699/

###################################################################################
########################## LAST 60 LINES OF THE CONSOLE ###########################
[...truncated 6400 lines...]
[INFO] --- maven-antrun-plugin:1.7:run (create-testdirs) @ hadoop-hdfs-project ---
[INFO] Executing tasks

main:
    [mkdir] Created dir: /home/jenkins/jenkins-slave/workspace/Hadoop-Hdfs-trunk/hadoop-hdfs-project/target/test-dir
[INFO] Executed tasks
[INFO] 
[INFO] --- maven-source-plugin:2.3:jar-no-fork (hadoop-java-sources) @ hadoop-hdfs-project
---
[INFO] 
[INFO] --- maven-source-plugin:2.3:test-jar-no-fork (hadoop-java-sources) @ hadoop-hdfs-project
---
[INFO] 
[INFO] --- maven-enforcer-plugin:1.3.1:enforce (dist-enforce) @ hadoop-hdfs-project ---
[INFO] 
[INFO] --- maven-site-plugin:3.4:attach-descriptor (attach-descriptor) @ hadoop-hdfs-project
---
[INFO] 
[INFO] --- maven-javadoc-plugin:2.8.1:jar (module-javadocs) @ hadoop-hdfs-project ---
[INFO] Skipping javadoc generation
[INFO] 
[INFO] --- maven-enforcer-plugin:1.3.1:enforce (depcheck) @ hadoop-hdfs-project ---
[INFO] 
[INFO] --- maven-checkstyle-plugin:2.15:checkstyle (default-cli) @ hadoop-hdfs-project ---
[INFO] 
[INFO] --- findbugs-maven-plugin:3.0.0:findbugs (default-cli) @ hadoop-hdfs-project ---
[INFO] ------------------------------------------------------------------------
[INFO] Reactor Summary:
[INFO] 
[INFO] Apache Hadoop HDFS Client ......................... SUCCESS [04:16 min]
[INFO] Apache Hadoop HDFS ................................ FAILURE [  03:23 h]
[INFO] Apache Hadoop HDFS Native Client .................. SKIPPED
[INFO] Apache Hadoop HttpFS .............................. SKIPPED
[INFO] Apache Hadoop HDFS BookKeeper Journal ............. SKIPPED
[INFO] Apache Hadoop HDFS-NFS ............................ SKIPPED
[INFO] Apache Hadoop HDFS Project ........................ SUCCESS [  0.063 s]
[INFO] ------------------------------------------------------------------------
[INFO] BUILD FAILURE
[INFO] ------------------------------------------------------------------------
[INFO] Total time: 03:28 h
[INFO] Finished at: 2016-01-07T10:07:39+00:00
[INFO] Final Memory: 60M/740M
[INFO] ------------------------------------------------------------------------
[ERROR] Failed to execute goal org.apache.maven.plugins:maven-surefire-plugin:2.17:test (default-test)
on project hadoop-hdfs: There are test failures.
[ERROR] 
[ERROR] Please refer to /home/jenkins/jenkins-slave/workspace/Hadoop-Hdfs-trunk/hadoop-hdfs-project/hadoop-hdfs/target/surefire-reports
for the individual test results.
[ERROR] -> [Help 1]
[ERROR] 
[ERROR] To see the full stack trace of the errors, re-run Maven with the -e switch.
[ERROR] Re-run Maven using the -X switch to enable full debug logging.
[ERROR] 
[ERROR] For more information about the errors and possible solutions, please read the following
articles:
[ERROR] [Help 1] http://cwiki.apache.org/confluence/display/MAVEN/MojoFailureException
[ERROR] 
[ERROR] After correcting the problems, you can resume the build with the command
[ERROR]   mvn <goals> -rf :hadoop-hdfs
Build step 'Execute shell' marked build as failure
Archiving artifacts
Recording test results
Sending e-mails to: hdfs-dev@hadoop.apache.org
Email was triggered for: Failure - Any
Sending email for trigger: Failure - Any



###################################################################################
############################## FAILED TESTS (if any) ##############################
2 tests failed.
FAILED:  org.apache.hadoop.hdfs.TestDFSUpgradeFromImage.testUpgradeFromRel1BBWImage

Error Message:
Cannot obtain block length for LocatedBlock{BP-972153610-67.195.81.147-1452152732430:blk_7162739548153522810_1020;
getBlockSize()=1024; corrupt=false; offset=0; locs=[DatanodeInfoWithStorage[127.0.0.1:34141,DS-4790972c-6503-4e3d-bc77-66842497200b,DISK]]}

Stack Trace:
java.io.IOException: Cannot obtain block length for LocatedBlock{BP-972153610-67.195.81.147-1452152732430:blk_7162739548153522810_1020;
getBlockSize()=1024; corrupt=false; offset=0; locs=[DatanodeInfoWithStorage[127.0.0.1:34141,DS-4790972c-6503-4e3d-bc77-66842497200b,DISK]]}
	at org.apache.hadoop.hdfs.DFSInputStream.readBlockLength(DFSInputStream.java:399)
	at org.apache.hadoop.hdfs.DFSInputStream.fetchLocatedBlocksAndGetLastBlockLength(DFSInputStream.java:343)
	at org.apache.hadoop.hdfs.DFSInputStream.openInfo(DFSInputStream.java:275)
	at org.apache.hadoop.hdfs.DFSInputStream.<init>(DFSInputStream.java:265)
	at org.apache.hadoop.hdfs.DFSClient.open(DFSClient.java:1046)
	at org.apache.hadoop.hdfs.DFSClient.open(DFSClient.java:1011)
	at org.apache.hadoop.hdfs.TestDFSUpgradeFromImage.dfsOpenFileWithRetries(TestDFSUpgradeFromImage.java:177)
	at org.apache.hadoop.hdfs.TestDFSUpgradeFromImage.verifyDir(TestDFSUpgradeFromImage.java:213)
	at org.apache.hadoop.hdfs.TestDFSUpgradeFromImage.verifyFileSystem(TestDFSUpgradeFromImage.java:228)
	at org.apache.hadoop.hdfs.TestDFSUpgradeFromImage.upgradeAndVerify(TestDFSUpgradeFromImage.java:600)
	at org.apache.hadoop.hdfs.TestDFSUpgradeFromImage.testUpgradeFromRel1BBWImage(TestDFSUpgradeFromImage.java:622)


FAILED:  org.apache.hadoop.hdfs.server.namenode.TestNNThroughputBenchmark.testNNThroughput

Error Message:
Not replicated yet: /nnThroughputBenchmark/blockReport/ThroughputBenchDir0/ThroughputBench25

Stack Trace:
org.apache.hadoop.hdfs.server.namenode.NotReplicatedYetException: Not replicated yet: /nnThroughputBenchmark/blockReport/ThroughputBenchDir0/ThroughputBench25
	at org.apache.hadoop.hdfs.server.namenode.FSDirWriteFileOp.validateAddBlock(FSDirWriteFileOp.java:190)
	at org.apache.hadoop.hdfs.server.namenode.FSNamesystem.getAdditionalBlock(FSNamesystem.java:2379)
	at org.apache.hadoop.hdfs.server.namenode.NameNodeRpcServer.addBlock(NameNodeRpcServer.java:797)
	at org.apache.hadoop.hdfs.server.namenode.NNThroughputBenchmark$BlockReportStats.addBlocks(NNThroughputBenchmark.java:1184)
	at org.apache.hadoop.hdfs.server.namenode.NNThroughputBenchmark$BlockReportStats.generateInputs(NNThroughputBenchmark.java:1171)
	at org.apache.hadoop.hdfs.server.namenode.NNThroughputBenchmark$OperationStatsBase.benchmark(NNThroughputBenchmark.java:281)
	at org.apache.hadoop.hdfs.server.namenode.NNThroughputBenchmark.run(NNThroughputBenchmark.java:1519)
	at org.apache.hadoop.hdfs.server.namenode.NNThroughputBenchmark.runBenchmark(NNThroughputBenchmark.java:1422)
	at org.apache.hadoop.hdfs.server.namenode.TestNNThroughputBenchmark.testNNThroughput(TestNNThroughputBenchmark.java:53)



Mime
  • Unnamed multipart/mixed (inline, None, 0 bytes)
View raw message