hadoop-hdfs-dev mailing list archives

Site index · List index
Message view « Date » · « Thread »
Top « Date » · « Thread »
From Apache Jenkins Server <jenk...@builds.apache.org>
Subject Hadoop-Hdfs-trunk - Build # 2747 - Still Failing
Date Wed, 20 Jan 2016 22:15:59 GMT
See https://builds.apache.org/job/Hadoop-Hdfs-trunk/2747/

###################################################################################
########################## LAST 60 LINES OF THE CONSOLE ###########################
[...truncated 6206 lines...]
[INFO] --- maven-clean-plugin:2.5:clean (default-clean) @ hadoop-hdfs-project ---
[INFO] Deleting /home/jenkins/jenkins-slave/workspace/Hadoop-Hdfs-trunk/hadoop-hdfs-project/target
[INFO] 
[INFO] --- maven-antrun-plugin:1.7:run (create-testdirs) @ hadoop-hdfs-project ---
[INFO] Executing tasks

main:
    [mkdir] Created dir: /home/jenkins/jenkins-slave/workspace/Hadoop-Hdfs-trunk/hadoop-hdfs-project/target/test-dir
[INFO] Executed tasks
[INFO] 
[INFO] --- maven-source-plugin:2.3:jar-no-fork (hadoop-java-sources) @ hadoop-hdfs-project
---
[INFO] 
[INFO] --- maven-source-plugin:2.3:test-jar-no-fork (hadoop-java-sources) @ hadoop-hdfs-project
---
[INFO] 
[INFO] --- maven-enforcer-plugin:1.3.1:enforce (dist-enforce) @ hadoop-hdfs-project ---
[INFO] 
[INFO] --- maven-site-plugin:3.4:attach-descriptor (attach-descriptor) @ hadoop-hdfs-project
---
[INFO] 
[INFO] --- maven-javadoc-plugin:2.8.1:jar (module-javadocs) @ hadoop-hdfs-project ---
[INFO] Skipping javadoc generation
[INFO] 
[INFO] --- maven-enforcer-plugin:1.3.1:enforce (depcheck) @ hadoop-hdfs-project ---
[INFO] 
[INFO] --- maven-checkstyle-plugin:2.15:checkstyle (default-cli) @ hadoop-hdfs-project ---
[INFO] 
[INFO] --- findbugs-maven-plugin:3.0.0:findbugs (default-cli) @ hadoop-hdfs-project ---
[INFO] ------------------------------------------------------------------------
[INFO] Reactor Summary:
[INFO] 
[INFO] Apache Hadoop HDFS Client ......................... SUCCESS [06:43 min]
[INFO] Apache Hadoop HDFS ................................ FAILURE [  05:20 h]
[INFO] Apache Hadoop HDFS Native Client .................. SKIPPED
[INFO] Apache Hadoop HttpFS .............................. SKIPPED
[INFO] Apache Hadoop HDFS BookKeeper Journal ............. SKIPPED
[INFO] Apache Hadoop HDFS-NFS ............................ SKIPPED
[INFO] Apache Hadoop HDFS Project ........................ SUCCESS [  0.136 s]
[INFO] ------------------------------------------------------------------------
[INFO] BUILD FAILURE
[INFO] ------------------------------------------------------------------------
[INFO] Total time: 05:27 h
[INFO] Finished at: 2016-01-20T22:15:38+00:00
[INFO] Final Memory: 70M/667M
[INFO] ------------------------------------------------------------------------
[ERROR] Failed to execute goal org.apache.maven.plugins:maven-surefire-plugin:2.17:test (default-test)
on project hadoop-hdfs: ExecutionException: java.lang.RuntimeException: java.lang.RuntimeException:
java.io.IOException: Stream Closed -> [Help 1]
[ERROR] 
[ERROR] To see the full stack trace of the errors, re-run Maven with the -e switch.
[ERROR] Re-run Maven using the -X switch to enable full debug logging.
[ERROR] 
[ERROR] For more information about the errors and possible solutions, please read the following
articles:
[ERROR] [Help 1] http://cwiki.apache.org/confluence/display/MAVEN/MojoFailureException
[ERROR] 
[ERROR] After correcting the problems, you can resume the build with the command
[ERROR]   mvn <goals> -rf :hadoop-hdfs
Build step 'Execute shell' marked build as failure
Archiving artifacts
Recording test results
Sending e-mails to: hdfs-dev@hadoop.apache.org
Email was triggered for: Failure - Any
Sending email for trigger: Failure - Any



###################################################################################
############################## FAILED TESTS (if any) ##############################
3 tests failed.
FAILED:  org.apache.hadoop.hdfs.server.datanode.TestBlockScanner.testVolumeIteratorWithCaching

Error Message:
test timed out after 60000 milliseconds

Stack Trace:
java.lang.Exception: test timed out after 60000 milliseconds
	at sun.misc.Unsafe.unpark(Native Method)
	at java.util.concurrent.locks.LockSupport.unpark(LockSupport.java:152)
	at java.util.concurrent.SynchronousQueue$TransferStack$SNode.tryMatch(SynchronousQueue.java:263)
	at java.util.concurrent.SynchronousQueue$TransferStack.transfer(SynchronousQueue.java:380)
	at java.util.concurrent.SynchronousQueue.offer(SynchronousQueue.java:914)
	at java.util.concurrent.ThreadPoolExecutor.execute(ThreadPoolExecutor.java:1364)
	at java.util.concurrent.AbstractExecutorService.submit(AbstractExecutorService.java:110)
	at org.apache.hadoop.ipc.Client$Connection.sendRpcRequest(Client.java:1054)
	at org.apache.hadoop.ipc.Client.call(Client.java:1428)
	at org.apache.hadoop.ipc.Client.call(Client.java:1386)
	at org.apache.hadoop.ipc.ProtobufRpcEngine$Invoker.invoke(ProtobufRpcEngine.java:230)
	at com.sun.proxy.$Proxy20.getBlockLocations(Unknown Source)
	at org.apache.hadoop.hdfs.protocolPB.ClientNamenodeProtocolTranslatorPB.getBlockLocations(ClientNamenodeProtocolTranslatorPB.java:253)
	at sun.reflect.GeneratedMethodAccessor14.invoke(Unknown Source)
	at sun.reflect.DelegatingMethodAccessorImpl.invoke(DelegatingMethodAccessorImpl.java:43)
	at java.lang.reflect.Method.invoke(Method.java:606)
	at org.apache.hadoop.io.retry.RetryInvocationHandler.invokeMethod(RetryInvocationHandler.java:255)
	at org.apache.hadoop.io.retry.RetryInvocationHandler.invoke(RetryInvocationHandler.java:103)
	at com.sun.proxy.$Proxy21.getBlockLocations(Unknown Source)
	at org.apache.hadoop.hdfs.DFSClient.callGetBlockLocations(DFSClient.java:829)
	at org.apache.hadoop.hdfs.DFSClient.getLocatedBlocks(DFSClient.java:818)
	at org.apache.hadoop.hdfs.DFSClient.getLocatedBlocks(DFSClient.java:807)
	at org.apache.hadoop.hdfs.DFSClient.open(DFSClient.java:1039)
	at org.apache.hadoop.hdfs.DistributedFileSystem$3.doCall(DistributedFileSystem.java:270)
	at org.apache.hadoop.hdfs.DistributedFileSystem$3.doCall(DistributedFileSystem.java:267)
	at org.apache.hadoop.fs.FileSystemLinkResolver.resolve(FileSystemLinkResolver.java:81)
	at org.apache.hadoop.hdfs.DistributedFileSystem.open(DistributedFileSystem.java:267)
	at org.apache.hadoop.fs.FileSystem.open(FileSystem.java:777)
	at org.apache.hadoop.hdfs.DFSTestUtil.getFirstBlock(DFSTestUtil.java:781)
	at org.apache.hadoop.hdfs.server.datanode.TestBlockScanner$TestContext.getFileBlock(TestBlockScanner.java:140)
	at org.apache.hadoop.hdfs.server.datanode.TestBlockScanner.testVolumeIteratorImpl(TestBlockScanner.java:174)
	at org.apache.hadoop.hdfs.server.datanode.TestBlockScanner.testVolumeIteratorWithCaching(TestBlockScanner.java:250)


FAILED:  org.apache.hadoop.hdfs.server.datanode.TestDirectoryScanner.testThrottling

Error Message:
test timed out after 300000 milliseconds

Stack Trace:
java.lang.Exception: test timed out after 300000 milliseconds
	at java.lang.Object.wait(Native Method)
	at java.lang.Object.wait(Object.java:503)
	at org.apache.hadoop.hdfs.DataStreamer.waitAndQueuePacket(DataStreamer.java:805)
	at org.apache.hadoop.hdfs.DFSOutputStream.enqueueCurrentPacket(DFSOutputStream.java:423)
	at org.apache.hadoop.hdfs.DFSOutputStream.enqueueCurrentPacketFull(DFSOutputStream.java:432)
	at org.apache.hadoop.hdfs.DFSOutputStream.writeChunk(DFSOutputStream.java:418)
	at org.apache.hadoop.fs.FSOutputSummer.writeChecksumChunks(FSOutputSummer.java:217)
	at org.apache.hadoop.fs.FSOutputSummer.write1(FSOutputSummer.java:125)
	at org.apache.hadoop.fs.FSOutputSummer.write(FSOutputSummer.java:111)
	at org.apache.hadoop.fs.FSDataOutputStream$PositionCache.write(FSDataOutputStream.java:57)
	at java.io.DataOutputStream.write(DataOutputStream.java:107)
	at org.apache.hadoop.hdfs.DFSTestUtil.createFile(DFSTestUtil.java:418)
	at org.apache.hadoop.hdfs.DFSTestUtil.createFile(DFSTestUtil.java:376)
	at org.apache.hadoop.hdfs.server.datanode.TestDirectoryScanner.createFile(TestDirectoryScanner.java:104)
	at org.apache.hadoop.hdfs.server.datanode.TestDirectoryScanner.testThrottling(TestDirectoryScanner.java:580)


FAILED:  org.apache.hadoop.hdfs.server.namenode.TestNameNodeMetadataConsistency.testGenerationStampInFuture

Error Message:
expected:<17> but was:<0>

Stack Trace:
java.lang.AssertionError: expected:<17> but was:<0>
	at org.junit.Assert.fail(Assert.java:88)
	at org.junit.Assert.failNotEquals(Assert.java:743)
	at org.junit.Assert.assertEquals(Assert.java:118)
	at org.junit.Assert.assertEquals(Assert.java:555)
	at org.junit.Assert.assertEquals(Assert.java:542)
	at org.apache.hadoop.hdfs.server.namenode.TestNameNodeMetadataConsistency.testGenerationStampInFuture(TestNameNodeMetadataConsistency.java:112)



Mime
  • Unnamed multipart/mixed (inline, None, 0 bytes)
View raw message