hadoop-hdfs-dev mailing list archives

Site index · List index
Message view « Date » · « Thread »
Top « Date » · « Thread »
From Apache Jenkins Server <jenk...@builds.apache.org>
Subject Hadoop-Hdfs-trunk - Build # 2719 - Still Failing
Date Tue, 12 Jan 2016 20:06:11 GMT
See https://builds.apache.org/job/Hadoop-Hdfs-trunk/2719/

###################################################################################
########################## LAST 60 LINES OF THE CONSOLE ###########################
[...truncated 6951 lines...]
[INFO] --- maven-antrun-plugin:1.7:run (create-testdirs) @ hadoop-hdfs-project ---
[INFO] Executing tasks

main:
    [mkdir] Created dir: /home/jenkins/jenkins-slave/workspace/Hadoop-Hdfs-trunk/hadoop-hdfs-project/target/test-dir
[INFO] Executed tasks
[INFO] 
[INFO] --- maven-source-plugin:2.3:jar-no-fork (hadoop-java-sources) @ hadoop-hdfs-project
---
[INFO] 
[INFO] --- maven-source-plugin:2.3:test-jar-no-fork (hadoop-java-sources) @ hadoop-hdfs-project
---
[INFO] 
[INFO] --- maven-enforcer-plugin:1.3.1:enforce (dist-enforce) @ hadoop-hdfs-project ---
[INFO] 
[INFO] --- maven-site-plugin:3.4:attach-descriptor (attach-descriptor) @ hadoop-hdfs-project
---
[INFO] 
[INFO] --- maven-javadoc-plugin:2.8.1:jar (module-javadocs) @ hadoop-hdfs-project ---
[INFO] Skipping javadoc generation
[INFO] 
[INFO] --- maven-enforcer-plugin:1.3.1:enforce (depcheck) @ hadoop-hdfs-project ---
[INFO] 
[INFO] --- maven-checkstyle-plugin:2.15:checkstyle (default-cli) @ hadoop-hdfs-project ---
[INFO] 
[INFO] --- findbugs-maven-plugin:3.0.0:findbugs (default-cli) @ hadoop-hdfs-project ---
[INFO] ------------------------------------------------------------------------
[INFO] Reactor Summary:
[INFO] 
[INFO] Apache Hadoop HDFS Client ......................... SUCCESS [03:55 min]
[INFO] Apache Hadoop HDFS ................................ FAILURE [  03:13 h]
[INFO] Apache Hadoop HDFS Native Client .................. SKIPPED
[INFO] Apache Hadoop HttpFS .............................. SKIPPED
[INFO] Apache Hadoop HDFS BookKeeper Journal ............. SKIPPED
[INFO] Apache Hadoop HDFS-NFS ............................ SKIPPED
[INFO] Apache Hadoop HDFS Project ........................ SUCCESS [  0.058 s]
[INFO] ------------------------------------------------------------------------
[INFO] BUILD FAILURE
[INFO] ------------------------------------------------------------------------
[INFO] Total time: 03:17 h
[INFO] Finished at: 2016-01-12T20:06:00+00:00
[INFO] Final Memory: 56M/738M
[INFO] ------------------------------------------------------------------------
[ERROR] Failed to execute goal org.apache.maven.plugins:maven-surefire-plugin:2.17:test (default-test)
on project hadoop-hdfs: There are test failures.
[ERROR] 
[ERROR] Please refer to /home/jenkins/jenkins-slave/workspace/Hadoop-Hdfs-trunk/hadoop-hdfs-project/hadoop-hdfs/target/surefire-reports
for the individual test results.
[ERROR] -> [Help 1]
[ERROR] 
[ERROR] To see the full stack trace of the errors, re-run Maven with the -e switch.
[ERROR] Re-run Maven using the -X switch to enable full debug logging.
[ERROR] 
[ERROR] For more information about the errors and possible solutions, please read the following
articles:
[ERROR] [Help 1] http://cwiki.apache.org/confluence/display/MAVEN/MojoFailureException
[ERROR] 
[ERROR] After correcting the problems, you can resume the build with the command
[ERROR]   mvn <goals> -rf :hadoop-hdfs
Build step 'Execute shell' marked build as failure
Archiving artifacts
Recording test results
Sending e-mails to: hdfs-dev@hadoop.apache.org
Email was triggered for: Failure - Any
Sending email for trigger: Failure - Any



###################################################################################
############################## FAILED TESTS (if any) ##############################
35 tests failed.
FAILED:  org.apache.hadoop.hdfs.TestDFSShell.testAppendToFile

Error Message:
org/apache/hadoop/util/NativeCrc32

Stack Trace:
java.lang.NoClassDefFoundError: org/apache/hadoop/util/NativeCrc32
	at java.net.URLClassLoader$1.run(URLClassLoader.java:366)
	at java.net.URLClassLoader$1.run(URLClassLoader.java:355)
	at java.security.AccessController.doPrivileged(Native Method)
	at java.net.URLClassLoader.findClass(URLClassLoader.java:354)
	at java.lang.ClassLoader.loadClass(ClassLoader.java:425)
	at sun.misc.Launcher$AppClassLoader.loadClass(Launcher.java:308)
	at java.lang.ClassLoader.loadClass(ClassLoader.java:358)
	at org.apache.hadoop.util.DataChecksum.calculateChunkedSums(DataChecksum.java:429)
	at org.apache.hadoop.fs.FSOutputSummer.writeChecksumChunks(FSOutputSummer.java:211)
	at org.apache.hadoop.fs.FSOutputSummer.write1(FSOutputSummer.java:125)
	at org.apache.hadoop.fs.FSOutputSummer.write(FSOutputSummer.java:111)
	at org.apache.hadoop.fs.FSDataOutputStream$PositionCache.write(FSDataOutputStream.java:57)
	at java.io.DataOutputStream.write(DataOutputStream.java:107)
	at org.apache.hadoop.io.IOUtils.copyBytes(IOUtils.java:90)
	at org.apache.hadoop.fs.shell.CopyCommands$AppendToFile.processArguments(CopyCommands.java:375)
	at org.apache.hadoop.fs.shell.FsCommand.processRawArguments(FsCommand.java:119)
	at org.apache.hadoop.fs.shell.Command.run(Command.java:166)
	at org.apache.hadoop.fs.FsShell.run(FsShell.java:319)
	at org.apache.hadoop.util.ToolRunner.run(ToolRunner.java:76)
	at org.apache.hadoop.util.ToolRunner.run(ToolRunner.java:90)
	at org.apache.hadoop.hdfs.TestDFSShell.testAppendToFile(TestDFSShell.java:2625)


FAILED:  org.apache.hadoop.hdfs.TestDFSShell.testCopyCommandsToDirectoryWithPreserveOption

Error Message:
org/apache/hadoop/fs/shell/PathData$FileTypeRequirement

Stack Trace:
java.lang.NoClassDefFoundError: org/apache/hadoop/fs/shell/PathData$FileTypeRequirement
	at java.net.URLClassLoader$1.run(URLClassLoader.java:366)
	at java.net.URLClassLoader$1.run(URLClassLoader.java:355)
	at java.security.AccessController.doPrivileged(Native Method)
	at java.net.URLClassLoader.findClass(URLClassLoader.java:354)
	at java.lang.ClassLoader.loadClass(ClassLoader.java:425)
	at sun.misc.Launcher$AppClassLoader.loadClass(Launcher.java:308)
	at java.lang.ClassLoader.loadClass(ClassLoader.java:358)
	at org.apache.hadoop.fs.shell.PathData.getDirectoryContents(PathData.java:267)
	at org.apache.hadoop.fs.shell.Command.recursePath(Command.java:377)
	at org.apache.hadoop.fs.shell.CommandWithDestination.recursePath(CommandWithDestination.java:302)
	at org.apache.hadoop.fs.shell.Command.processPaths(Command.java:323)
	at org.apache.hadoop.fs.shell.Command.processPathArgument(Command.java:293)
	at org.apache.hadoop.fs.shell.CommandWithDestination.processPathArgument(CommandWithDestination.java:254)
	at org.apache.hadoop.fs.shell.Command.processArgument(Command.java:275)
	at org.apache.hadoop.fs.shell.Command.processArguments(Command.java:259)
	at org.apache.hadoop.fs.shell.CommandWithDestination.processArguments(CommandWithDestination.java:225)
	at org.apache.hadoop.fs.shell.FsCommand.processRawArguments(FsCommand.java:119)
	at org.apache.hadoop.fs.shell.Command.run(Command.java:166)
	at org.apache.hadoop.fs.FsShell.run(FsShell.java:319)
	at org.apache.hadoop.util.ToolRunner.run(ToolRunner.java:76)
	at org.apache.hadoop.util.ToolRunner.run(ToolRunner.java:90)
	at org.apache.hadoop.hdfs.TestDFSShell.testCopyCommandsToDirectoryWithPreserveOption(TestDFSShell.java:2104)


FAILED:  org.apache.hadoop.hdfs.TestDFSShell.testSnapshotReserved

Error Message:
org/apache/hadoop/io/retry/AtMostOnce

Stack Trace:
java.lang.NoClassDefFoundError: org/apache/hadoop/io/retry/AtMostOnce
	at java.net.URLClassLoader$1.run(URLClassLoader.java:366)
	at java.net.URLClassLoader$1.run(URLClassLoader.java:355)
	at java.security.AccessController.doPrivileged(Native Method)
	at java.net.URLClassLoader.findClass(URLClassLoader.java:354)
	at java.lang.ClassLoader.loadClass(ClassLoader.java:425)
	at sun.misc.Launcher$AppClassLoader.loadClass(Launcher.java:308)
	at java.lang.ClassLoader.loadClass(ClassLoader.java:358)
	at org.apache.hadoop.io.retry.RetryInvocationHandler.invoke(RetryInvocationHandler.java:115)
	at com.sun.proxy.$Proxy20.createSnapshot(Unknown Source)
	at org.apache.hadoop.hdfs.DFSClient.createSnapshot(DFSClient.java:2087)
	at org.apache.hadoop.hdfs.DistributedFileSystem$35.doCall(DistributedFileSystem.java:1600)
	at org.apache.hadoop.hdfs.DistributedFileSystem$35.doCall(DistributedFileSystem.java:1597)
	at org.apache.hadoop.fs.FileSystemLinkResolver.resolve(FileSystemLinkResolver.java:81)
	at org.apache.hadoop.hdfs.DistributedFileSystem.createSnapshot(DistributedFileSystem.java:1597)
	at org.apache.hadoop.hdfs.TestDFSShell.testSnapshotReserved(TestDFSShell.java:3344)


FAILED:  org.apache.hadoop.hdfs.TestDFSShell.testCopyFromLocalWithPermissionDenied

Error Message:
org/apache/hadoop/util/NativeCrc32

Stack Trace:
java.lang.NoClassDefFoundError: org/apache/hadoop/util/NativeCrc32
	at org.apache.hadoop.util.DataChecksum.calculateChunkedSums(DataChecksum.java:429)
	at org.apache.hadoop.fs.FSOutputSummer.writeChecksumChunks(FSOutputSummer.java:211)
	at org.apache.hadoop.fs.FSOutputSummer.flushBuffer(FSOutputSummer.java:164)
	at org.apache.hadoop.fs.FSOutputSummer.flushBuffer(FSOutputSummer.java:145)
	at org.apache.hadoop.hdfs.DFSOutputStream.closeImpl(DFSOutputStream.java:771)
	at org.apache.hadoop.hdfs.DFSOutputStream.close(DFSOutputStream.java:758)
	at org.apache.hadoop.fs.FSDataOutputStream$PositionCache.close(FSDataOutputStream.java:72)
	at org.apache.hadoop.fs.FSDataOutputStream.close(FSDataOutputStream.java:101)
	at org.apache.hadoop.hdfs.TestDFSShell.writeFile(TestDFSShell.java:95)
	at org.apache.hadoop.hdfs.TestDFSShell.testCopyFromLocalWithPermissionDenied(TestDFSShell.java:2384)


FAILED:  org.apache.hadoop.hdfs.TestDFSShell.testRemoteException

Error Message:
org/apache/hadoop/security/ShellBasedUnixGroupsMapping$PartialGroupNameException

Stack Trace:
java.lang.NoClassDefFoundError: org/apache/hadoop/security/ShellBasedUnixGroupsMapping$PartialGroupNameException
	at java.net.URLClassLoader$1.run(URLClassLoader.java:366)
	at java.net.URLClassLoader$1.run(URLClassLoader.java:355)
	at java.security.AccessController.doPrivileged(Native Method)
	at java.net.URLClassLoader.findClass(URLClassLoader.java:354)
	at java.lang.ClassLoader.loadClass(ClassLoader.java:425)
	at sun.misc.Launcher$AppClassLoader.loadClass(Launcher.java:308)
	at java.lang.ClassLoader.loadClass(ClassLoader.java:358)
	at java.lang.Class.getDeclaredConstructors0(Native Method)
	at java.lang.Class.privateGetDeclaredConstructors(Class.java:2493)
	at java.lang.Class.getConstructor0(Class.java:2803)
	at java.lang.Class.getDeclaredConstructor(Class.java:2053)
	at org.apache.hadoop.util.ReflectionUtils.newInstance(ReflectionUtils.java:128)
	at org.apache.hadoop.security.Groups.<init>(Groups.java:78)
	at org.apache.hadoop.security.Groups.<init>(Groups.java:74)
	at org.apache.hadoop.security.UserGroupInformation$TestingGroups.<init>(UserGroupInformation.java:1361)
	at org.apache.hadoop.security.UserGroupInformation$TestingGroups.<init>(UserGroupInformation.java:1355)
	at org.apache.hadoop.security.UserGroupInformation.createUserForTesting(UserGroupInformation.java:1395)
	at org.apache.hadoop.hdfs.TestDFSShell.testRemoteException(TestDFSShell.java:1545)


FAILED:  org.apache.hadoop.hdfs.TestDFSShell.testCopyReserved

Error Message:
org/apache/hadoop/io/retry/AtMostOnce

Stack Trace:
java.lang.NoClassDefFoundError: org/apache/hadoop/io/retry/AtMostOnce
	at org.apache.hadoop.io.retry.RetryInvocationHandler.invoke(RetryInvocationHandler.java:115)
	at com.sun.proxy.$Proxy20.create(Unknown Source)
	at org.apache.hadoop.hdfs.DFSOutputStream.newStreamForCreate(DFSOutputStream.java:242)
	at org.apache.hadoop.hdfs.DFSClient.create(DFSClient.java:1191)
	at org.apache.hadoop.hdfs.DFSClient.create(DFSClient.java:1133)
	at org.apache.hadoop.hdfs.DistributedFileSystem$7.doCall(DistributedFileSystem.java:414)
	at org.apache.hadoop.hdfs.DistributedFileSystem$7.doCall(DistributedFileSystem.java:411)
	at org.apache.hadoop.fs.FileSystemLinkResolver.resolve(FileSystemLinkResolver.java:81)
	at org.apache.hadoop.hdfs.DistributedFileSystem.create(DistributedFileSystem.java:411)
	at org.apache.hadoop.hdfs.DistributedFileSystem.create(DistributedFileSystem.java:354)
	at org.apache.hadoop.fs.FileSystem.create(FileSystem.java:921)
	at org.apache.hadoop.fs.FileSystem.create(FileSystem.java:902)
	at org.apache.hadoop.fs.FileSystem.create(FileSystem.java:798)
	at org.apache.hadoop.fs.FileUtil.copy(FileUtil.java:368)
	at org.apache.hadoop.fs.FileUtil.copy(FileUtil.java:341)
	at org.apache.hadoop.fs.FileSystem.copyFromLocalFile(FileSystem.java:1988)
	at org.apache.hadoop.fs.FileSystem.copyFromLocalFile(FileSystem.java:1956)
	at org.apache.hadoop.fs.FileSystem.copyFromLocalFile(FileSystem.java:1921)
	at org.apache.hadoop.hdfs.TestDFSShell.testCopyReserved(TestDFSShell.java:3237)


FAILED:  org.apache.hadoop.hdfs.TestDFSShell.testGet

Error Message:
org/apache/hadoop/util/NativeCrc32

Stack Trace:
java.lang.NoClassDefFoundError: org/apache/hadoop/util/NativeCrc32
	at org.apache.hadoop.util.DataChecksum.calculateChunkedSums(DataChecksum.java:429)
	at org.apache.hadoop.fs.FSOutputSummer.writeChecksumChunks(FSOutputSummer.java:211)
	at org.apache.hadoop.fs.FSOutputSummer.flushBuffer(FSOutputSummer.java:164)
	at org.apache.hadoop.fs.FSOutputSummer.flushBuffer(FSOutputSummer.java:145)
	at org.apache.hadoop.hdfs.DFSOutputStream.closeImpl(DFSOutputStream.java:771)
	at org.apache.hadoop.hdfs.DFSOutputStream.close(DFSOutputStream.java:758)
	at org.apache.hadoop.fs.FSDataOutputStream$PositionCache.close(FSDataOutputStream.java:72)
	at org.apache.hadoop.fs.FSDataOutputStream.close(FSDataOutputStream.java:101)
	at org.apache.hadoop.io.IOUtils.copyBytes(IOUtils.java:64)
	at org.apache.hadoop.io.IOUtils.copyBytes(IOUtils.java:122)
	at org.apache.hadoop.fs.FileUtil.copy(FileUtil.java:369)
	at org.apache.hadoop.fs.FileUtil.copy(FileUtil.java:341)
	at org.apache.hadoop.fs.FileSystem.copyFromLocalFile(FileSystem.java:1988)
	at org.apache.hadoop.hdfs.TestDFSShell.testGet(TestDFSShell.java:1632)


FAILED:  org.apache.hadoop.hdfs.TestDFSShell.testLsr

Error Message:
org/apache/hadoop/util/NativeCrc32

Stack Trace:
java.lang.NoClassDefFoundError: org/apache/hadoop/util/NativeCrc32
	at org.apache.hadoop.util.DataChecksum.calculateChunkedSums(DataChecksum.java:429)
	at org.apache.hadoop.fs.FSOutputSummer.writeChecksumChunks(FSOutputSummer.java:211)
	at org.apache.hadoop.fs.FSOutputSummer.flushBuffer(FSOutputSummer.java:164)
	at org.apache.hadoop.fs.FSOutputSummer.flushBuffer(FSOutputSummer.java:145)
	at org.apache.hadoop.hdfs.DFSOutputStream.closeImpl(DFSOutputStream.java:771)
	at org.apache.hadoop.hdfs.DFSOutputStream.close(DFSOutputStream.java:758)
	at org.apache.hadoop.fs.FSDataOutputStream$PositionCache.close(FSDataOutputStream.java:72)
	at org.apache.hadoop.fs.FSDataOutputStream.close(FSDataOutputStream.java:101)
	at org.apache.hadoop.hdfs.TestDFSShell.writeFile(TestDFSShell.java:95)
	at org.apache.hadoop.hdfs.TestDFSShell.createTree(TestDFSShell.java:873)
	at org.apache.hadoop.hdfs.TestDFSShell.testLsr(TestDFSShell.java:1685)


FAILED:  org.apache.hadoop.hdfs.TestDFSShell.testPut

Error Message:
org/apache/hadoop/util/NativeCrc32

Stack Trace:
java.lang.NoClassDefFoundError: org/apache/hadoop/util/NativeCrc32
	at org.apache.hadoop.util.DataChecksum.calculateChunkedSums(DataChecksum.java:429)
	at org.apache.hadoop.fs.FSOutputSummer.writeChecksumChunks(FSOutputSummer.java:211)
	at org.apache.hadoop.fs.FSOutputSummer.flushBuffer(FSOutputSummer.java:164)
	at org.apache.hadoop.fs.FSOutputSummer.flushBuffer(FSOutputSummer.java:145)
	at org.apache.hadoop.hdfs.DFSOutputStream.closeImpl(DFSOutputStream.java:771)
	at org.apache.hadoop.hdfs.DFSOutputStream.close(DFSOutputStream.java:758)
	at org.apache.hadoop.fs.FSDataOutputStream$PositionCache.close(FSDataOutputStream.java:72)
	at org.apache.hadoop.fs.FSDataOutputStream.close(FSDataOutputStream.java:101)
	at org.apache.hadoop.io.IOUtils.copyBytes(IOUtils.java:64)
	at org.apache.hadoop.io.IOUtils.copyBytes(IOUtils.java:122)
	at org.apache.hadoop.fs.FileUtil.copy(FileUtil.java:369)
	at org.apache.hadoop.fs.FileUtil.copy(FileUtil.java:341)
	at org.apache.hadoop.fs.FileSystem.copyFromLocalFile(FileSystem.java:1988)
	at org.apache.hadoop.hdfs.TestDFSShell.testPut(TestDFSShell.java:373)


FAILED:  org.apache.hadoop.hdfs.TestDFSShell.testRmReserved

Error Message:
org/apache/hadoop/io/retry/AtMostOnce

Stack Trace:
java.lang.NoClassDefFoundError: org/apache/hadoop/io/retry/AtMostOnce
	at org.apache.hadoop.io.retry.RetryInvocationHandler.invoke(RetryInvocationHandler.java:115)
	at com.sun.proxy.$Proxy20.delete(Unknown Source)
	at org.apache.hadoop.hdfs.DFSClient.delete(DFSClient.java:1536)
	at org.apache.hadoop.hdfs.DistributedFileSystem$15.doCall(DistributedFileSystem.java:699)
	at org.apache.hadoop.hdfs.DistributedFileSystem$15.doCall(DistributedFileSystem.java:696)
	at org.apache.hadoop.fs.FileSystemLinkResolver.resolve(FileSystemLinkResolver.java:81)
	at org.apache.hadoop.hdfs.DistributedFileSystem.delete(DistributedFileSystem.java:696)
	at org.apache.hadoop.hdfs.TestDFSShell.testRmReserved(TestDFSShell.java:3217)


FAILED:  org.apache.hadoop.hdfs.TestDFSShell.testRecursiveRm

Error Message:
org/apache/hadoop/io/retry/AtMostOnce

Stack Trace:
java.lang.NoClassDefFoundError: org/apache/hadoop/io/retry/AtMostOnce
	at org.apache.hadoop.io.retry.RetryInvocationHandler.invoke(RetryInvocationHandler.java:115)
	at com.sun.proxy.$Proxy20.delete(Unknown Source)
	at org.apache.hadoop.hdfs.DFSClient.delete(DFSClient.java:1536)
	at org.apache.hadoop.hdfs.DistributedFileSystem$15.doCall(DistributedFileSystem.java:699)
	at org.apache.hadoop.hdfs.DistributedFileSystem$15.doCall(DistributedFileSystem.java:696)
	at org.apache.hadoop.fs.FileSystemLinkResolver.resolve(FileSystemLinkResolver.java:81)
	at org.apache.hadoop.hdfs.DistributedFileSystem.delete(DistributedFileSystem.java:696)
	at org.apache.hadoop.hdfs.TestDFSShell.testRecursiveRm(TestDFSShell.java:195)


FAILED:  org.apache.hadoop.hdfs.TestDFSShell.testNoTrashConfig

Error Message:
org/apache/hadoop/util/NativeCrc32

Stack Trace:
java.lang.NoClassDefFoundError: org/apache/hadoop/util/NativeCrc32
	at org.apache.hadoop.util.DataChecksum.calculateChunkedSums(DataChecksum.java:429)
	at org.apache.hadoop.fs.FSOutputSummer.writeChecksumChunks(FSOutputSummer.java:211)
	at org.apache.hadoop.fs.FSOutputSummer.flushBuffer(FSOutputSummer.java:164)
	at org.apache.hadoop.fs.FSOutputSummer.flushBuffer(FSOutputSummer.java:145)
	at org.apache.hadoop.hdfs.DFSOutputStream.closeImpl(DFSOutputStream.java:771)
	at org.apache.hadoop.hdfs.DFSOutputStream.close(DFSOutputStream.java:758)
	at org.apache.hadoop.fs.FSDataOutputStream$PositionCache.close(FSDataOutputStream.java:72)
	at org.apache.hadoop.fs.FSDataOutputStream.close(FSDataOutputStream.java:101)
	at org.apache.hadoop.hdfs.TestDFSShell.writeFile(TestDFSShell.java:95)
	at org.apache.hadoop.hdfs.TestDFSShell.deleteFileUsingTrash(TestDFSShell.java:2568)
	at org.apache.hadoop.hdfs.TestDFSShell.testNoTrashConfig(TestDFSShell.java:3149)


FAILED:  org.apache.hadoop.hdfs.TestDFSShell.testFilePermissions

Error Message:
org/apache/hadoop/fs/permission/ChmodParser

Stack Trace:
java.lang.NoClassDefFoundError: org/apache/hadoop/fs/permission/ChmodParser
	at java.net.URLClassLoader$1.run(URLClassLoader.java:366)
	at java.net.URLClassLoader$1.run(URLClassLoader.java:355)
	at java.security.AccessController.doPrivileged(Native Method)
	at java.net.URLClassLoader.findClass(URLClassLoader.java:354)
	at java.lang.ClassLoader.loadClass(ClassLoader.java:425)
	at sun.misc.Launcher$AppClassLoader.loadClass(Launcher.java:308)
	at java.lang.ClassLoader.loadClass(ClassLoader.java:358)
	at org.apache.hadoop.fs.FsShellPermissions$Chmod.processOptions(FsShellPermissions.java:89)
	at org.apache.hadoop.fs.shell.Command.run(Command.java:165)
	at org.apache.hadoop.fs.FsShell.run(FsShell.java:319)
	at org.apache.hadoop.hdfs.TestDFSShell.runCmd(TestDFSShell.java:972)
	at org.apache.hadoop.hdfs.TestDFSShell.confirmPermissionChange(TestDFSShell.java:1062)
	at org.apache.hadoop.hdfs.TestDFSShell.testChmod(TestDFSShell.java:1001)
	at org.apache.hadoop.hdfs.TestDFSShell.testFilePermissions(TestDFSShell.java:1088)


FAILED:  org.apache.hadoop.hdfs.TestDFSShell.testCount

Error Message:
org/apache/hadoop/util/NativeCrc32

Stack Trace:
java.lang.NoClassDefFoundError: org/apache/hadoop/util/NativeCrc32
	at org.apache.hadoop.util.DataChecksum.calculateChunkedSums(DataChecksum.java:429)
	at org.apache.hadoop.fs.FSOutputSummer.writeChecksumChunks(FSOutputSummer.java:211)
	at org.apache.hadoop.fs.FSOutputSummer.flushBuffer(FSOutputSummer.java:164)
	at org.apache.hadoop.fs.FSOutputSummer.flushBuffer(FSOutputSummer.java:145)
	at org.apache.hadoop.hdfs.DFSOutputStream.closeImpl(DFSOutputStream.java:771)
	at org.apache.hadoop.hdfs.DFSOutputStream.close(DFSOutputStream.java:758)
	at org.apache.hadoop.fs.FSDataOutputStream$PositionCache.close(FSDataOutputStream.java:72)
	at org.apache.hadoop.fs.FSDataOutputStream.close(FSDataOutputStream.java:101)
	at org.apache.hadoop.hdfs.TestDFSShell.writeFile(TestDFSShell.java:95)
	at org.apache.hadoop.hdfs.TestDFSShell.createTree(TestDFSShell.java:873)
	at org.apache.hadoop.hdfs.TestDFSShell.testCount(TestDFSShell.java:891)


FAILED:  org.apache.hadoop.hdfs.TestDFSShell.testText

Error Message:
org/apache/hadoop/util/NativeCrc32

Stack Trace:
java.lang.NoClassDefFoundError: org/apache/hadoop/util/NativeCrc32
	at org.apache.hadoop.util.DataChecksum.calculateChunkedSums(DataChecksum.java:429)
	at org.apache.hadoop.fs.FSOutputSummer.writeChecksumChunks(FSOutputSummer.java:211)
	at org.apache.hadoop.fs.FSOutputSummer.flushBuffer(FSOutputSummer.java:164)
	at org.apache.hadoop.fs.FSOutputSummer.flushBuffer(FSOutputSummer.java:145)
	at org.apache.hadoop.hdfs.DFSOutputStream.closeImpl(DFSOutputStream.java:771)
	at org.apache.hadoop.hdfs.DFSOutputStream.close(DFSOutputStream.java:758)
	at org.apache.hadoop.fs.FSDataOutputStream$PositionCache.close(FSDataOutputStream.java:72)
	at org.apache.hadoop.fs.FSDataOutputStream.close(FSDataOutputStream.java:101)
	at java.util.zip.DeflaterOutputStream.close(DeflaterOutputStream.java:241)
	at org.apache.hadoop.hdfs.TestDFSShell.textTest(TestDFSShell.java:691)
	at org.apache.hadoop.hdfs.TestDFSShell.testText(TestDFSShell.java:660)


FAILED:  org.apache.hadoop.hdfs.TestDFSShell.testCopyCommandsWithForceOption

Error Message:
org/apache/hadoop/util/NativeCrc32

Stack Trace:
java.lang.NoClassDefFoundError: org/apache/hadoop/util/NativeCrc32
	at org.apache.hadoop.util.DataChecksum.calculateChunkedSums(DataChecksum.java:429)
	at org.apache.hadoop.fs.FSOutputSummer.writeChecksumChunks(FSOutputSummer.java:211)
	at org.apache.hadoop.fs.FSOutputSummer.flushBuffer(FSOutputSummer.java:164)
	at org.apache.hadoop.fs.FSOutputSummer.flushBuffer(FSOutputSummer.java:145)
	at org.apache.hadoop.hdfs.DFSOutputStream.closeImpl(DFSOutputStream.java:771)
	at org.apache.hadoop.hdfs.DFSOutputStream.close(DFSOutputStream.java:758)
	at org.apache.hadoop.fs.FSDataOutputStream$PositionCache.close(FSDataOutputStream.java:72)
	at org.apache.hadoop.fs.FSDataOutputStream.close(FSDataOutputStream.java:101)
	at org.apache.hadoop.hdfs.TestDFSShell.writeFile(TestDFSShell.java:95)
	at org.apache.hadoop.hdfs.TestDFSShell.testCopyCommandsWithForceOption(TestDFSShell.java:2311)


FAILED:  org.apache.hadoop.hdfs.TestDFSShell.testClientConfigRespected

Error Message:
org/apache/hadoop/util/NativeCrc32

Stack Trace:
java.lang.NoClassDefFoundError: org/apache/hadoop/util/NativeCrc32
	at org.apache.hadoop.util.DataChecksum.calculateChunkedSums(DataChecksum.java:429)
	at org.apache.hadoop.fs.FSOutputSummer.writeChecksumChunks(FSOutputSummer.java:211)
	at org.apache.hadoop.fs.FSOutputSummer.flushBuffer(FSOutputSummer.java:164)
	at org.apache.hadoop.fs.FSOutputSummer.flushBuffer(FSOutputSummer.java:145)
	at org.apache.hadoop.hdfs.DFSOutputStream.closeImpl(DFSOutputStream.java:771)
	at org.apache.hadoop.hdfs.DFSOutputStream.close(DFSOutputStream.java:758)
	at org.apache.hadoop.fs.FSDataOutputStream$PositionCache.close(FSDataOutputStream.java:72)
	at org.apache.hadoop.fs.FSDataOutputStream.close(FSDataOutputStream.java:101)
	at org.apache.hadoop.hdfs.TestDFSShell.writeFile(TestDFSShell.java:95)
	at org.apache.hadoop.hdfs.TestDFSShell.deleteFileUsingTrash(TestDFSShell.java:2568)
	at org.apache.hadoop.hdfs.TestDFSShell.testClientConfigRespected(TestDFSShell.java:3141)


FAILED:  org.apache.hadoop.hdfs.TestDFSShell.testDFSShell

Error Message:
org/apache/hadoop/util/NativeCrc32

Stack Trace:
java.lang.NoClassDefFoundError: org/apache/hadoop/util/NativeCrc32
	at org.apache.hadoop.util.DataChecksum.calculateChunkedSums(DataChecksum.java:429)
	at org.apache.hadoop.fs.FSOutputSummer.writeChecksumChunks(FSOutputSummer.java:211)
	at org.apache.hadoop.fs.FSOutputSummer.flushBuffer(FSOutputSummer.java:164)
	at org.apache.hadoop.fs.FSOutputSummer.flushBuffer(FSOutputSummer.java:145)
	at org.apache.hadoop.hdfs.DFSOutputStream.closeImpl(DFSOutputStream.java:771)
	at org.apache.hadoop.hdfs.DFSOutputStream.close(DFSOutputStream.java:758)
	at org.apache.hadoop.fs.FSDataOutputStream$PositionCache.close(FSDataOutputStream.java:72)
	at org.apache.hadoop.fs.FSDataOutputStream.close(FSDataOutputStream.java:101)
	at org.apache.hadoop.hdfs.TestDFSShell.writeFile(TestDFSShell.java:95)
	at org.apache.hadoop.hdfs.TestDFSShell.testDFSShell(TestDFSShell.java:1170)


FAILED:  org.apache.hadoop.hdfs.TestDFSShell.testDu

Error Message:
org/apache/hadoop/util/NativeCrc32

Stack Trace:
java.lang.NoClassDefFoundError: org/apache/hadoop/util/NativeCrc32
	at org.apache.hadoop.util.DataChecksum.calculateChunkedSums(DataChecksum.java:429)
	at org.apache.hadoop.fs.FSOutputSummer.writeChecksumChunks(FSOutputSummer.java:211)
	at org.apache.hadoop.fs.FSOutputSummer.flushBuffer(FSOutputSummer.java:164)
	at org.apache.hadoop.fs.FSOutputSummer.flushBuffer(FSOutputSummer.java:145)
	at org.apache.hadoop.hdfs.DFSOutputStream.closeImpl(DFSOutputStream.java:771)
	at org.apache.hadoop.hdfs.DFSOutputStream.close(DFSOutputStream.java:758)
	at org.apache.hadoop.fs.FSDataOutputStream$PositionCache.close(FSDataOutputStream.java:72)
	at org.apache.hadoop.fs.FSDataOutputStream.close(FSDataOutputStream.java:101)
	at org.apache.hadoop.hdfs.TestDFSShell.writeFile(TestDFSShell.java:95)
	at org.apache.hadoop.hdfs.TestDFSShell.testDu(TestDFSShell.java:230)


FAILED:  org.apache.hadoop.hdfs.TestDFSShell.testSetXAttrCaseSensitivity

Error Message:
org/apache/hadoop/fs/XAttrCodec

Stack Trace:
java.lang.NoClassDefFoundError: org/apache/hadoop/fs/XAttrCodec
	at java.net.URLClassLoader$1.run(URLClassLoader.java:366)
	at java.net.URLClassLoader$1.run(URLClassLoader.java:355)
	at java.security.AccessController.doPrivileged(Native Method)
	at java.net.URLClassLoader.findClass(URLClassLoader.java:354)
	at java.lang.ClassLoader.loadClass(ClassLoader.java:425)
	at sun.misc.Launcher$AppClassLoader.loadClass(Launcher.java:308)
	at java.lang.ClassLoader.loadClass(ClassLoader.java:358)
	at org.apache.hadoop.fs.shell.XAttrCommands$GetfattrCommand.<clinit>(XAttrCommands.java:69)
	at sun.reflect.NativeConstructorAccessorImpl.newInstance0(Native Method)
	at sun.reflect.NativeConstructorAccessorImpl.newInstance(NativeConstructorAccessorImpl.java:57)
	at sun.reflect.DelegatingConstructorAccessorImpl.newInstance(DelegatingConstructorAccessorImpl.java:45)
	at java.lang.reflect.Constructor.newInstance(Constructor.java:526)
	at org.apache.hadoop.util.ReflectionUtils.newInstance(ReflectionUtils.java:132)
	at org.apache.hadoop.fs.shell.CommandFactory.getInstance(CommandFactory.java:125)
	at org.apache.hadoop.fs.shell.CommandFactory.getInstance(CommandFactory.java:109)
	at org.apache.hadoop.fs.FsShell.run(FsShell.java:306)
	at org.apache.hadoop.util.ToolRunner.run(ToolRunner.java:76)
	at org.apache.hadoop.util.ToolRunner.run(ToolRunner.java:90)
	at org.apache.hadoop.hdfs.TestDFSShell.doSetXattr(TestDFSShell.java:2827)
	at org.apache.hadoop.hdfs.TestDFSShell.testSetXAttrCaseSensitivity(TestDFSShell.java:2770)


FAILED:  org.apache.hadoop.hdfs.TestDFSShell.testServerConfigRespectedWithClient

Error Message:
Test resulted in an unexpected exit

Stack Trace:
java.lang.AssertionError: Test resulted in an unexpected exit
	at org.apache.hadoop.hdfs.MiniDFSCluster.shutdown(MiniDFSCluster.java:1895)
	at org.apache.hadoop.hdfs.MiniDFSCluster.shutdown(MiniDFSCluster.java:1882)
	at org.apache.hadoop.hdfs.MiniDFSCluster.shutdown(MiniDFSCluster.java:1875)
	at org.apache.hadoop.hdfs.MiniDFSCluster.initMiniDFSCluster(MiniDFSCluster.java:854)
	at org.apache.hadoop.hdfs.MiniDFSCluster.<init>(MiniDFSCluster.java:482)
	at org.apache.hadoop.hdfs.MiniDFSCluster$Builder.build(MiniDFSCluster.java:441)
	at org.apache.hadoop.hdfs.TestDFSShell.deleteFileUsingTrash(TestDFSShell.java:2546)
	at org.apache.hadoop.hdfs.TestDFSShell.testServerConfigRespectedWithClient(TestDFSShell.java:3132)


FAILED:  org.apache.hadoop.hdfs.TestDFSShell.testSymLinkReserved

Error Message:
org/apache/hadoop/io/retry/AtMostOnce

Stack Trace:
java.lang.NoClassDefFoundError: org/apache/hadoop/io/retry/AtMostOnce
	at org.apache.hadoop.io.retry.RetryInvocationHandler.invoke(RetryInvocationHandler.java:115)
	at com.sun.proxy.$Proxy20.createSymlink(Unknown Source)
	at org.apache.hadoop.hdfs.DFSClient.createSymlink(DFSClient.java:1263)
	at org.apache.hadoop.hdfs.DistributedFileSystem$25.doCall(DistributedFileSystem.java:1298)
	at org.apache.hadoop.hdfs.DistributedFileSystem$25.doCall(DistributedFileSystem.java:1295)
	at org.apache.hadoop.fs.FileSystemLinkResolver.resolve(FileSystemLinkResolver.java:81)
	at org.apache.hadoop.hdfs.DistributedFileSystem.createSymlink(DistributedFileSystem.java:1295)
	at org.apache.hadoop.hdfs.TestDFSShell.testSymLinkReserved(TestDFSShell.java:3321)


FAILED:  org.apache.hadoop.hdfs.TestDFSShell.testServerConfigRespected

Error Message:
Test resulted in an unexpected exit

Stack Trace:
java.lang.AssertionError: Test resulted in an unexpected exit
	at org.apache.hadoop.hdfs.MiniDFSCluster.shutdown(MiniDFSCluster.java:1895)
	at org.apache.hadoop.hdfs.MiniDFSCluster.shutdown(MiniDFSCluster.java:1882)
	at org.apache.hadoop.hdfs.MiniDFSCluster.shutdown(MiniDFSCluster.java:1875)
	at org.apache.hadoop.hdfs.MiniDFSCluster.initMiniDFSCluster(MiniDFSCluster.java:854)
	at org.apache.hadoop.hdfs.MiniDFSCluster.<init>(MiniDFSCluster.java:482)
	at org.apache.hadoop.hdfs.MiniDFSCluster$Builder.build(MiniDFSCluster.java:441)
	at org.apache.hadoop.hdfs.TestDFSShell.deleteFileUsingTrash(TestDFSShell.java:2546)
	at org.apache.hadoop.hdfs.TestDFSShell.testServerConfigRespected(TestDFSShell.java:3123)


FAILED:  org.apache.hadoop.hdfs.TestDFSShell.testZeroSizeFile

Error Message:
null

Stack Trace:
java.lang.AssertionError: null
	at org.junit.Assert.fail(Assert.java:86)
	at org.junit.Assert.assertTrue(Assert.java:41)
	at org.junit.Assert.assertTrue(Assert.java:52)
	at org.apache.hadoop.hdfs.TestDFSShell.testZeroSizeFile(TestDFSShell.java:154)


FAILED:  org.apache.hadoop.hdfs.TestDFSShell.testChmodReserved

Error Message:
org/apache/hadoop/fs/permission/ChmodParser

Stack Trace:
java.lang.NoClassDefFoundError: org/apache/hadoop/fs/permission/ChmodParser
	at org.apache.hadoop.fs.FsShellPermissions$Chmod.processOptions(FsShellPermissions.java:89)
	at org.apache.hadoop.fs.shell.Command.run(Command.java:165)
	at org.apache.hadoop.fs.FsShell.run(FsShell.java:319)
	at org.apache.hadoop.hdfs.TestDFSShell.runCmd(TestDFSShell.java:972)
	at org.apache.hadoop.hdfs.TestDFSShell.testChmodReserved(TestDFSShell.java:3283)


FAILED:  org.apache.hadoop.hdfs.TestDFSShell.testSetXAttrPermissionAsDifferentOwner

Error Message:
org/apache/hadoop/security/ShellBasedUnixGroupsMapping$PartialGroupNameException

Stack Trace:
java.lang.NoClassDefFoundError: org/apache/hadoop/security/ShellBasedUnixGroupsMapping$PartialGroupNameException
	at java.net.URLClassLoader$1.run(URLClassLoader.java:366)
	at java.net.URLClassLoader$1.run(URLClassLoader.java:355)
	at java.security.AccessController.doPrivileged(Native Method)
	at java.net.URLClassLoader.findClass(URLClassLoader.java:354)
	at java.lang.ClassLoader.loadClass(ClassLoader.java:425)
	at sun.misc.Launcher$AppClassLoader.loadClass(Launcher.java:308)
	at java.lang.ClassLoader.loadClass(ClassLoader.java:358)
	at java.lang.Class.getDeclaredConstructors0(Native Method)
	at java.lang.Class.privateGetDeclaredConstructors(Class.java:2493)
	at java.lang.Class.getConstructor0(Class.java:2803)
	at java.lang.Class.getDeclaredConstructor(Class.java:2053)
	at org.apache.hadoop.util.ReflectionUtils.newInstance(ReflectionUtils.java:128)
	at org.apache.hadoop.security.Groups.<init>(Groups.java:78)
	at org.apache.hadoop.security.Groups.<init>(Groups.java:74)
	at org.apache.hadoop.security.UserGroupInformation$TestingGroups.<init>(UserGroupInformation.java:1361)
	at org.apache.hadoop.security.UserGroupInformation$TestingGroups.<init>(UserGroupInformation.java:1355)
	at org.apache.hadoop.security.UserGroupInformation.createUserForTesting(UserGroupInformation.java:1395)
	at org.apache.hadoop.hdfs.TestDFSShell.testSetXAttrPermissionAsDifferentOwner(TestDFSShell.java:2880)


FAILED:  org.apache.hadoop.hdfs.TestDFSShell.testErrOutPut

Error Message:
org/apache/hadoop/fs/shell/FsUsage$TableBuilder

Stack Trace:
java.lang.NoClassDefFoundError: org/apache/hadoop/fs/shell/FsUsage$TableBuilder
	at java.net.URLClassLoader$1.run(URLClassLoader.java:366)
	at java.net.URLClassLoader$1.run(URLClassLoader.java:355)
	at java.security.AccessController.doPrivileged(Native Method)
	at java.net.URLClassLoader.findClass(URLClassLoader.java:354)
	at java.lang.ClassLoader.loadClass(ClassLoader.java:425)
	at sun.misc.Launcher$AppClassLoader.loadClass(Launcher.java:308)
	at java.lang.ClassLoader.loadClass(ClassLoader.java:358)
	at org.apache.hadoop.fs.shell.FsUsage$Du.processArguments(FsUsage.java:137)
	at org.apache.hadoop.fs.shell.FsCommand.processRawArguments(FsCommand.java:119)
	at org.apache.hadoop.fs.shell.Command.run(Command.java:166)
	at org.apache.hadoop.fs.FsShell.run(FsShell.java:319)
	at org.apache.hadoop.util.ToolRunner.run(ToolRunner.java:76)
	at org.apache.hadoop.util.ToolRunner.run(ToolRunner.java:90)
	at org.apache.hadoop.hdfs.TestDFSShell.testErrOutPut(TestDFSShell.java:454)


FAILED:  org.apache.hadoop.hdfs.TestDFSShell.testURIPaths

Error Message:
org/apache/hadoop/fs/shell/Ls$3

Stack Trace:
java.lang.NoClassDefFoundError: org/apache/hadoop/fs/shell/Ls$3
	at java.net.URLClassLoader$1.run(URLClassLoader.java:366)
	at java.net.URLClassLoader$1.run(URLClassLoader.java:355)
	at java.security.AccessController.doPrivileged(Native Method)
	at java.net.URLClassLoader.findClass(URLClassLoader.java:354)
	at java.lang.ClassLoader.loadClass(ClassLoader.java:425)
	at sun.misc.Launcher$AppClassLoader.loadClass(Launcher.java:308)
	at java.lang.ClassLoader.loadClass(ClassLoader.java:358)
	at org.apache.hadoop.fs.shell.Ls.initialiseOrderComparator(Ls.java:313)
	at org.apache.hadoop.fs.shell.Ls.processOptions(Ls.java:136)
	at org.apache.hadoop.fs.shell.Command.run(Command.java:165)
	at org.apache.hadoop.fs.FsShell.run(FsShell.java:319)
	at org.apache.hadoop.util.ToolRunner.run(ToolRunner.java:76)
	at org.apache.hadoop.util.ToolRunner.run(ToolRunner.java:90)
	at org.apache.hadoop.hdfs.TestDFSShell.testURIPaths(TestDFSShell.java:582)


FAILED:  org.apache.hadoop.hdfs.TestDFSShell.testGetFAttrErrors

Error Message:
org/apache/hadoop/security/ShellBasedUnixGroupsMapping$PartialGroupNameException

Stack Trace:
java.lang.NoClassDefFoundError: org/apache/hadoop/security/ShellBasedUnixGroupsMapping$PartialGroupNameException
	at java.net.URLClassLoader$1.run(URLClassLoader.java:366)
	at java.net.URLClassLoader$1.run(URLClassLoader.java:355)
	at java.security.AccessController.doPrivileged(Native Method)
	at java.net.URLClassLoader.findClass(URLClassLoader.java:354)
	at java.lang.ClassLoader.loadClass(ClassLoader.java:425)
	at sun.misc.Launcher$AppClassLoader.loadClass(Launcher.java:308)
	at java.lang.ClassLoader.loadClass(ClassLoader.java:358)
	at java.lang.Class.getDeclaredConstructors0(Native Method)
	at java.lang.Class.privateGetDeclaredConstructors(Class.java:2493)
	at java.lang.Class.getConstructor0(Class.java:2803)
	at java.lang.Class.getDeclaredConstructor(Class.java:2053)
	at org.apache.hadoop.util.ReflectionUtils.newInstance(ReflectionUtils.java:128)
	at org.apache.hadoop.security.Groups.<init>(Groups.java:78)
	at org.apache.hadoop.security.Groups.<init>(Groups.java:74)
	at org.apache.hadoop.security.UserGroupInformation$TestingGroups.<init>(UserGroupInformation.java:1361)
	at org.apache.hadoop.security.UserGroupInformation$TestingGroups.<init>(UserGroupInformation.java:1355)
	at org.apache.hadoop.security.UserGroupInformation.createUserForTesting(UserGroupInformation.java:1395)
	at org.apache.hadoop.hdfs.TestDFSShell.testGetFAttrErrors(TestDFSShell.java:3056)


FAILED:  org.apache.hadoop.hdfs.TestDFSShell.testCopyCommandsWithRawXAttrs

Error Message:
org/apache/hadoop/fs/shell/PathData$FileTypeRequirement

Stack Trace:
java.lang.NoClassDefFoundError: org/apache/hadoop/fs/shell/PathData$FileTypeRequirement
	at org.apache.hadoop.fs.shell.PathData.getDirectoryContents(PathData.java:267)
	at org.apache.hadoop.fs.shell.Command.recursePath(Command.java:377)
	at org.apache.hadoop.fs.shell.CommandWithDestination.recursePath(CommandWithDestination.java:302)
	at org.apache.hadoop.fs.shell.Command.processPaths(Command.java:323)
	at org.apache.hadoop.fs.shell.Command.processPathArgument(Command.java:293)
	at org.apache.hadoop.fs.shell.CommandWithDestination.processPathArgument(CommandWithDestination.java:254)
	at org.apache.hadoop.fs.shell.Command.processArgument(Command.java:275)
	at org.apache.hadoop.fs.shell.Command.processArguments(Command.java:259)
	at org.apache.hadoop.fs.shell.CommandWithDestination.processArguments(CommandWithDestination.java:225)
	at org.apache.hadoop.fs.shell.FsCommand.processRawArguments(FsCommand.java:119)
	at org.apache.hadoop.fs.shell.Command.run(Command.java:166)
	at org.apache.hadoop.fs.FsShell.run(FsShell.java:319)
	at org.apache.hadoop.util.ToolRunner.run(ToolRunner.java:76)
	at org.apache.hadoop.util.ToolRunner.run(ToolRunner.java:90)
	at org.apache.hadoop.hdfs.TestDFSShell.doCopyAndTest(TestDFSShell.java:2028)
	at org.apache.hadoop.hdfs.TestDFSShell.doTestCopyCommandsWithRawXAttrs(TestDFSShell.java:1998)
	at org.apache.hadoop.hdfs.TestDFSShell.testCopyCommandsWithRawXAttrs(TestDFSShell.java:1955)


FAILED:  org.apache.hadoop.hdfs.TestDFSShell.testTotalSizeOfAllFiles

Error Message:
org/apache/hadoop/util/NativeCrc32

Stack Trace:
java.lang.NoClassDefFoundError: org/apache/hadoop/util/NativeCrc32
	at org.apache.hadoop.util.DataChecksum.calculateChunkedSums(DataChecksum.java:429)
	at org.apache.hadoop.fs.FSOutputSummer.writeChecksumChunks(FSOutputSummer.java:211)
	at org.apache.hadoop.fs.FSOutputSummer.flushBuffer(FSOutputSummer.java:164)
	at org.apache.hadoop.fs.FSOutputSummer.flushBuffer(FSOutputSummer.java:145)
	at org.apache.hadoop.hdfs.DFSOutputStream.closeImpl(DFSOutputStream.java:771)
	at org.apache.hadoop.hdfs.DFSOutputStream.close(DFSOutputStream.java:758)
	at org.apache.hadoop.fs.FSDataOutputStream$PositionCache.close(FSDataOutputStream.java:72)
	at org.apache.hadoop.fs.FSDataOutputStream.close(FSDataOutputStream.java:101)
	at org.apache.hadoop.hdfs.TestDFSShell.testTotalSizeOfAllFiles(TestDFSShell.java:928)


FAILED:  org.apache.hadoop.hdfs.TestDFSShell.testSetXAttrPermission

Error Message:
org/apache/hadoop/security/ShellBasedUnixGroupsMapping$PartialGroupNameException

Stack Trace:
java.lang.NoClassDefFoundError: org/apache/hadoop/security/ShellBasedUnixGroupsMapping$PartialGroupNameException
	at java.net.URLClassLoader$1.run(URLClassLoader.java:366)
	at java.net.URLClassLoader$1.run(URLClassLoader.java:355)
	at java.security.AccessController.doPrivileged(Native Method)
	at java.net.URLClassLoader.findClass(URLClassLoader.java:354)
	at java.lang.ClassLoader.loadClass(ClassLoader.java:425)
	at sun.misc.Launcher$AppClassLoader.loadClass(Launcher.java:308)
	at java.lang.ClassLoader.loadClass(ClassLoader.java:358)
	at java.lang.Class.getDeclaredConstructors0(Native Method)
	at java.lang.Class.privateGetDeclaredConstructors(Class.java:2493)
	at java.lang.Class.getConstructor0(Class.java:2803)
	at java.lang.Class.getDeclaredConstructor(Class.java:2053)
	at org.apache.hadoop.util.ReflectionUtils.newInstance(ReflectionUtils.java:128)
	at org.apache.hadoop.security.Groups.<init>(Groups.java:78)
	at org.apache.hadoop.security.Groups.<init>(Groups.java:74)
	at org.apache.hadoop.security.UserGroupInformation$TestingGroups.<init>(UserGroupInformation.java:1361)
	at org.apache.hadoop.security.UserGroupInformation$TestingGroups.<init>(UserGroupInformation.java:1355)
	at org.apache.hadoop.security.UserGroupInformation.createUserForTesting(UserGroupInformation.java:1395)
	at org.apache.hadoop.hdfs.TestDFSShell.testSetXAttrPermission(TestDFSShell.java:2678)


FAILED:  org.apache.hadoop.hdfs.TestDFSShell.testSetrep

Error Message:
org/apache/hadoop/fs/shell/PathData$FileTypeRequirement

Stack Trace:
java.lang.NoClassDefFoundError: org/apache/hadoop/fs/shell/PathData$FileTypeRequirement
	at org.apache.hadoop.fs.shell.PathData.getDirectoryContents(PathData.java:267)
	at org.apache.hadoop.fs.shell.Command.recursePath(Command.java:377)
	at org.apache.hadoop.fs.shell.Command.processPaths(Command.java:323)
	at org.apache.hadoop.fs.shell.Command.processPathArgument(Command.java:293)
	at org.apache.hadoop.fs.shell.Command.processArgument(Command.java:275)
	at org.apache.hadoop.fs.shell.Command.processArguments(Command.java:259)
	at org.apache.hadoop.fs.shell.SetReplication.processArguments(SetReplication.java:76)
	at org.apache.hadoop.fs.shell.FsCommand.processRawArguments(FsCommand.java:119)
	at org.apache.hadoop.fs.shell.Command.run(Command.java:166)
	at org.apache.hadoop.fs.FsShell.run(FsShell.java:319)
	at org.apache.hadoop.hdfs.TestDFSShell.testSetrep(TestDFSShell.java:2522)


FAILED:  org.apache.hadoop.hdfs.TestDFSShell.testListReserved

Error Message:
org/apache/hadoop/fs/shell/Ls$3

Stack Trace:
java.lang.NoClassDefFoundError: org/apache/hadoop/fs/shell/Ls$3
	at org.apache.hadoop.fs.shell.Ls.initialiseOrderComparator(Ls.java:313)
	at org.apache.hadoop.fs.shell.Ls.processOptions(Ls.java:136)
	at org.apache.hadoop.fs.shell.Command.run(Command.java:165)
	at org.apache.hadoop.fs.FsShell.run(FsShell.java:319)
	at org.apache.hadoop.hdfs.TestDFSShell.runCmd(TestDFSShell.java:972)
	at org.apache.hadoop.hdfs.TestDFSShell.testListReserved(TestDFSShell.java:3183)


FAILED:  org.apache.hadoop.hdfs.TestDFSShell.testCopyToLocal

Error Message:
org/apache/hadoop/util/NativeCrc32

Stack Trace:
java.lang.NoClassDefFoundError: org/apache/hadoop/util/NativeCrc32
	at org.apache.hadoop.util.DataChecksum.calculateChunkedSums(DataChecksum.java:429)
	at org.apache.hadoop.fs.FSOutputSummer.writeChecksumChunks(FSOutputSummer.java:211)
	at org.apache.hadoop.fs.FSOutputSummer.flushBuffer(FSOutputSummer.java:164)
	at org.apache.hadoop.fs.FSOutputSummer.flushBuffer(FSOutputSummer.java:145)
	at org.apache.hadoop.hdfs.DFSOutputStream.closeImpl(DFSOutputStream.java:771)
	at org.apache.hadoop.hdfs.DFSOutputStream.close(DFSOutputStream.java:758)
	at org.apache.hadoop.fs.FSDataOutputStream$PositionCache.close(FSDataOutputStream.java:72)
	at org.apache.hadoop.fs.FSDataOutputStream.close(FSDataOutputStream.java:101)
	at org.apache.hadoop.hdfs.TestDFSShell.writeFile(TestDFSShell.java:95)
	at org.apache.hadoop.hdfs.TestDFSShell.createTree(TestDFSShell.java:873)
	at org.apache.hadoop.hdfs.TestDFSShell.testCopyToLocal(TestDFSShell.java:796)



Mime
  • Unnamed multipart/mixed (inline, None, 0 bytes)
View raw message