hadoop-hdfs-dev mailing list archives

Site index · List index
Message view « Date » · « Thread »
Top « Date » · « Thread »
From Apache Jenkins Server <jenk...@builds.apache.org>
Subject Build failed in Jenkins: Hadoop-Hdfs-trunk #2764
Date Mon, 25 Jan 2016 09:54:49 GMT
See <https://builds.apache.org/job/Hadoop-Hdfs-trunk/2764/changes>

Changes:

[aajisaka] YARN-4592. Remove unused GetContainerStatus proto. Contributed by Chang

------------------------------------------
[...truncated 3830 lines...]
[INFO] Apache Hadoop YARN Site ........................... SUCCESS [  0.064 s]
[INFO] Apache Hadoop YARN Registry ....................... SUCCESS [  0.916 s]
[INFO] Apache Hadoop YARN Project ........................ SUCCESS [  0.197 s]
[INFO] Apache Hadoop MapReduce Client .................... SUCCESS [  0.157 s]
[INFO] Apache Hadoop MapReduce Core ...................... SUCCESS [  4.933 s]
[INFO] Apache Hadoop MapReduce Common .................... SUCCESS [  2.484 s]
[INFO] Apache Hadoop MapReduce Shuffle ................... SUCCESS [  0.750 s]
[INFO] Apache Hadoop MapReduce App ....................... SUCCESS [  3.261 s]
[INFO] Apache Hadoop MapReduce HistoryServer ............. SUCCESS [  1.073 s]
[INFO] Apache Hadoop MapReduce JobClient ................. SUCCESS [  2.958 s]
[INFO] Apache Hadoop MapReduce HistoryServer Plugins ..... SUCCESS [  0.256 s]
[INFO] Apache Hadoop MapReduce NativeTask ................ SUCCESS [ 35.596 s]
[INFO] Apache Hadoop MapReduce Examples .................. SUCCESS [  1.045 s]
[INFO] Apache Hadoop MapReduce ........................... SUCCESS [  0.163 s]
[INFO] Apache Hadoop MapReduce Streaming ................. SUCCESS [  0.860 s]
[INFO] Apache Hadoop Distributed Copy .................... SUCCESS [  1.745 s]
[INFO] Apache Hadoop Archives ............................ SUCCESS [  0.390 s]
[INFO] Apache Hadoop Archive Logs ........................ SUCCESS [  0.481 s]
[INFO] Apache Hadoop Rumen ............................... SUCCESS [  1.062 s]
[INFO] Apache Hadoop Gridmix ............................. SUCCESS [  1.090 s]
[INFO] Apache Hadoop Data Join ........................... SUCCESS [  0.412 s]
[INFO] Apache Hadoop Ant Tasks ........................... SUCCESS [  0.161 s]
[INFO] Apache Hadoop Extras .............................. SUCCESS [  0.489 s]
[INFO] Apache Hadoop Pipes ............................... SUCCESS [  7.325 s]
[INFO] Apache Hadoop OpenStack support ................... SUCCESS [  0.625 s]
[INFO] Apache Hadoop Amazon Web Services support ......... SUCCESS [  0.590 s]
[INFO] Apache Hadoop Azure support ....................... SUCCESS [  1.015 s]
[INFO] Apache Hadoop Client .............................. SUCCESS [  0.754 s]
[INFO] Apache Hadoop Mini-Cluster ........................ SUCCESS [  0.157 s]
[INFO] Apache Hadoop Scheduler Load Simulator ............ SUCCESS [  1.524 s]
[INFO] Apache Hadoop Tools Dist .......................... SUCCESS [  0.369 s]
[INFO] Apache Hadoop Kafka Library support ............... SUCCESS [  0.312 s]
[INFO] Apache Hadoop Tools ............................... SUCCESS [  0.064 s]
[INFO] Apache Hadoop Distribution ........................ SUCCESS [  0.108 s]
[INFO] ------------------------------------------------------------------------
[INFO] BUILD SUCCESS
[INFO] ------------------------------------------------------------------------
[INFO] Total time: 04:17 min
[INFO] Finished at: 2016-01-25T09:53:28+00:00
[INFO] Final Memory: 256M/1288M
[INFO] ------------------------------------------------------------------------
+ cd hadoop-hdfs-project
+ /home/jenkins/tools/maven/latest/bin/mvn clean verify checkstyle:checkstyle findbugs:findbugs
-Drequire.test.libhadoop -Pdist -Pnative -Dtar -Pdocs -fae -Dmaven.javadoc.skip=true
[INFO] Scanning for projects...
[INFO] ------------------------------------------------------------------------
[INFO] Reactor Build Order:
[INFO] 
[INFO] Apache Hadoop HDFS Client
[INFO] Apache Hadoop HDFS
[INFO] Apache Hadoop HDFS Native Client
[INFO] Apache Hadoop HttpFS
[INFO] Apache Hadoop HDFS BookKeeper Journal
[INFO] Apache Hadoop HDFS-NFS
[INFO] Apache Hadoop HDFS Project
[INFO] 
[INFO] Using the builder org.apache.maven.lifecycle.internal.builder.singlethreaded.SingleThreadedBuilder
with a thread count of 1
[INFO]                                                                         
[INFO] ------------------------------------------------------------------------
[INFO] Building Apache Hadoop HDFS Client 3.0.0-SNAPSHOT
[INFO] ------------------------------------------------------------------------
[INFO] 
[INFO] --- maven-clean-plugin:2.5:clean (default-clean) @ hadoop-hdfs-client ---
[INFO] Deleting <https://builds.apache.org/job/Hadoop-Hdfs-trunk/ws/hadoop-hdfs-project/hadoop-hdfs-client/target>
[INFO] 
[INFO] --- maven-antrun-plugin:1.7:run (create-testdirs) @ hadoop-hdfs-client ---
[INFO] Executing tasks

main:
    [mkdir] Created dir: <https://builds.apache.org/job/Hadoop-Hdfs-trunk/ws/hadoop-hdfs-project/hadoop-hdfs-client/target/test-dir>
    [mkdir] Created dir: <https://builds.apache.org/job/Hadoop-Hdfs-trunk/ws/hadoop-hdfs-project/hadoop-hdfs-client/target/test/data>
[INFO] Executed tasks
[INFO] 
[INFO] --- hadoop-maven-plugins:3.0.0-SNAPSHOT:protoc (compile-protoc) @ hadoop-hdfs-client
---
[INFO] Wrote protoc checksums to file <https://builds.apache.org/job/Hadoop-Hdfs-trunk/ws/hadoop-hdfs-project/hadoop-hdfs-client/target/hadoop-maven-plugins-protoc-checksums.json>
[INFO] 
[INFO] --- maven-resources-plugin:2.6:resources (default-resources) @ hadoop-hdfs-client ---
[INFO] Using 'UTF-8' encoding to copy filtered resources.
[INFO] Copying 1 resource
[INFO] 
[INFO] --- maven-compiler-plugin:3.1:compile (default-compile) @ hadoop-hdfs-client ---
[INFO] Changes detected - recompiling the module!
[INFO] Compiling 228 source files to <https://builds.apache.org/job/Hadoop-Hdfs-trunk/ws/hadoop-hdfs-project/hadoop-hdfs-client/target/classes>
[WARNING] <https://builds.apache.org/job/Hadoop-Hdfs-trunk/ws/hadoop-hdfs-project/hadoop-hdfs-client/src/main/java/org/apache/hadoop/hdfs/DFSUtilClient.java>:[35,3]
sun.misc.Unsafe is internal proprietary API and may be removed in a future release
[WARNING] <https://builds.apache.org/job/Hadoop-Hdfs-trunk/ws/hadoop-hdfs-project/hadoop-hdfs-client/src/main/java/org/apache/hadoop/hdfs/shortcircuit/ShortCircuitShm.java>:[57,24]
sun.misc.Unsafe is internal proprietary API and may be removed in a future release
[WARNING] <https://builds.apache.org/job/Hadoop-Hdfs-trunk/ws/hadoop-hdfs-project/hadoop-hdfs-client/src/main/java/org/apache/hadoop/hdfs/shortcircuit/ShortCircuitShm.java>:[59,18]
sun.misc.Unsafe is internal proprietary API and may be removed in a future release
[WARNING] <https://builds.apache.org/job/Hadoop-Hdfs-trunk/ws/hadoop-hdfs-project/hadoop-hdfs-client/src/main/java/org/apache/hadoop/hdfs/shortcircuit/ShortCircuitShm.java>:[61,17]
sun.misc.Unsafe is internal proprietary API and may be removed in a future release
[WARNING] <https://builds.apache.org/job/Hadoop-Hdfs-trunk/ws/hadoop-hdfs-project/hadoop-hdfs-client/src/main/java/org/apache/hadoop/hdfs/shortcircuit/ShortCircuitShm.java>:[63,15]
sun.misc.Unsafe is internal proprietary API and may be removed in a future release
[WARNING] <https://builds.apache.org/job/Hadoop-Hdfs-trunk/ws/hadoop-hdfs-project/hadoop-hdfs-client/src/main/java/org/apache/hadoop/hdfs/protocolPB/PBHelperClient.java>:
Some input files use or override a deprecated API.
[WARNING] <https://builds.apache.org/job/Hadoop-Hdfs-trunk/ws/hadoop-hdfs-project/hadoop-hdfs-client/src/main/java/org/apache/hadoop/hdfs/protocolPB/PBHelperClient.java>:
Recompile with -Xlint:deprecation for details.
[WARNING] <https://builds.apache.org/job/Hadoop-Hdfs-trunk/ws/hadoop-hdfs-project/hadoop-hdfs-client/src/main/java/org/apache/hadoop/hdfs/protocolPB/PBHelperClient.java>:
<https://builds.apache.org/job/Hadoop-Hdfs-trunk/ws/hadoop-hdfs-project/hadoop-hdfs-client/src/main/java/org/apache/hadoop/hdfs/protocolPB/PBHelperClient.java>
uses unchecked or unsafe operations.
[WARNING] <https://builds.apache.org/job/Hadoop-Hdfs-trunk/ws/hadoop-hdfs-project/hadoop-hdfs-client/src/main/java/org/apache/hadoop/hdfs/protocolPB/PBHelperClient.java>:
Recompile with -Xlint:unchecked for details.
[INFO] 
[INFO] --- maven-resources-plugin:2.6:testResources (default-testResources) @ hadoop-hdfs-client
---
[INFO] Using 'UTF-8' encoding to copy filtered resources.
[INFO] Copying 1 resource
[INFO] 
[INFO] --- maven-compiler-plugin:3.1:testCompile (default-testCompile) @ hadoop-hdfs-client
---
[INFO] Changes detected - recompiling the module!
[INFO] Compiling 18 source files to <https://builds.apache.org/job/Hadoop-Hdfs-trunk/ws/hadoop-hdfs-project/hadoop-hdfs-client/target/test-classes>
[INFO] 
[INFO] --- maven-surefire-plugin:2.17:test (default-test) @ hadoop-hdfs-client ---
[INFO] Surefire report directory: <https://builds.apache.org/job/Hadoop-Hdfs-trunk/ws/hadoop-hdfs-project/hadoop-hdfs-client/target/surefire-reports>

-------------------------------------------------------
 T E S T S
-------------------------------------------------------

-------------------------------------------------------
 T E S T S
-------------------------------------------------------
Running org.apache.hadoop.hdfs.util.TestByteArrayManager
Tests run: 3, Failures: 1, Errors: 0, Skipped: 0, Time elapsed: 5.278 sec <<< FAILURE!
- in org.apache.hadoop.hdfs.util.TestByteArrayManager
testCounter(org.apache.hadoop.hdfs.util.TestByteArrayManager)  Time elapsed: 0.249 sec  <<<
FAILURE!
java.lang.AssertionError: expected:<2> but was:<1>
	at org.junit.Assert.fail(Assert.java:88)
	at org.junit.Assert.failNotEquals(Assert.java:743)
	at org.junit.Assert.assertEquals(Assert.java:118)
	at org.junit.Assert.assertEquals(Assert.java:555)
	at org.junit.Assert.assertEquals(Assert.java:542)
	at org.apache.hadoop.hdfs.util.TestByteArrayManager.testCounter(TestByteArrayManager.java:98)

Running org.apache.hadoop.hdfs.web.TestByteRangeInputStream
Tests run: 5, Failures: 0, Errors: 0, Skipped: 0, Time elapsed: 0.609 sec - in org.apache.hadoop.hdfs.web.TestByteRangeInputStream
Running org.apache.hadoop.hdfs.web.TestOffsetUrlInputStream
Tests run: 1, Failures: 0, Errors: 0, Skipped: 0, Time elapsed: 0.436 sec - in org.apache.hadoop.hdfs.web.TestOffsetUrlInputStream
Running org.apache.hadoop.hdfs.web.TestTokenAspect
Tests run: 6, Failures: 0, Errors: 0, Skipped: 0, Time elapsed: 2.365 sec - in org.apache.hadoop.hdfs.web.TestTokenAspect
Running org.apache.hadoop.hdfs.web.TestWebHDFSOAuth2
Tests run: 1, Failures: 0, Errors: 0, Skipped: 0, Time elapsed: 4.881 sec - in org.apache.hadoop.hdfs.web.TestWebHDFSOAuth2
Running org.apache.hadoop.hdfs.web.oauth2.TestClientCredentialTimeBasedTokenRefresher
Tests run: 1, Failures: 0, Errors: 0, Skipped: 0, Time elapsed: 3.544 sec - in org.apache.hadoop.hdfs.web.oauth2.TestClientCredentialTimeBasedTokenRefresher
Running org.apache.hadoop.hdfs.web.oauth2.TestRefreshTokenTimeBasedTokenRefresher
Tests run: 1, Failures: 0, Errors: 0, Skipped: 0, Time elapsed: 2.885 sec - in org.apache.hadoop.hdfs.web.oauth2.TestRefreshTokenTimeBasedTokenRefresher
Running org.apache.hadoop.hdfs.web.oauth2.TestAccessTokenTimer
Tests run: 2, Failures: 0, Errors: 0, Skipped: 0, Time elapsed: 0.393 sec - in org.apache.hadoop.hdfs.web.oauth2.TestAccessTokenTimer
Running org.apache.hadoop.hdfs.web.TestURLConnectionFactory
Tests run: 1, Failures: 0, Errors: 0, Skipped: 0, Time elapsed: 0.409 sec - in org.apache.hadoop.hdfs.web.TestURLConnectionFactory
Running org.apache.hadoop.hdfs.web.TestWebHdfsContentLength
Tests run: 7, Failures: 0, Errors: 0, Skipped: 0, Time elapsed: 2.014 sec - in org.apache.hadoop.hdfs.web.TestWebHdfsContentLength
Running org.apache.hadoop.hdfs.TestDefaultNameNodePort
Tests run: 3, Failures: 0, Errors: 0, Skipped: 0, Time elapsed: 0.711 sec - in org.apache.hadoop.hdfs.TestDefaultNameNodePort
Running org.apache.hadoop.hdfs.shortcircuit.TestShortCircuitShm
Tests run: 2, Failures: 0, Errors: 0, Skipped: 0, Time elapsed: 0.832 sec - in org.apache.hadoop.hdfs.shortcircuit.TestShortCircuitShm
Running org.apache.hadoop.hdfs.TestDFSPacket
Tests run: 2, Failures: 0, Errors: 0, Skipped: 0, Time elapsed: 0.175 sec - in org.apache.hadoop.hdfs.TestDFSPacket
Running org.apache.hadoop.hdfs.protocol.TestExtendedBlock
Tests run: 2, Failures: 0, Errors: 0, Skipped: 0, Time elapsed: 0.123 sec - in org.apache.hadoop.hdfs.protocol.TestExtendedBlock
Running org.apache.hadoop.hdfs.TestPeerCache
Tests run: 5, Failures: 0, Errors: 0, Skipped: 0, Time elapsed: 1.79 sec - in org.apache.hadoop.hdfs.TestPeerCache
Running org.apache.hadoop.hdfs.client.impl.TestLeaseRenewer
Tests run: 4, Failures: 0, Errors: 0, Skipped: 0, Time elapsed: 2.057 sec - in org.apache.hadoop.hdfs.client.impl.TestLeaseRenewer
Running org.apache.hadoop.fs.TestXAttr
Tests run: 2, Failures: 0, Errors: 0, Skipped: 0, Time elapsed: 0.152 sec - in org.apache.hadoop.fs.TestXAttr
Running org.apache.hadoop.fs.TestUrlStreamHandlerFactory
Tests run: 1, Failures: 0, Errors: 0, Skipped: 0, Time elapsed: 2.741 sec - in org.apache.hadoop.fs.TestUrlStreamHandlerFactory

Results :

Failed tests: 
  TestByteArrayManager.testCounter:98 expected:<2> but was:<1>

Tests run: 49, Failures: 1, Errors: 0, Skipped: 0

[INFO]                                                                         
[INFO] ------------------------------------------------------------------------
[INFO] Skipping Apache Hadoop HDFS
[INFO] This project has been banned from the build due to previous failures.
[INFO] ------------------------------------------------------------------------
[INFO]                                                                         
[INFO] ------------------------------------------------------------------------
[INFO] Skipping Apache Hadoop HDFS Native Client
[INFO] This project has been banned from the build due to previous failures.
[INFO] ------------------------------------------------------------------------
[INFO]                                                                         
[INFO] ------------------------------------------------------------------------
[INFO] Skipping Apache Hadoop HttpFS
[INFO] This project has been banned from the build due to previous failures.
[INFO] ------------------------------------------------------------------------
[INFO]                                                                         
[INFO] ------------------------------------------------------------------------
[INFO] Skipping Apache Hadoop HDFS BookKeeper Journal
[INFO] This project has been banned from the build due to previous failures.
[INFO] ------------------------------------------------------------------------
[INFO]                                                                         
[INFO] ------------------------------------------------------------------------
[INFO] Skipping Apache Hadoop HDFS-NFS
[INFO] This project has been banned from the build due to previous failures.
[INFO] ------------------------------------------------------------------------
[INFO]                                                                         
[INFO] ------------------------------------------------------------------------
[INFO] Building Apache Hadoop HDFS Project 3.0.0-SNAPSHOT
[INFO] ------------------------------------------------------------------------
[INFO] 
[INFO] --- maven-clean-plugin:2.5:clean (default-clean) @ hadoop-hdfs-project ---
[INFO] Deleting <https://builds.apache.org/job/Hadoop-Hdfs-trunk/ws/hadoop-hdfs-project/target>
[INFO] 
[INFO] --- maven-antrun-plugin:1.7:run (create-testdirs) @ hadoop-hdfs-project ---
[INFO] Executing tasks

main:
    [mkdir] Created dir: <https://builds.apache.org/job/Hadoop-Hdfs-trunk/ws/hadoop-hdfs-project/target/test-dir>
[INFO] Executed tasks
[INFO] 
[INFO] --- maven-source-plugin:2.3:jar-no-fork (hadoop-java-sources) @ hadoop-hdfs-project
---
[INFO] 
[INFO] --- maven-source-plugin:2.3:test-jar-no-fork (hadoop-java-sources) @ hadoop-hdfs-project
---
[INFO] 
[INFO] --- maven-enforcer-plugin:1.3.1:enforce (dist-enforce) @ hadoop-hdfs-project ---
[INFO] 
[INFO] --- maven-site-plugin:3.4:attach-descriptor (attach-descriptor) @ hadoop-hdfs-project
---
[INFO] 
[INFO] --- maven-javadoc-plugin:2.8.1:jar (module-javadocs) @ hadoop-hdfs-project ---
[INFO] Skipping javadoc generation
[INFO] 
[INFO] --- maven-enforcer-plugin:1.3.1:enforce (depcheck) @ hadoop-hdfs-project ---
[INFO] 
[INFO] --- maven-checkstyle-plugin:2.15:checkstyle (default-cli) @ hadoop-hdfs-project ---
[INFO] 
[INFO] --- findbugs-maven-plugin:3.0.0:findbugs (default-cli) @ hadoop-hdfs-project ---
[INFO] ------------------------------------------------------------------------
[INFO] Reactor Summary:
[INFO] 
[INFO] Apache Hadoop HDFS Client ......................... FAILURE [01:08 min]
[INFO] Apache Hadoop HDFS ................................ SKIPPED
[INFO] Apache Hadoop HDFS Native Client .................. SKIPPED
[INFO] Apache Hadoop HttpFS .............................. SKIPPED
[INFO] Apache Hadoop HDFS BookKeeper Journal ............. SKIPPED
[INFO] Apache Hadoop HDFS-NFS ............................ SKIPPED
[INFO] Apache Hadoop HDFS Project ........................ SUCCESS [  4.159 s]
[INFO] ------------------------------------------------------------------------
[INFO] BUILD FAILURE
[INFO] ------------------------------------------------------------------------
[INFO] Total time: 01:15 min
[INFO] Finished at: 2016-01-25T09:54:48+00:00
[INFO] Final Memory: 77M/1407M
[INFO] ------------------------------------------------------------------------
[ERROR] Failed to execute goal org.apache.maven.plugins:maven-surefire-plugin:2.17:test (default-test)
on project hadoop-hdfs-client: There are test failures.
[ERROR] 
[ERROR] Please refer to <https://builds.apache.org/job/Hadoop-Hdfs-trunk/ws/hadoop-hdfs-project/hadoop-hdfs-client/target/surefire-reports>
for the individual test results.
[ERROR] -> [Help 1]
[ERROR] 
[ERROR] To see the full stack trace of the errors, re-run Maven with the -e switch.
[ERROR] Re-run Maven using the -X switch to enable full debug logging.
[ERROR] 
[ERROR] For more information about the errors and possible solutions, please read the following
articles:
[ERROR] [Help 1] http://cwiki.apache.org/confluence/display/MAVEN/MojoFailureException
Build step 'Execute shell' marked build as failure
Archiving artifacts
Recording test results

Mime
View raw message