hadoop-hdfs-dev mailing list archives

Site index · List index
Message view « Date » · « Thread »
Top « Date » · « Thread »
From Apache Jenkins Server <jenk...@builds.apache.org>
Subject Hadoop-Hdfs-trunk-Java8 - Build # 816 - Still Failing
Date Thu, 21 Jan 2016 19:33:58 GMT
See https://builds.apache.org/job/Hadoop-Hdfs-trunk-Java8/816/

###################################################################################
########################## LAST 60 LINES OF THE CONSOLE ###########################
[...truncated 6114 lines...]
[INFO] --- maven-antrun-plugin:1.7:run (create-testdirs) @ hadoop-hdfs-project ---
[INFO] Executing tasks

main:
    [mkdir] Created dir: /home/jenkins/jenkins-slave/workspace/Hadoop-Hdfs-trunk-Java8/hadoop-hdfs-project/target/test-dir
[INFO] Executed tasks
[INFO] 
[INFO] --- maven-source-plugin:2.3:jar-no-fork (hadoop-java-sources) @ hadoop-hdfs-project
---
[INFO] 
[INFO] --- maven-source-plugin:2.3:test-jar-no-fork (hadoop-java-sources) @ hadoop-hdfs-project
---
[INFO] 
[INFO] --- maven-enforcer-plugin:1.3.1:enforce (dist-enforce) @ hadoop-hdfs-project ---
[INFO] 
[INFO] --- maven-site-plugin:3.4:attach-descriptor (attach-descriptor) @ hadoop-hdfs-project
---
[INFO] 
[INFO] --- maven-javadoc-plugin:2.8.1:jar (module-javadocs) @ hadoop-hdfs-project ---
[INFO] Not executing Javadoc as the project is not a Java classpath-capable package
[INFO] 
[INFO] --- maven-enforcer-plugin:1.3.1:enforce (depcheck) @ hadoop-hdfs-project ---
[INFO] 
[INFO] --- maven-checkstyle-plugin:2.15:checkstyle (default-cli) @ hadoop-hdfs-project ---
[INFO] 
[INFO] --- findbugs-maven-plugin:3.0.0:findbugs (default-cli) @ hadoop-hdfs-project ---
[INFO] ------------------------------------------------------------------------
[INFO] Reactor Summary:
[INFO] 
[INFO] Apache Hadoop HDFS Client ......................... SUCCESS [04:10 min]
[INFO] Apache Hadoop HDFS ................................ FAILURE [  03:16 h]
[INFO] Apache Hadoop HDFS Native Client .................. SKIPPED
[INFO] Apache Hadoop HttpFS .............................. SKIPPED
[INFO] Apache Hadoop HDFS BookKeeper Journal ............. SKIPPED
[INFO] Apache Hadoop HDFS-NFS ............................ SKIPPED
[INFO] Apache Hadoop HDFS Project ........................ SUCCESS [  0.056 s]
[INFO] ------------------------------------------------------------------------
[INFO] BUILD FAILURE
[INFO] ------------------------------------------------------------------------
[INFO] Total time: 03:20 h
[INFO] Finished at: 2016-01-21T19:33:59+00:00
[INFO] Final Memory: 56M/505M
[INFO] ------------------------------------------------------------------------
[ERROR] Failed to execute goal org.apache.maven.plugins:maven-surefire-plugin:2.17:test (default-test)
on project hadoop-hdfs: There are test failures.
[ERROR] 
[ERROR] Please refer to /home/jenkins/jenkins-slave/workspace/Hadoop-Hdfs-trunk-Java8/hadoop-hdfs-project/hadoop-hdfs/target/surefire-reports
for the individual test results.
[ERROR] -> [Help 1]
[ERROR] 
[ERROR] To see the full stack trace of the errors, re-run Maven with the -e switch.
[ERROR] Re-run Maven using the -X switch to enable full debug logging.
[ERROR] 
[ERROR] For more information about the errors and possible solutions, please read the following
articles:
[ERROR] [Help 1] http://cwiki.apache.org/confluence/display/MAVEN/MojoFailureException
[ERROR] 
[ERROR] After correcting the problems, you can resume the build with the command
[ERROR]   mvn <goals> -rf :hadoop-hdfs
Build step 'Execute shell' marked build as failure
Archiving artifacts
Recording test results
Sending e-mails to: hdfs-dev@hadoop.apache.org
Email was triggered for: Failure - Any
Sending email for trigger: Failure - Any



###################################################################################
############################## FAILED TESTS (if any) ##############################
11 tests failed.
FAILED:  org.apache.hadoop.hdfs.TestAclsEndToEnd.testGoodWithWhitelistWithoutBlacklist

Error Message:
Exception during deletion of file /tmp/BLUEZONE/file1 by keyadmin

Stack Trace:
java.lang.AssertionError: Exception during deletion of file /tmp/BLUEZONE/file1 by keyadmin
	at org.junit.Assert.fail(Assert.java:88)
	at org.junit.Assert.assertTrue(Assert.java:41)
	at org.apache.hadoop.hdfs.TestAclsEndToEnd.doFullAclTest(TestAclsEndToEnd.java:471)
	at org.apache.hadoop.hdfs.TestAclsEndToEnd.testGoodWithWhitelistWithoutBlacklist(TestAclsEndToEnd.java:368)


FAILED:  org.apache.hadoop.hdfs.TestReadStripedFileWithDecoding.testReadCorruptedDataByDeleting

Error Message:
4 missing blocks, the stripe is: Offset=0, length=262144, fetchedChunksNum=4, missingChunksNum=4

Stack Trace:
java.io.IOException: 4 missing blocks, the stripe is: Offset=0, length=262144, fetchedChunksNum=4,
missingChunksNum=4
	at org.apache.hadoop.hdfs.DFSStripedInputStream$StripeReader.checkMissingBlocks(DFSStripedInputStream.java:604)
	at org.apache.hadoop.hdfs.DFSStripedInputStream$StripeReader.readStripe(DFSStripedInputStream.java:785)
	at org.apache.hadoop.hdfs.DFSStripedInputStream.fetchBlockByteRange(DFSStripedInputStream.java:535)
	at org.apache.hadoop.hdfs.DFSInputStream.pread(DFSInputStream.java:1488)
	at org.apache.hadoop.hdfs.DFSInputStream.read(DFSInputStream.java:1450)
	at org.apache.hadoop.fs.FSInputStream.readFully(FSInputStream.java:78)
	at org.apache.hadoop.fs.FSDataInputStream.readFully(FSDataInputStream.java:107)
	at org.apache.hadoop.hdfs.StripedFileTestUtil.verifyPread(StripedFileTestUtil.java:110)
	at org.apache.hadoop.hdfs.TestReadStripedFileWithDecoding.verifyRead(TestReadStripedFileWithDecoding.java:162)
	at org.apache.hadoop.hdfs.TestReadStripedFileWithDecoding.testReadWithBlockCorrupted(TestReadStripedFileWithDecoding.java:321)
	at org.apache.hadoop.hdfs.TestReadStripedFileWithDecoding.testReadCorruptedDataByDeleting(TestReadStripedFileWithDecoding.java:137)


FAILED:  org.apache.hadoop.hdfs.TestReadStripedFileWithDecoding.testReadCorruptedData

Error Message:
4 missing blocks, the stripe is: Offset=0, length=262144, fetchedChunksNum=4, missingChunksNum=4

Stack Trace:
java.io.IOException: 4 missing blocks, the stripe is: Offset=0, length=262144, fetchedChunksNum=4,
missingChunksNum=4
	at org.apache.hadoop.hdfs.DFSStripedInputStream$StripeReader.checkMissingBlocks(DFSStripedInputStream.java:604)
	at org.apache.hadoop.hdfs.DFSStripedInputStream$StripeReader.readStripe(DFSStripedInputStream.java:785)
	at org.apache.hadoop.hdfs.DFSStripedInputStream.fetchBlockByteRange(DFSStripedInputStream.java:535)
	at org.apache.hadoop.hdfs.DFSInputStream.pread(DFSInputStream.java:1488)
	at org.apache.hadoop.hdfs.DFSInputStream.read(DFSInputStream.java:1450)
	at org.apache.hadoop.fs.FSInputStream.readFully(FSInputStream.java:78)
	at org.apache.hadoop.fs.FSDataInputStream.readFully(FSDataInputStream.java:107)
	at org.apache.hadoop.hdfs.StripedFileTestUtil.verifyPread(StripedFileTestUtil.java:110)
	at org.apache.hadoop.hdfs.TestReadStripedFileWithDecoding.verifyRead(TestReadStripedFileWithDecoding.java:162)
	at org.apache.hadoop.hdfs.TestReadStripedFileWithDecoding.testReadWithBlockCorrupted(TestReadStripedFileWithDecoding.java:321)
	at org.apache.hadoop.hdfs.TestReadStripedFileWithDecoding.testReadCorruptedData(TestReadStripedFileWithDecoding.java:120)


FAILED:  org.apache.hadoop.hdfs.server.datanode.TestDataNodeMetrics.testDatanodeBlocksReplicatedMetric

Error Message:
org/apache/hadoop/util/ShutdownHookManager

Stack Trace:
java.lang.NoClassDefFoundError: org/apache/hadoop/util/ShutdownHookManager
	at java.net.URLClassLoader$1.run(URLClassLoader.java:372)
	at java.net.URLClassLoader$1.run(URLClassLoader.java:361)
	at java.security.AccessController.doPrivileged(Native Method)
	at java.net.URLClassLoader.findClass(URLClassLoader.java:360)
	at java.lang.ClassLoader.loadClass(ClassLoader.java:424)
	at sun.misc.Launcher$AppClassLoader.loadClass(Launcher.java:308)
	at java.lang.ClassLoader.loadClass(ClassLoader.java:357)
	at org.apache.hadoop.hdfs.MiniDFSCluster.shutdown(MiniDFSCluster.java:1913)
	at org.apache.hadoop.hdfs.MiniDFSCluster.shutdown(MiniDFSCluster.java:1882)
	at org.apache.hadoop.hdfs.MiniDFSCluster.shutdown(MiniDFSCluster.java:1875)
	at org.apache.hadoop.hdfs.MiniDFSCluster.initMiniDFSCluster(MiniDFSCluster.java:854)
	at org.apache.hadoop.hdfs.MiniDFSCluster.<init>(MiniDFSCluster.java:482)
	at org.apache.hadoop.hdfs.MiniDFSCluster$Builder.build(MiniDFSCluster.java:441)
	at org.apache.hadoop.hdfs.server.datanode.TestDataNodeMetrics.testDatanodeBlocksReplicatedMetric(TestDataNodeMetrics.java:300)


FAILED:  org.apache.hadoop.hdfs.server.datanode.TestDataNodeMetrics.testTimeoutMetric

Error Message:
org/apache/hadoop/fs/Path

Stack Trace:
java.lang.NoClassDefFoundError: org/apache/hadoop/fs/Path
	at java.net.URLClassLoader$1.run(URLClassLoader.java:372)
	at java.net.URLClassLoader$1.run(URLClassLoader.java:361)
	at java.security.AccessController.doPrivileged(Native Method)
	at java.net.URLClassLoader.findClass(URLClassLoader.java:360)
	at java.lang.ClassLoader.loadClass(ClassLoader.java:424)
	at sun.misc.Launcher$AppClassLoader.loadClass(Launcher.java:308)
	at java.lang.ClassLoader.loadClass(ClassLoader.java:357)
	at org.apache.hadoop.hdfs.server.datanode.TestDataNodeMetrics.testTimeoutMetric(TestDataNodeMetrics.java:209)


FAILED:  org.apache.hadoop.hdfs.server.datanode.TestDataNodeMetrics.testSendDataPacketMetrics

Error Message:
org/apache/hadoop/util/ShutdownHookManager

Stack Trace:
java.lang.NoClassDefFoundError: org/apache/hadoop/util/ShutdownHookManager
	at org.apache.hadoop.hdfs.MiniDFSCluster.shutdown(MiniDFSCluster.java:1913)
	at org.apache.hadoop.hdfs.MiniDFSCluster.shutdown(MiniDFSCluster.java:1882)
	at org.apache.hadoop.hdfs.MiniDFSCluster.shutdown(MiniDFSCluster.java:1875)
	at org.apache.hadoop.hdfs.MiniDFSCluster.initMiniDFSCluster(MiniDFSCluster.java:854)
	at org.apache.hadoop.hdfs.MiniDFSCluster.<init>(MiniDFSCluster.java:482)
	at org.apache.hadoop.hdfs.MiniDFSCluster$Builder.build(MiniDFSCluster.java:441)
	at org.apache.hadoop.hdfs.server.datanode.TestDataNodeMetrics.testSendDataPacketMetrics(TestDataNodeMetrics.java:87)


FAILED:  org.apache.hadoop.hdfs.server.datanode.TestDataNodeMetrics.testDataNodeTimeSpend

Error Message:
org/apache/hadoop/util/DataChecksum

Stack Trace:
java.lang.NoClassDefFoundError: org/apache/hadoop/util/DataChecksum
	at java.net.URLClassLoader$1.run(URLClassLoader.java:372)
	at java.net.URLClassLoader$1.run(URLClassLoader.java:361)
	at java.security.AccessController.doPrivileged(Native Method)
	at java.net.URLClassLoader.findClass(URLClassLoader.java:360)
	at java.lang.ClassLoader.loadClass(ClassLoader.java:424)
	at sun.misc.Launcher$AppClassLoader.loadClass(Launcher.java:308)
	at java.lang.ClassLoader.loadClass(ClassLoader.java:357)
	at org.apache.hadoop.hdfs.server.datanode.SimulatedFSDataset.<clinit>(SimulatedFSDataset.java:118)
	at org.apache.hadoop.hdfs.server.datanode.TestDataNodeMetrics.testDataNodeTimeSpend(TestDataNodeMetrics.java:261)


FAILED:  org.apache.hadoop.hdfs.server.datanode.TestDataNodeMetrics.testReceivePacketMetrics

Error Message:
org/apache/hadoop/util/ShutdownHookManager

Stack Trace:
java.lang.NoClassDefFoundError: org/apache/hadoop/util/ShutdownHookManager
	at org.apache.hadoop.hdfs.MiniDFSCluster.shutdown(MiniDFSCluster.java:1913)
	at org.apache.hadoop.hdfs.MiniDFSCluster.shutdown(MiniDFSCluster.java:1882)
	at org.apache.hadoop.hdfs.MiniDFSCluster.shutdown(MiniDFSCluster.java:1875)
	at org.apache.hadoop.hdfs.MiniDFSCluster.initMiniDFSCluster(MiniDFSCluster.java:854)
	at org.apache.hadoop.hdfs.MiniDFSCluster.<init>(MiniDFSCluster.java:482)
	at org.apache.hadoop.hdfs.MiniDFSCluster$Builder.build(MiniDFSCluster.java:441)
	at org.apache.hadoop.hdfs.server.datanode.TestDataNodeMetrics.testReceivePacketMetrics(TestDataNodeMetrics.java:119)


FAILED:  org.apache.hadoop.hdfs.server.datanode.TestDataNodeMetrics.testRoundTripAckMetric

Error Message:
org/apache/hadoop/util/ShutdownHookManager

Stack Trace:
java.lang.NoClassDefFoundError: org/apache/hadoop/util/ShutdownHookManager
	at org.apache.hadoop.hdfs.MiniDFSCluster.shutdown(MiniDFSCluster.java:1913)
	at org.apache.hadoop.hdfs.MiniDFSCluster.shutdown(MiniDFSCluster.java:1882)
	at org.apache.hadoop.hdfs.MiniDFSCluster.shutdown(MiniDFSCluster.java:1875)
	at org.apache.hadoop.hdfs.MiniDFSCluster.initMiniDFSCluster(MiniDFSCluster.java:854)
	at org.apache.hadoop.hdfs.MiniDFSCluster.<init>(MiniDFSCluster.java:482)
	at org.apache.hadoop.hdfs.MiniDFSCluster$Builder.build(MiniDFSCluster.java:441)
	at org.apache.hadoop.hdfs.server.datanode.TestDataNodeMetrics.testRoundTripAckMetric(TestDataNodeMetrics.java:159)


FAILED:  org.apache.hadoop.hdfs.server.datanode.TestDataNodeMetrics.testDataNodeMetrics

Error Message:
Could not initialize class org.apache.hadoop.hdfs.server.datanode.SimulatedFSDataset

Stack Trace:
java.lang.NoClassDefFoundError: Could not initialize class org.apache.hadoop.hdfs.server.datanode.SimulatedFSDataset
	at org.apache.hadoop.hdfs.server.datanode.TestDataNodeMetrics.testDataNodeMetrics(TestDataNodeMetrics.java:63)


FAILED:  org.apache.hadoop.hdfs.server.namenode.TestNNThroughputBenchmark.testNNThroughput

Error Message:
Not replicated yet: /nnThroughputBenchmark/blockReport/ThroughputBenchDir0/ThroughputBench24

Stack Trace:
org.apache.hadoop.hdfs.server.namenode.NotReplicatedYetException: Not replicated yet: /nnThroughputBenchmark/blockReport/ThroughputBenchDir0/ThroughputBench24
	at org.apache.hadoop.hdfs.server.namenode.FSDirWriteFileOp.validateAddBlock(FSDirWriteFileOp.java:190)
	at org.apache.hadoop.hdfs.server.namenode.FSNamesystem.getAdditionalBlock(FSNamesystem.java:2379)
	at org.apache.hadoop.hdfs.server.namenode.NameNodeRpcServer.addBlock(NameNodeRpcServer.java:797)
	at org.apache.hadoop.hdfs.server.namenode.NNThroughputBenchmark$BlockReportStats.addBlocks(NNThroughputBenchmark.java:1184)
	at org.apache.hadoop.hdfs.server.namenode.NNThroughputBenchmark$BlockReportStats.generateInputs(NNThroughputBenchmark.java:1171)
	at org.apache.hadoop.hdfs.server.namenode.NNThroughputBenchmark$OperationStatsBase.benchmark(NNThroughputBenchmark.java:281)
	at org.apache.hadoop.hdfs.server.namenode.NNThroughputBenchmark.run(NNThroughputBenchmark.java:1519)
	at org.apache.hadoop.hdfs.server.namenode.NNThroughputBenchmark.runBenchmark(NNThroughputBenchmark.java:1422)
	at org.apache.hadoop.hdfs.server.namenode.TestNNThroughputBenchmark.testNNThroughput(TestNNThroughputBenchmark.java:53)



Mime
  • Unnamed multipart/mixed (inline, None, 0 bytes)
View raw message