hadoop-hdfs-dev mailing list archives

Site index · List index
Message view « Date » · « Thread »
Top « Date » · « Thread »
From Apache Jenkins Server <jenk...@builds.apache.org>
Subject Build failed in Jenkins: Hadoop-Hdfs-trunk #2754
Date Fri, 22 Jan 2016 07:56:54 GMT
See <https://builds.apache.org/job/Hadoop-Hdfs-trunk/2754/changes>

Changes:

[iwasakims] HDFS-9601. NNThroughputBenchmark.BlockReportStats should handle

[rohithsharmaks] YARN-4584. RM startup failure when AM attempts greater than

[iwasakims] HDFS-9618. Fix mismatch between log level and guard in

------------------------------------------
[...truncated 4522 lines...]
Tests run: 8, Failures: 0, Errors: 0, Skipped: 0, Time elapsed: 11.226 sec - in org.apache.hadoop.hdfs.server.namenode.TestAclConfigFlag
Running org.apache.hadoop.hdfs.server.namenode.TestLargeDirectoryDelete
Tests run: 1, Failures: 0, Errors: 0, Skipped: 0, Time elapsed: 58.799 sec - in org.apache.hadoop.hdfs.server.namenode.TestLargeDirectoryDelete
Running org.apache.hadoop.hdfs.server.namenode.TestStartupProgressServlet
Tests run: 3, Failures: 0, Errors: 0, Skipped: 0, Time elapsed: 0.716 sec - in org.apache.hadoop.hdfs.server.namenode.TestStartupProgressServlet
Running org.apache.hadoop.hdfs.server.namenode.TestAuditLogs
Tests run: 14, Failures: 0, Errors: 0, Skipped: 0, Time elapsed: 38.071 sec - in org.apache.hadoop.hdfs.server.namenode.TestAuditLogs
Running org.apache.hadoop.hdfs.server.namenode.TestFileTruncate
Tests run: 18, Failures: 0, Errors: 0, Skipped: 0, Time elapsed: 88.169 sec - in org.apache.hadoop.hdfs.server.namenode.TestFileTruncate
Running org.apache.hadoop.hdfs.server.namenode.TestEditLogJournalFailures
Tests run: 6, Failures: 0, Errors: 0, Skipped: 0, Time elapsed: 10.568 sec - in org.apache.hadoop.hdfs.server.namenode.TestEditLogJournalFailures
Running org.apache.hadoop.hdfs.server.namenode.TestCommitBlockSynchronization
Tests run: 5, Failures: 0, Errors: 0, Skipped: 0, Time elapsed: 2.701 sec - in org.apache.hadoop.hdfs.server.namenode.TestCommitBlockSynchronization
Running org.apache.hadoop.hdfs.server.namenode.TestNameNodeMXBean
Tests run: 7, Failures: 0, Errors: 0, Skipped: 0, Time elapsed: 21.472 sec - in org.apache.hadoop.hdfs.server.namenode.TestNameNodeMXBean
Running org.apache.hadoop.hdfs.server.namenode.TestNameNodeAcl
Tests run: 64, Failures: 0, Errors: 0, Skipped: 0, Time elapsed: 23.384 sec - in org.apache.hadoop.hdfs.server.namenode.TestNameNodeAcl
Running org.apache.hadoop.hdfs.server.namenode.TestXAttrConfigFlag
Tests run: 5, Failures: 0, Errors: 0, Skipped: 0, Time elapsed: 9.795 sec - in org.apache.hadoop.hdfs.server.namenode.TestXAttrConfigFlag
Running org.apache.hadoop.hdfs.server.namenode.snapshot.TestUpdatePipelineWithSnapshots
Tests run: 1, Failures: 0, Errors: 0, Skipped: 0, Time elapsed: 10.807 sec - in org.apache.hadoop.hdfs.server.namenode.snapshot.TestUpdatePipelineWithSnapshots
Running org.apache.hadoop.hdfs.server.namenode.snapshot.TestSetQuotaWithSnapshot
Tests run: 2, Failures: 0, Errors: 0, Skipped: 0, Time elapsed: 7.19 sec - in org.apache.hadoop.hdfs.server.namenode.snapshot.TestSetQuotaWithSnapshot
Running org.apache.hadoop.hdfs.server.namenode.snapshot.TestDisallowModifyROSnapshot
Tests run: 11, Failures: 0, Errors: 0, Skipped: 0, Time elapsed: 5.773 sec - in org.apache.hadoop.hdfs.server.namenode.snapshot.TestDisallowModifyROSnapshot
Running org.apache.hadoop.hdfs.server.namenode.snapshot.TestOpenFilesWithSnapshot
Tests run: 7, Failures: 0, Errors: 0, Skipped: 0, Time elapsed: 54.056 sec - in org.apache.hadoop.hdfs.server.namenode.snapshot.TestOpenFilesWithSnapshot
Running org.apache.hadoop.hdfs.server.namenode.snapshot.TestSnapshotDeletion
Tests run: 17, Failures: 0, Errors: 0, Skipped: 0, Time elapsed: 59.543 sec - in org.apache.hadoop.hdfs.server.namenode.snapshot.TestSnapshotDeletion
Running org.apache.hadoop.hdfs.server.namenode.snapshot.TestGetContentSummaryWithSnapshot
Tests run: 1, Failures: 0, Errors: 0, Skipped: 0, Time elapsed: 5.376 sec - in org.apache.hadoop.hdfs.server.namenode.snapshot.TestGetContentSummaryWithSnapshot
Running org.apache.hadoop.hdfs.server.namenode.snapshot.TestSnapshotDiffReport
Tests run: 8, Failures: 0, Errors: 0, Skipped: 0, Time elapsed: 15.766 sec - in org.apache.hadoop.hdfs.server.namenode.snapshot.TestSnapshotDiffReport
Running org.apache.hadoop.hdfs.server.namenode.snapshot.TestSnapshotStatsMXBean
Tests run: 1, Failures: 0, Errors: 0, Skipped: 0, Time elapsed: 4.805 sec - in org.apache.hadoop.hdfs.server.namenode.snapshot.TestSnapshotStatsMXBean
Running org.apache.hadoop.hdfs.server.namenode.snapshot.TestNestedSnapshots
Tests run: 5, Failures: 0, Errors: 0, Skipped: 0, Time elapsed: 52.312 sec - in org.apache.hadoop.hdfs.server.namenode.snapshot.TestNestedSnapshots
Running org.apache.hadoop.hdfs.server.namenode.snapshot.TestSnapshotListing
Tests run: 1, Failures: 0, Errors: 0, Skipped: 0, Time elapsed: 5.123 sec - in org.apache.hadoop.hdfs.server.namenode.snapshot.TestSnapshotListing
Running org.apache.hadoop.hdfs.server.namenode.snapshot.TestFileWithSnapshotFeature
Tests run: 1, Failures: 0, Errors: 0, Skipped: 0, Time elapsed: 0.781 sec - in org.apache.hadoop.hdfs.server.namenode.snapshot.TestFileWithSnapshotFeature
Running org.apache.hadoop.hdfs.server.namenode.snapshot.TestSnapshot
Tests run: 6, Failures: 0, Errors: 0, Skipped: 0, Time elapsed: 83.573 sec - in org.apache.hadoop.hdfs.server.namenode.snapshot.TestSnapshot
Running org.apache.hadoop.hdfs.server.namenode.snapshot.TestSnapshottableDirListing
Tests run: 2, Failures: 0, Errors: 0, Skipped: 0, Time elapsed: 6.696 sec - in org.apache.hadoop.hdfs.server.namenode.snapshot.TestSnapshottableDirListing
Running org.apache.hadoop.hdfs.server.namenode.snapshot.TestSnapshotFileLength
Tests run: 2, Failures: 0, Errors: 0, Skipped: 0, Time elapsed: 5.817 sec - in org.apache.hadoop.hdfs.server.namenode.snapshot.TestSnapshotFileLength
Running org.apache.hadoop.hdfs.server.namenode.snapshot.TestSnapshotMetrics
Tests run: 2, Failures: 0, Errors: 0, Skipped: 0, Time elapsed: 7.544 sec - in org.apache.hadoop.hdfs.server.namenode.snapshot.TestSnapshotMetrics
Running org.apache.hadoop.hdfs.server.namenode.snapshot.TestSnapshotNameWithInvalidCharacters
Tests run: 2, Failures: 0, Errors: 0, Skipped: 0, Time elapsed: 5.983 sec - in org.apache.hadoop.hdfs.server.namenode.snapshot.TestSnapshotNameWithInvalidCharacters
Running org.apache.hadoop.hdfs.server.namenode.snapshot.TestSnapshotReplication
Tests run: 3, Failures: 0, Errors: 0, Skipped: 0, Time elapsed: 9.948 sec - in org.apache.hadoop.hdfs.server.namenode.snapshot.TestSnapshotReplication
Running org.apache.hadoop.hdfs.server.namenode.snapshot.TestSnapshotManager
Tests run: 1, Failures: 0, Errors: 0, Skipped: 0, Time elapsed: 0.817 sec - in org.apache.hadoop.hdfs.server.namenode.snapshot.TestSnapshotManager
Running org.apache.hadoop.hdfs.server.namenode.snapshot.TestXAttrWithSnapshot
Tests run: 8, Failures: 0, Errors: 0, Skipped: 0, Time elapsed: 8.097 sec - in org.apache.hadoop.hdfs.server.namenode.snapshot.TestXAttrWithSnapshot
Running org.apache.hadoop.hdfs.server.namenode.snapshot.TestAclWithSnapshot
Tests run: 16, Failures: 0, Errors: 0, Skipped: 0, Time elapsed: 11.85 sec - in org.apache.hadoop.hdfs.server.namenode.snapshot.TestAclWithSnapshot
Running org.apache.hadoop.hdfs.server.namenode.snapshot.TestCheckpointsWithSnapshots
Tests run: 1, Failures: 0, Errors: 0, Skipped: 0, Time elapsed: 5.665 sec - in org.apache.hadoop.hdfs.server.namenode.snapshot.TestCheckpointsWithSnapshots
Running org.apache.hadoop.hdfs.server.namenode.snapshot.TestSnapshotBlocksMap
Tests run: 7, Failures: 0, Errors: 0, Skipped: 0, Time elapsed: 25.2 sec - in org.apache.hadoop.hdfs.server.namenode.snapshot.TestSnapshotBlocksMap
Running org.apache.hadoop.hdfs.server.namenode.snapshot.TestSnapshotRename
Tests run: 6, Failures: 0, Errors: 0, Skipped: 0, Time elapsed: 11.828 sec - in org.apache.hadoop.hdfs.server.namenode.snapshot.TestSnapshotRename
Running org.apache.hadoop.hdfs.server.namenode.snapshot.TestFileContextSnapshot
Tests run: 2, Failures: 0, Errors: 0, Skipped: 0, Time elapsed: 6.665 sec - in org.apache.hadoop.hdfs.server.namenode.snapshot.TestFileContextSnapshot
Running org.apache.hadoop.hdfs.server.namenode.snapshot.TestRenameWithSnapshots
Tests run: 36, Failures: 0, Errors: 0, Skipped: 0, Time elapsed: 108.234 sec - in org.apache.hadoop.hdfs.server.namenode.snapshot.TestRenameWithSnapshots
Running org.apache.hadoop.hdfs.server.namenode.snapshot.TestINodeFileUnderConstructionWithSnapshot
Tests run: 4, Failures: 0, Errors: 0, Skipped: 0, Time elapsed: 10.462 sec - in org.apache.hadoop.hdfs.server.namenode.snapshot.TestINodeFileUnderConstructionWithSnapshot
Running org.apache.hadoop.hdfs.server.namenode.TestQuotaWithStripedBlocks
Tests run: 1, Failures: 0, Errors: 0, Skipped: 0, Time elapsed: 6.221 sec - in org.apache.hadoop.hdfs.server.namenode.TestQuotaWithStripedBlocks
Running org.apache.hadoop.hdfs.server.namenode.TestFavoredNodesEndToEnd
Tests run: 4, Failures: 0, Errors: 0, Skipped: 0, Time elapsed: 8.451 sec - in org.apache.hadoop.hdfs.server.namenode.TestFavoredNodesEndToEnd
Running org.apache.hadoop.hdfs.server.namenode.TestCacheDirectives
Tests run: 13, Failures: 0, Errors: 0, Skipped: 0, Time elapsed: 87.536 sec - in org.apache.hadoop.hdfs.server.namenode.TestCacheDirectives
Running org.apache.hadoop.hdfs.server.namenode.TestAuditLogAtDebug
Tests run: 6, Failures: 0, Errors: 0, Skipped: 0, Time elapsed: 1.291 sec - in org.apache.hadoop.hdfs.server.namenode.TestAuditLogAtDebug
Running org.apache.hadoop.hdfs.server.namenode.TestFileContextXAttr
Tests run: 12, Failures: 0, Errors: 0, Skipped: 0, Time elapsed: 11.625 sec - in org.apache.hadoop.hdfs.server.namenode.TestFileContextXAttr
Running org.apache.hadoop.hdfs.server.namenode.TestSnapshotPathINodes
Tests run: 6, Failures: 0, Errors: 0, Skipped: 0, Time elapsed: 6.107 sec - in org.apache.hadoop.hdfs.server.namenode.TestSnapshotPathINodes
Running org.apache.hadoop.hdfs.server.namenode.top.window.TestRollingWindowManager
Tests run: 1, Failures: 0, Errors: 0, Skipped: 0, Time elapsed: 0.622 sec - in org.apache.hadoop.hdfs.server.namenode.top.window.TestRollingWindowManager
Running org.apache.hadoop.hdfs.server.namenode.top.window.TestRollingWindow
Tests run: 2, Failures: 0, Errors: 0, Skipped: 0, Time elapsed: 0.211 sec - in org.apache.hadoop.hdfs.server.namenode.top.window.TestRollingWindow
Running org.apache.hadoop.hdfs.server.namenode.TestStripedINodeFile
Tests run: 10, Failures: 0, Errors: 0, Skipped: 0, Time elapsed: 7.665 sec - in org.apache.hadoop.hdfs.server.namenode.TestStripedINodeFile
Running org.apache.hadoop.hdfs.server.namenode.TestSecurityTokenEditLog
Tests run: 2, Failures: 0, Errors: 0, Skipped: 0, Time elapsed: 17.311 sec - in org.apache.hadoop.hdfs.server.namenode.TestSecurityTokenEditLog
Running org.apache.hadoop.hdfs.server.namenode.TestFSEditLogLoader
Tests run: 11, Failures: 0, Errors: 0, Skipped: 0, Time elapsed: 39.484 sec - in org.apache.hadoop.hdfs.server.namenode.TestFSEditLogLoader
Running org.apache.hadoop.hdfs.server.namenode.TestRecoverStripedBlocks
Tests run: 4, Failures: 0, Errors: 0, Skipped: 0, Time elapsed: 16.969 sec - in org.apache.hadoop.hdfs.server.namenode.TestRecoverStripedBlocks
Running org.apache.hadoop.hdfs.server.namenode.TestEditLog
Tests run: 24, Failures: 0, Errors: 0, Skipped: 0, Time elapsed: 75.217 sec - in org.apache.hadoop.hdfs.server.namenode.TestEditLog
Running org.apache.hadoop.hdfs.server.namenode.TestFileContextAcl
Tests run: 64, Failures: 0, Errors: 0, Skipped: 0, Time elapsed: 23.671 sec - in org.apache.hadoop.hdfs.server.namenode.TestFileContextAcl
Running org.apache.hadoop.hdfs.server.namenode.TestFSPermissionChecker
Tests run: 15, Failures: 0, Errors: 0, Skipped: 0, Time elapsed: 2.144 sec - in org.apache.hadoop.hdfs.server.namenode.TestFSPermissionChecker
Running org.apache.hadoop.hdfs.server.namenode.TestNamenodeCapacityReport
Tests run: 2, Failures: 0, Errors: 0, Skipped: 0, Time elapsed: 16.415 sec - in org.apache.hadoop.hdfs.server.namenode.TestNamenodeCapacityReport
Running org.apache.hadoop.hdfs.server.namenode.TestDeduplicationMap
Tests run: 1, Failures: 0, Errors: 0, Skipped: 0, Time elapsed: 0.094 sec - in org.apache.hadoop.hdfs.server.namenode.TestDeduplicationMap
Running org.apache.hadoop.hdfs.server.namenode.TestStartup
Tests run: 10, Failures: 0, Errors: 0, Skipped: 0, Time elapsed: 26.946 sec - in org.apache.hadoop.hdfs.server.namenode.TestStartup
Running org.apache.hadoop.hdfs.server.namenode.TestSecondaryWebUi
Tests run: 1, Failures: 0, Errors: 0, Skipped: 0, Time elapsed: 4.447 sec - in org.apache.hadoop.hdfs.server.namenode.TestSecondaryWebUi
Running org.apache.hadoop.hdfs.server.namenode.TestNameNodeXAttr
Tests run: 13, Failures: 0, Errors: 0, Skipped: 0, Time elapsed: 12.89 sec - in org.apache.hadoop.hdfs.server.namenode.TestNameNodeXAttr
Running org.apache.hadoop.hdfs.server.namenode.ha.TestPendingCorruptDnMessages
Tests run: 1, Failures: 0, Errors: 0, Skipped: 0, Time elapsed: 14.552 sec - in org.apache.hadoop.hdfs.server.namenode.ha.TestPendingCorruptDnMessages
Running org.apache.hadoop.hdfs.server.namenode.ha.TestDNFencing
Tests run: 6, Failures: 0, Errors: 0, Skipped: 0, Time elapsed: 42.913 sec - in org.apache.hadoop.hdfs.server.namenode.ha.TestDNFencing
Running org.apache.hadoop.hdfs.server.namenode.ha.TestRemoteNameNodeInfo
Tests run: 1, Failures: 0, Errors: 0, Skipped: 0, Time elapsed: 0.844 sec - in org.apache.hadoop.hdfs.server.namenode.ha.TestRemoteNameNodeInfo
Running org.apache.hadoop.hdfs.server.namenode.ha.TestXAttrsWithHA
Tests run: 1, Failures: 0, Errors: 0, Skipped: 0, Time elapsed: 6.032 sec - in org.apache.hadoop.hdfs.server.namenode.ha.TestXAttrsWithHA
Running org.apache.hadoop.hdfs.server.namenode.ha.TestGetGroupsWithHA
Tests run: 6, Failures: 0, Errors: 0, Skipped: 0, Time elapsed: 7.207 sec - in org.apache.hadoop.hdfs.server.namenode.ha.TestGetGroupsWithHA
Running org.apache.hadoop.hdfs.server.namenode.ha.TestLossyRetryInvocationHandler
Tests run: 1, Failures: 0, Errors: 0, Skipped: 0, Time elapsed: 4.369 sec - in org.apache.hadoop.hdfs.server.namenode.ha.TestLossyRetryInvocationHandler
Running org.apache.hadoop.hdfs.server.namenode.ha.TestDNFencingWithReplication
Tests run: 1, Failures: 0, Errors: 0, Skipped: 0, Time elapsed: 71.847 sec - in org.apache.hadoop.hdfs.server.namenode.ha.TestDNFencingWithReplication
Running org.apache.hadoop.hdfs.server.namenode.ha.TestHarFileSystemWithHA
Tests run: 1, Failures: 0, Errors: 0, Skipped: 0, Time elapsed: 5.68 sec - in org.apache.hadoop.hdfs.server.namenode.ha.TestHarFileSystemWithHA
Running org.apache.hadoop.hdfs.server.namenode.ha.TestFailoverWithBlockTokensEnabled
Tests run: 4, Failures: 0, Errors: 0, Skipped: 0, Time elapsed: 21.049 sec - in org.apache.hadoop.hdfs.server.namenode.ha.TestFailoverWithBlockTokensEnabled
Running org.apache.hadoop.hdfs.server.namenode.ha.TestHAConfiguration
Tests run: 4, Failures: 0, Errors: 0, Skipped: 0, Time elapsed: 1.541 sec - in org.apache.hadoop.hdfs.server.namenode.ha.TestHAConfiguration
Running org.apache.hadoop.hdfs.server.namenode.ha.TestHASafeMode
Tests run: 18, Failures: 0, Errors: 0, Skipped: 0, Time elapsed: 73.525 sec - in org.apache.hadoop.hdfs.server.namenode.ha.TestHASafeMode
Running org.apache.hadoop.hdfs.server.namenode.ha.TestDelegationTokensWithHA
Tests run: 6, Failures: 0, Errors: 0, Skipped: 0, Time elapsed: 8.694 sec - in org.apache.hadoop.hdfs.server.namenode.ha.TestDelegationTokensWithHA
Running org.apache.hadoop.hdfs.server.namenode.ha.TestFailureToReadEdits
Tests run: 6, Failures: 0, Errors: 0, Skipped: 0, Time elapsed: 85.461 sec - in org.apache.hadoop.hdfs.server.namenode.ha.TestFailureToReadEdits
Running org.apache.hadoop.hdfs.server.namenode.ha.TestFailureOfSharedDir
Tests run: 4, Failures: 0, Errors: 0, Skipped: 0, Time elapsed: 8.653 sec - in org.apache.hadoop.hdfs.server.namenode.ha.TestFailureOfSharedDir
Running org.apache.hadoop.hdfs.server.namenode.ha.TestHAMetrics
Tests run: 2, Failures: 0, Errors: 0, Skipped: 0, Time elapsed: 15.106 sec - in org.apache.hadoop.hdfs.server.namenode.ha.TestHAMetrics
Running org.apache.hadoop.hdfs.server.namenode.ha.TestHAStateTransitions
Tests run: 11, Failures: 0, Errors: 0, Skipped: 0, Time elapsed: 67.268 sec - in org.apache.hadoop.hdfs.server.namenode.ha.TestHAStateTransitions
Running org.apache.hadoop.hdfs.server.namenode.ha.TestStandbyBlockManagement
Tests run: 1, Failures: 0, Errors: 0, Skipped: 0, Time elapsed: 7.939 sec - in org.apache.hadoop.hdfs.server.namenode.ha.TestStandbyBlockManagement
Running org.apache.hadoop.hdfs.server.namenode.ha.TestDFSUpgradeWithHA
Tests run: 9, Failures: 0, Errors: 0, Skipped: 0, Time elapsed: 19.491 sec - in org.apache.hadoop.hdfs.server.namenode.ha.TestDFSUpgradeWithHA
Running org.apache.hadoop.hdfs.server.namenode.ha.TestBootstrapStandbyWithQJM
Tests run: 5, Failures: 0, Errors: 0, Skipped: 0, Time elapsed: 16.051 sec - in org.apache.hadoop.hdfs.server.namenode.ha.TestBootstrapStandbyWithQJM
Running org.apache.hadoop.hdfs.server.namenode.ha.TestInitializeSharedEdits
Tests run: 4, Failures: 0, Errors: 0, Skipped: 0, Time elapsed: 12.183 sec - in org.apache.hadoop.hdfs.server.namenode.ha.TestInitializeSharedEdits
Running org.apache.hadoop.hdfs.server.namenode.ha.TestBootstrapStandby
Tests run: 6, Failures: 0, Errors: 0, Skipped: 0, Time elapsed: 18.895 sec - in org.apache.hadoop.hdfs.server.namenode.ha.TestBootstrapStandby
Running org.apache.hadoop.hdfs.server.namenode.ha.TestStateTransitionFailure
Tests run: 1, Failures: 0, Errors: 0, Skipped: 0, Time elapsed: 4.823 sec - in org.apache.hadoop.hdfs.server.namenode.ha.TestStateTransitionFailure
Running org.apache.hadoop.hdfs.server.namenode.ha.TestPipelinesFailover
Tests run: 8, Failures: 0, Errors: 0, Skipped: 0, Time elapsed: 95.475 sec - in org.apache.hadoop.hdfs.server.namenode.ha.TestPipelinesFailover
Running org.apache.hadoop.hdfs.server.namenode.ha.TestSeveralNameNodes

Results :

Failed tests: 
  TestBlockManager.testBlockReportQueueing:984 null

Tests run: 1432, Failures: 1, Errors: 0, Skipped: 2

[INFO]                                                                         
[INFO] ------------------------------------------------------------------------
[INFO] Skipping Apache Hadoop HDFS Native Client
[INFO] This project has been banned from the build due to previous failures.
[INFO] ------------------------------------------------------------------------
[INFO]                                                                         
[INFO] ------------------------------------------------------------------------
[INFO] Skipping Apache Hadoop HttpFS
[INFO] This project has been banned from the build due to previous failures.
[INFO] ------------------------------------------------------------------------
[INFO]                                                                         
[INFO] ------------------------------------------------------------------------
[INFO] Skipping Apache Hadoop HDFS BookKeeper Journal
[INFO] This project has been banned from the build due to previous failures.
[INFO] ------------------------------------------------------------------------
[INFO]                                                                         
[INFO] ------------------------------------------------------------------------
[INFO] Skipping Apache Hadoop HDFS-NFS
[INFO] This project has been banned from the build due to previous failures.
[INFO] ------------------------------------------------------------------------
[INFO]                                                                         
[INFO] ------------------------------------------------------------------------
[INFO] Building Apache Hadoop HDFS Project 3.0.0-SNAPSHOT
[INFO] ------------------------------------------------------------------------
[INFO] 
[INFO] --- maven-clean-plugin:2.5:clean (default-clean) @ hadoop-hdfs-project ---
[INFO] Deleting <https://builds.apache.org/job/Hadoop-Hdfs-trunk/ws/hadoop-hdfs-project/target>
[INFO] 
[INFO] --- maven-antrun-plugin:1.7:run (create-testdirs) @ hadoop-hdfs-project ---
[INFO] Executing tasks

main:
    [mkdir] Created dir: <https://builds.apache.org/job/Hadoop-Hdfs-trunk/ws/hadoop-hdfs-project/target/test-dir>
[INFO] Executed tasks
[INFO] 
[INFO] --- maven-source-plugin:2.3:jar-no-fork (hadoop-java-sources) @ hadoop-hdfs-project
---
[INFO] 
[INFO] --- maven-source-plugin:2.3:test-jar-no-fork (hadoop-java-sources) @ hadoop-hdfs-project
---
[INFO] 
[INFO] --- maven-enforcer-plugin:1.3.1:enforce (dist-enforce) @ hadoop-hdfs-project ---
[INFO] 
[INFO] --- maven-site-plugin:3.4:attach-descriptor (attach-descriptor) @ hadoop-hdfs-project
---
[INFO] 
[INFO] --- maven-javadoc-plugin:2.8.1:jar (module-javadocs) @ hadoop-hdfs-project ---
[INFO] Skipping javadoc generation
[INFO] 
[INFO] --- maven-enforcer-plugin:1.3.1:enforce (depcheck) @ hadoop-hdfs-project ---
[INFO] 
[INFO] --- maven-checkstyle-plugin:2.15:checkstyle (default-cli) @ hadoop-hdfs-project ---
[INFO] 
[INFO] --- findbugs-maven-plugin:3.0.0:findbugs (default-cli) @ hadoop-hdfs-project ---
[INFO] ------------------------------------------------------------------------
[INFO] Reactor Summary:
[INFO] 
[INFO] Apache Hadoop HDFS Client ......................... SUCCESS [04:25 min]
[INFO] Apache Hadoop HDFS ................................ FAILURE [  01:22 h]
[INFO] Apache Hadoop HDFS Native Client .................. SKIPPED
[INFO] Apache Hadoop HttpFS .............................. SKIPPED
[INFO] Apache Hadoop HDFS BookKeeper Journal ............. SKIPPED
[INFO] Apache Hadoop HDFS-NFS ............................ SKIPPED
[INFO] Apache Hadoop HDFS Project ........................ SUCCESS [  0.108 s]
[INFO] ------------------------------------------------------------------------
[INFO] BUILD FAILURE
[INFO] ------------------------------------------------------------------------
[INFO] Total time: 01:26 h
[INFO] Finished at: 2016-01-22T07:56:57+00:00
[INFO] Final Memory: 66M/1087M
[INFO] ------------------------------------------------------------------------
[ERROR] Failed to execute goal org.apache.maven.plugins:maven-surefire-plugin:2.17:test (default-test)
on project hadoop-hdfs: ExecutionException: java.lang.RuntimeException: The forked VM terminated
without properly saying goodbye. VM crash or System.exit called?
[ERROR] Command was /bin/sh -c cd <https://builds.apache.org/job/Hadoop-Hdfs-trunk/ws/hadoop-hdfs-project/hadoop-hdfs>
&& /home/jenkins/tools/java/jdk1.7.0_55/jre/bin/java -Xmx2048m -XX:MaxPermSize=768m
-XX:+HeapDumpOnOutOfMemoryError -jar <https://builds.apache.org/job/Hadoop-Hdfs-trunk/ws/hadoop-hdfs-project/hadoop-hdfs/target/surefire/surefirebooter4644065037826641042.jar>
<https://builds.apache.org/job/Hadoop-Hdfs-trunk/ws/hadoop-hdfs-project/hadoop-hdfs/target/surefire/surefire7026321519097205677tmp>
<https://builds.apache.org/job/Hadoop-Hdfs-trunk/ws/hadoop-hdfs-project/hadoop-hdfs/target/surefire/surefire_948782312194116107047tmp>
[ERROR] -> [Help 1]
[ERROR] 
[ERROR] To see the full stack trace of the errors, re-run Maven with the -e switch.
[ERROR] Re-run Maven using the -X switch to enable full debug logging.
[ERROR] 
[ERROR] For more information about the errors and possible solutions, please read the following
articles:
[ERROR] [Help 1] http://cwiki.apache.org/confluence/display/MAVEN/MojoFailureException
[ERROR] 
[ERROR] After correcting the problems, you can resume the build with the command
[ERROR]   mvn <goals> -rf :hadoop-hdfs
Build step 'Execute shell' marked build as failure
Archiving artifacts
Recording test results

Mime
View raw message