hadoop-hdfs-dev mailing list archives

Site index · List index
Message view « Date » · « Thread »
Top « Date » · « Thread »
From Apache Jenkins Server <jenk...@builds.apache.org>
Subject Hadoop-Hdfs-trunk - Build # 2718 - Still Failing
Date Tue, 12 Jan 2016 13:27:44 GMT
See https://builds.apache.org/job/Hadoop-Hdfs-trunk/2718/

###################################################################################
########################## LAST 60 LINES OF THE CONSOLE ###########################
[...truncated 6446 lines...]
[INFO] --- maven-antrun-plugin:1.7:run (create-testdirs) @ hadoop-hdfs-project ---
[INFO] Executing tasks

main:
    [mkdir] Created dir: /home/jenkins/jenkins-slave/workspace/Hadoop-Hdfs-trunk/hadoop-hdfs-project/target/test-dir
[INFO] Executed tasks
[INFO] 
[INFO] --- maven-source-plugin:2.3:jar-no-fork (hadoop-java-sources) @ hadoop-hdfs-project
---
[INFO] 
[INFO] --- maven-source-plugin:2.3:test-jar-no-fork (hadoop-java-sources) @ hadoop-hdfs-project
---
[INFO] 
[INFO] --- maven-enforcer-plugin:1.3.1:enforce (dist-enforce) @ hadoop-hdfs-project ---
[INFO] 
[INFO] --- maven-site-plugin:3.4:attach-descriptor (attach-descriptor) @ hadoop-hdfs-project
---
[INFO] 
[INFO] --- maven-javadoc-plugin:2.8.1:jar (module-javadocs) @ hadoop-hdfs-project ---
[INFO] Skipping javadoc generation
[INFO] 
[INFO] --- maven-enforcer-plugin:1.3.1:enforce (depcheck) @ hadoop-hdfs-project ---
[INFO] 
[INFO] --- maven-checkstyle-plugin:2.15:checkstyle (default-cli) @ hadoop-hdfs-project ---
[INFO] 
[INFO] --- findbugs-maven-plugin:3.0.0:findbugs (default-cli) @ hadoop-hdfs-project ---
[INFO] ------------------------------------------------------------------------
[INFO] Reactor Summary:
[INFO] 
[INFO] Apache Hadoop HDFS Client ......................... SUCCESS [04:27 min]
[INFO] Apache Hadoop HDFS ................................ FAILURE [  03:13 h]
[INFO] Apache Hadoop HDFS Native Client .................. SKIPPED
[INFO] Apache Hadoop HttpFS .............................. SKIPPED
[INFO] Apache Hadoop HDFS BookKeeper Journal ............. SKIPPED
[INFO] Apache Hadoop HDFS-NFS ............................ SKIPPED
[INFO] Apache Hadoop HDFS Project ........................ SUCCESS [  0.058 s]
[INFO] ------------------------------------------------------------------------
[INFO] BUILD FAILURE
[INFO] ------------------------------------------------------------------------
[INFO] Total time: 03:18 h
[INFO] Finished at: 2016-01-12T13:27:33+00:00
[INFO] Final Memory: 55M/719M
[INFO] ------------------------------------------------------------------------
[ERROR] Failed to execute goal org.apache.maven.plugins:maven-surefire-plugin:2.17:test (default-test)
on project hadoop-hdfs: There are test failures.
[ERROR] 
[ERROR] Please refer to /home/jenkins/jenkins-slave/workspace/Hadoop-Hdfs-trunk/hadoop-hdfs-project/hadoop-hdfs/target/surefire-reports
for the individual test results.
[ERROR] -> [Help 1]
[ERROR] 
[ERROR] To see the full stack trace of the errors, re-run Maven with the -e switch.
[ERROR] Re-run Maven using the -X switch to enable full debug logging.
[ERROR] 
[ERROR] For more information about the errors and possible solutions, please read the following
articles:
[ERROR] [Help 1] http://cwiki.apache.org/confluence/display/MAVEN/MojoFailureException
[ERROR] 
[ERROR] After correcting the problems, you can resume the build with the command
[ERROR]   mvn <goals> -rf :hadoop-hdfs
Build step 'Execute shell' marked build as failure
Archiving artifacts
Recording test results
Sending e-mails to: hdfs-dev@hadoop.apache.org
Email was triggered for: Failure - Any
Sending email for trigger: Failure - Any



###################################################################################
############################## FAILED TESTS (if any) ##############################
3 tests failed.
FAILED:  org.apache.hadoop.hdfs.server.balancer.TestBalancer.testManyBalancerSimultaneously

Error Message:
org/apache/hadoop/ipc/ProtobufHelper

Stack Trace:
java.lang.NoClassDefFoundError: org/apache/hadoop/ipc/ProtobufHelper
	at java.net.URLClassLoader$1.run(URLClassLoader.java:366)
	at java.net.URLClassLoader$1.run(URLClassLoader.java:355)
	at java.security.AccessController.doPrivileged(Native Method)
	at java.net.URLClassLoader.findClass(URLClassLoader.java:354)
	at java.lang.ClassLoader.loadClass(ClassLoader.java:425)
	at sun.misc.Launcher$AppClassLoader.loadClass(Launcher.java:308)
	at java.lang.ClassLoader.loadClass(ClassLoader.java:358)
	at org.apache.hadoop.hdfs.protocolPB.ClientNamenodeProtocolTranslatorPB.append(ClientNamenodeProtocolTranslatorPB.java:329)
	at sun.reflect.NativeMethodAccessorImpl.invoke0(Native Method)
	at sun.reflect.NativeMethodAccessorImpl.invoke(NativeMethodAccessorImpl.java:57)
	at sun.reflect.DelegatingMethodAccessorImpl.invoke(DelegatingMethodAccessorImpl.java:43)
	at java.lang.reflect.Method.invoke(Method.java:606)
	at org.apache.hadoop.io.retry.RetryInvocationHandler.invokeMethod(RetryInvocationHandler.java:255)
	at org.apache.hadoop.io.retry.RetryInvocationHandler.invoke(RetryInvocationHandler.java:103)
	at com.sun.proxy.$Proxy21.append(Unknown Source)
	at org.apache.hadoop.hdfs.DFSClient.callAppend(DFSClient.java:1297)
	at org.apache.hadoop.hdfs.DFSClient.append(DFSClient.java:1366)
	at org.apache.hadoop.hdfs.DFSClient.append(DFSClient.java:1336)
	at org.apache.hadoop.hdfs.DistributedFileSystem$4.doCall(DistributedFileSystem.java:307)
	at org.apache.hadoop.hdfs.DistributedFileSystem$4.doCall(DistributedFileSystem.java:303)
	at org.apache.hadoop.fs.FileSystemLinkResolver.resolve(FileSystemLinkResolver.java:81)
	at org.apache.hadoop.hdfs.DistributedFileSystem.append(DistributedFileSystem.java:303)
	at org.apache.hadoop.hdfs.DistributedFileSystem.append(DistributedFileSystem.java:285)
	at org.apache.hadoop.fs.FileSystem.append(FileSystem.java:1172)
	at org.apache.hadoop.hdfs.server.balancer.NameNodeConnector.checkAndMarkRunning(NameNodeConnector.java:241)
	at org.apache.hadoop.hdfs.server.balancer.NameNodeConnector.<init>(NameNodeConnector.java:142)
	at org.apache.hadoop.hdfs.server.balancer.NameNodeConnector.newNameNodeConnectors(NameNodeConnector.java:75)
	at org.apache.hadoop.hdfs.server.balancer.Balancer.run(Balancer.java:654)
	at org.apache.hadoop.hdfs.server.balancer.Balancer$Cli.run(Balancer.java:730)
	at org.apache.hadoop.hdfs.server.balancer.TestBalancer.testManyBalancerSimultaneously(TestBalancer.java:1657)


FAILED:  org.apache.hadoop.hdfs.server.balancer.TestBalancer.testBalancerWithStripedFile

Error Message:
org/apache/hadoop/io/erasurecode/CodecUtil

Stack Trace:
java.lang.NoClassDefFoundError: org/apache/hadoop/io/erasurecode/CodecUtil
	at java.net.URLClassLoader$1.run(URLClassLoader.java:366)
	at java.net.URLClassLoader$1.run(URLClassLoader.java:355)
	at java.security.AccessController.doPrivileged(Native Method)
	at java.net.URLClassLoader.findClass(URLClassLoader.java:354)
	at java.lang.ClassLoader.loadClass(ClassLoader.java:425)
	at sun.misc.Launcher$AppClassLoader.loadClass(Launcher.java:308)
	at java.lang.ClassLoader.loadClass(ClassLoader.java:358)
	at org.apache.hadoop.hdfs.DFSStripedOutputStream.<init>(DFSStripedOutputStream.java:277)
	at org.apache.hadoop.hdfs.DFSOutputStream.newStreamForCreate(DFSOutputStream.java:276)
	at org.apache.hadoop.hdfs.DFSClient.create(DFSClient.java:1191)
	at org.apache.hadoop.hdfs.DFSClient.create(DFSClient.java:1133)
	at org.apache.hadoop.hdfs.DistributedFileSystem$7.doCall(DistributedFileSystem.java:414)
	at org.apache.hadoop.hdfs.DistributedFileSystem$7.doCall(DistributedFileSystem.java:411)
	at org.apache.hadoop.fs.FileSystemLinkResolver.resolve(FileSystemLinkResolver.java:81)
	at org.apache.hadoop.hdfs.DistributedFileSystem.create(DistributedFileSystem.java:411)
	at org.apache.hadoop.fs.FileSystem.create(FileSystem.java:968)
	at org.apache.hadoop.hdfs.DFSTestUtil.createFile(DFSTestUtil.java:397)
	at org.apache.hadoop.hdfs.DFSTestUtil.createFile(DFSTestUtil.java:376)
	at org.apache.hadoop.hdfs.DFSTestUtil.createFile(DFSTestUtil.java:369)
	at org.apache.hadoop.hdfs.DFSTestUtil.createFile(DFSTestUtil.java:362)
	at org.apache.hadoop.hdfs.server.balancer.TestBalancer.doTestBalancerWithStripedFile(TestBalancer.java:1821)
	at org.apache.hadoop.hdfs.server.balancer.TestBalancer.testBalancerWithStripedFile(TestBalancer.java:1788)


FAILED:  org.apache.hadoop.hdfs.server.balancer.TestBalancer.testBalancerDuringUpgrade

Error Message:
expected:<0> but was:<-3>

Stack Trace:
java.lang.AssertionError: expected:<0> but was:<-3>
	at org.junit.Assert.fail(Assert.java:88)
	at org.junit.Assert.failNotEquals(Assert.java:743)
	at org.junit.Assert.assertEquals(Assert.java:118)
	at org.junit.Assert.assertEquals(Assert.java:555)
	at org.junit.Assert.assertEquals(Assert.java:542)
	at org.apache.hadoop.hdfs.server.balancer.TestBalancer.testBalancerDuringUpgrade(TestBalancer.java:1531)



Mime
  • Unnamed multipart/mixed (inline, None, 0 bytes)
View raw message