hadoop-hdfs-dev mailing list archives

Site index · List index
Message view « Date » · « Thread »
Top « Date » · « Thread »
From Apache Jenkins Server <jenk...@builds.apache.org>
Subject Build failed in Jenkins: Hadoop-Hdfs-trunk #2701
Date Thu, 07 Jan 2016 16:18:14 GMT
See <https://builds.apache.org/job/Hadoop-Hdfs-trunk/2701/changes>

Changes:

[stevel] YARN-4550. Some tests in TestContainerLanch fails on non-english locale

[stevel] HADOOP-12675. Fix description about retention period in usage of expunge

------------------------------------------
[...truncated 5505 lines...]
Tests run: 8, Failures: 0, Errors: 0, Skipped: 0, Time elapsed: 29.199 sec - in org.apache.hadoop.hdfs.server.datanode.fsdataset.impl.TestScrLazyPersistFiles
Running org.apache.hadoop.hdfs.server.datanode.fsdataset.impl.TestWriteToReplica
Tests run: 5, Failures: 0, Errors: 0, Skipped: 0, Time elapsed: 11.553 sec - in org.apache.hadoop.hdfs.server.datanode.fsdataset.impl.TestWriteToReplica
Running org.apache.hadoop.hdfs.server.datanode.fsdataset.impl.TestFsDatasetImpl
Tests run: 7, Failures: 0, Errors: 0, Skipped: 0, Time elapsed: 7.756 sec - in org.apache.hadoop.hdfs.server.datanode.fsdataset.impl.TestFsDatasetImpl
Running org.apache.hadoop.hdfs.server.datanode.fsdataset.impl.TestInterDatanodeProtocol
Tests run: 5, Failures: 0, Errors: 0, Skipped: 0, Time elapsed: 10.42 sec - in org.apache.hadoop.hdfs.server.datanode.fsdataset.impl.TestInterDatanodeProtocol
Running org.apache.hadoop.hdfs.server.datanode.fsdataset.impl.TestLazyPersistPolicy
Tests run: 4, Failures: 0, Errors: 0, Skipped: 0, Time elapsed: 14.277 sec - in org.apache.hadoop.hdfs.server.datanode.fsdataset.impl.TestLazyPersistPolicy
Running org.apache.hadoop.hdfs.server.datanode.fsdataset.impl.TestDatanodeRestart
Tests run: 1, Failures: 0, Errors: 0, Skipped: 0, Time elapsed: 6.824 sec - in org.apache.hadoop.hdfs.server.datanode.fsdataset.impl.TestDatanodeRestart
Running org.apache.hadoop.hdfs.server.datanode.fsdataset.impl.TestReplicaMap
Tests run: 3, Failures: 0, Errors: 0, Skipped: 0, Time elapsed: 0.096 sec - in org.apache.hadoop.hdfs.server.datanode.fsdataset.impl.TestReplicaMap
Running org.apache.hadoop.hdfs.server.datanode.fsdataset.impl.TestSpaceReservation
Tests run: 8, Failures: 0, Errors: 0, Skipped: 0, Time elapsed: 85.299 sec - in org.apache.hadoop.hdfs.server.datanode.fsdataset.impl.TestSpaceReservation
Running org.apache.hadoop.hdfs.server.datanode.fsdataset.impl.TestLazyPersistReplicaRecovery
Tests run: 2, Failures: 0, Errors: 0, Skipped: 0, Time elapsed: 20.95 sec - in org.apache.hadoop.hdfs.server.datanode.fsdataset.impl.TestLazyPersistReplicaRecovery
Running org.apache.hadoop.hdfs.server.datanode.fsdataset.impl.TestLazyPersistFiles
Tests run: 7, Failures: 0, Errors: 0, Skipped: 0, Time elapsed: 118.153 sec - in org.apache.hadoop.hdfs.server.datanode.fsdataset.impl.TestLazyPersistFiles
Running org.apache.hadoop.hdfs.server.datanode.fsdataset.impl.TestLazyPersistReplicaPlacement
Tests run: 7, Failures: 0, Errors: 0, Skipped: 0, Time elapsed: 32.733 sec - in org.apache.hadoop.hdfs.server.datanode.fsdataset.impl.TestLazyPersistReplicaPlacement
Running org.apache.hadoop.hdfs.server.datanode.fsdataset.impl.TestLazyPersistLockedMemory
Tests run: 6, Failures: 0, Errors: 0, Skipped: 0, Time elapsed: 23.033 sec - in org.apache.hadoop.hdfs.server.datanode.fsdataset.impl.TestLazyPersistLockedMemory
Running org.apache.hadoop.hdfs.server.datanode.TestHSync
Tests run: 5, Failures: 0, Errors: 0, Skipped: 0, Time elapsed: 13.578 sec - in org.apache.hadoop.hdfs.server.datanode.TestHSync
Running org.apache.hadoop.hdfs.server.datanode.TestDataNodeMXBean
Tests run: 1, Failures: 0, Errors: 0, Skipped: 0, Time elapsed: 4.833 sec - in org.apache.hadoop.hdfs.server.datanode.TestDataNodeMXBean
Running org.apache.hadoop.hdfs.server.datanode.TestDirectoryScanner
Tests run: 5, Failures: 0, Errors: 0, Skipped: 0, Time elapsed: 126.276 sec - in org.apache.hadoop.hdfs.server.datanode.TestDirectoryScanner
Running org.apache.hadoop.hdfs.server.datanode.TestDataNodeUUID
Tests run: 1, Failures: 0, Errors: 0, Skipped: 0, Time elapsed: 1.905 sec - in org.apache.hadoop.hdfs.server.datanode.TestDataNodeUUID
Running org.apache.hadoop.hdfs.server.datanode.TestDataNodeExit
Tests run: 2, Failures: 0, Errors: 0, Skipped: 0, Time elapsed: 11.008 sec - in org.apache.hadoop.hdfs.server.datanode.TestDataNodeExit
Running org.apache.hadoop.hdfs.server.datanode.TestFsDatasetCacheRevocation
Tests run: 2, Failures: 0, Errors: 0, Skipped: 0, Time elapsed: 12.426 sec - in org.apache.hadoop.hdfs.server.datanode.TestFsDatasetCacheRevocation
Running org.apache.hadoop.hdfs.server.datanode.TestDataXceiverLazyPersistHint
Tests run: 3, Failures: 0, Errors: 0, Skipped: 0, Time elapsed: 1.307 sec - in org.apache.hadoop.hdfs.server.datanode.TestDataXceiverLazyPersistHint
Running org.apache.hadoop.hdfs.server.datanode.TestDataNodeMetricsLogger
Tests run: 4, Failures: 0, Errors: 0, Skipped: 0, Time elapsed: 5.382 sec - in org.apache.hadoop.hdfs.server.datanode.TestDataNodeMetricsLogger
Running org.apache.hadoop.hdfs.server.datanode.TestDataNodeVolumeFailureReporting
Tests run: 4, Failures: 0, Errors: 0, Skipped: 0, Time elapsed: 82.159 sec - in org.apache.hadoop.hdfs.server.datanode.TestDataNodeVolumeFailureReporting
Running org.apache.hadoop.hdfs.server.datanode.TestStartSecureDataNode
Tests run: 1, Failures: 0, Errors: 0, Skipped: 1, Time elapsed: 0.095 sec - in org.apache.hadoop.hdfs.server.datanode.TestStartSecureDataNode
Running org.apache.hadoop.hdfs.server.datanode.TestDataNodeECN
Tests run: 1, Failures: 0, Errors: 0, Skipped: 0, Time elapsed: 4.725 sec - in org.apache.hadoop.hdfs.server.datanode.TestDataNodeECN
Running org.apache.hadoop.hdfs.server.datanode.TestDiskError
Tests run: 4, Failures: 0, Errors: 0, Skipped: 0, Time elapsed: 19.422 sec - in org.apache.hadoop.hdfs.server.datanode.TestDiskError
Running org.apache.hadoop.hdfs.server.blockmanagement.TestReplicationPolicyWithNodeGroup
Tests run: 17, Failures: 0, Errors: 0, Skipped: 0, Time elapsed: 12.043 sec - in org.apache.hadoop.hdfs.server.blockmanagement.TestReplicationPolicyWithNodeGroup
Running org.apache.hadoop.hdfs.server.blockmanagement.TestHostFileManager
Tests run: 3, Failures: 0, Errors: 0, Skipped: 0, Time elapsed: 1.235 sec - in org.apache.hadoop.hdfs.server.blockmanagement.TestHostFileManager
Running org.apache.hadoop.hdfs.server.blockmanagement.TestBlockManager
Tests run: 16, Failures: 0, Errors: 0, Skipped: 0, Time elapsed: 14.875 sec - in org.apache.hadoop.hdfs.server.blockmanagement.TestBlockManager
Running org.apache.hadoop.hdfs.server.blockmanagement.TestNodeCount
Tests run: 1, Failures: 0, Errors: 0, Skipped: 0, Time elapsed: 12.88 sec - in org.apache.hadoop.hdfs.server.blockmanagement.TestNodeCount
Running org.apache.hadoop.hdfs.server.blockmanagement.TestNameNodePrunesMissingStorages
Tests run: 4, Failures: 0, Errors: 0, Skipped: 0, Time elapsed: 11.608 sec - in org.apache.hadoop.hdfs.server.blockmanagement.TestNameNodePrunesMissingStorages
Running org.apache.hadoop.hdfs.server.blockmanagement.TestBlockTokenWithDFSStriped
Tests run: 4, Failures: 0, Errors: 0, Skipped: 0, Time elapsed: 34.49 sec - in org.apache.hadoop.hdfs.server.blockmanagement.TestBlockTokenWithDFSStriped
Running org.apache.hadoop.hdfs.server.blockmanagement.TestReplicationPolicy
Tests run: 62, Failures: 0, Errors: 0, Skipped: 0, Time elapsed: 47.396 sec - in org.apache.hadoop.hdfs.server.blockmanagement.TestReplicationPolicy
Running org.apache.hadoop.hdfs.server.blockmanagement.TestBlocksWithNotEnoughRacks
Tests run: 9, Failures: 0, Errors: 0, Skipped: 0, Time elapsed: 59.831 sec - in org.apache.hadoop.hdfs.server.blockmanagement.TestBlocksWithNotEnoughRacks
Running org.apache.hadoop.hdfs.server.blockmanagement.TestSequentialBlockGroupId
Tests run: 3, Failures: 0, Errors: 0, Skipped: 0, Time elapsed: 16.734 sec - in org.apache.hadoop.hdfs.server.blockmanagement.TestSequentialBlockGroupId
Running org.apache.hadoop.hdfs.server.blockmanagement.TestCorruptReplicaInfo
Tests run: 1, Failures: 0, Errors: 0, Skipped: 0, Time elapsed: 0.371 sec - in org.apache.hadoop.hdfs.server.blockmanagement.TestCorruptReplicaInfo
Running org.apache.hadoop.hdfs.server.blockmanagement.TestCachedBlocksList
Tests run: 2, Failures: 0, Errors: 0, Skipped: 0, Time elapsed: 0.353 sec - in org.apache.hadoop.hdfs.server.blockmanagement.TestCachedBlocksList
Running org.apache.hadoop.hdfs.server.blockmanagement.TestHost2NodesMap
Tests run: 3, Failures: 0, Errors: 0, Skipped: 0, Time elapsed: 0.319 sec - in org.apache.hadoop.hdfs.server.blockmanagement.TestHost2NodesMap
Running org.apache.hadoop.hdfs.server.blockmanagement.TestBlockStatsMXBean
Tests run: 3, Failures: 0, Errors: 0, Skipped: 0, Time elapsed: 26.892 sec - in org.apache.hadoop.hdfs.server.blockmanagement.TestBlockStatsMXBean
Running org.apache.hadoop.hdfs.server.blockmanagement.TestUnderReplicatedBlocks
Tests run: 2, Failures: 0, Errors: 0, Skipped: 0, Time elapsed: 23.632 sec - in org.apache.hadoop.hdfs.server.blockmanagement.TestUnderReplicatedBlocks
Running org.apache.hadoop.hdfs.server.blockmanagement.TestReplicationPolicyWithUpgradeDomain
Tests run: 6, Failures: 0, Errors: 0, Skipped: 0, Time elapsed: 5.879 sec - in org.apache.hadoop.hdfs.server.blockmanagement.TestReplicationPolicyWithUpgradeDomain
Running org.apache.hadoop.hdfs.server.blockmanagement.TestBlockInfoStriped
Tests run: 3, Failures: 0, Errors: 0, Skipped: 0, Time elapsed: 0.345 sec - in org.apache.hadoop.hdfs.server.blockmanagement.TestBlockInfoStriped
Running org.apache.hadoop.hdfs.server.blockmanagement.TestBlockInfo
Tests run: 4, Failures: 0, Errors: 0, Skipped: 0, Time elapsed: 0.485 sec - in org.apache.hadoop.hdfs.server.blockmanagement.TestBlockInfo
Running org.apache.hadoop.hdfs.server.blockmanagement.TestPendingInvalidateBlock
Tests run: 2, Failures: 0, Errors: 0, Skipped: 0, Time elapsed: 32.707 sec - in org.apache.hadoop.hdfs.server.blockmanagement.TestPendingInvalidateBlock
Running org.apache.hadoop.hdfs.server.blockmanagement.TestHeartbeatHandling
Tests run: 3, Failures: 0, Errors: 0, Skipped: 0, Time elapsed: 9.236 sec - in org.apache.hadoop.hdfs.server.blockmanagement.TestHeartbeatHandling
Running org.apache.hadoop.hdfs.server.blockmanagement.TestSequentialBlockId
Tests run: 4, Failures: 0, Errors: 0, Skipped: 0, Time elapsed: 6.981 sec - in org.apache.hadoop.hdfs.server.blockmanagement.TestSequentialBlockId
Running org.apache.hadoop.hdfs.server.blockmanagement.TestPendingReplication
Tests run: 4, Failures: 0, Errors: 0, Skipped: 0, Time elapsed: 28.409 sec - in org.apache.hadoop.hdfs.server.blockmanagement.TestPendingReplication
Running org.apache.hadoop.hdfs.server.blockmanagement.TestUnderReplicatedBlockQueues
Tests run: 2, Failures: 0, Errors: 0, Skipped: 0, Time elapsed: 0.276 sec - in org.apache.hadoop.hdfs.server.blockmanagement.TestUnderReplicatedBlockQueues
Running org.apache.hadoop.hdfs.server.blockmanagement.TestDatanodeManager
Tests run: 6, Failures: 0, Errors: 0, Skipped: 0, Time elapsed: 42.949 sec - in org.apache.hadoop.hdfs.server.blockmanagement.TestDatanodeManager
Running org.apache.hadoop.hdfs.server.blockmanagement.TestDatanodeDescriptor
Tests run: 2, Failures: 0, Errors: 0, Skipped: 0, Time elapsed: 0.304 sec - in org.apache.hadoop.hdfs.server.blockmanagement.TestDatanodeDescriptor
Running org.apache.hadoop.hdfs.server.blockmanagement.TestBlockUnderConstructionFeature
Tests run: 1, Failures: 0, Errors: 0, Skipped: 0, Time elapsed: 0.367 sec - in org.apache.hadoop.hdfs.server.blockmanagement.TestBlockUnderConstructionFeature
Running org.apache.hadoop.hdfs.server.blockmanagement.TestBlockTokenWithDFS
Tests run: 4, Failures: 0, Errors: 0, Skipped: 0, Time elapsed: 25.1 sec - in org.apache.hadoop.hdfs.server.blockmanagement.TestBlockTokenWithDFS
Running org.apache.hadoop.hdfs.server.blockmanagement.TestBlockManagerSafeMode
Tests run: 11, Failures: 0, Errors: 0, Skipped: 0, Time elapsed: 6.593 sec - in org.apache.hadoop.hdfs.server.blockmanagement.TestBlockManagerSafeMode
Running org.apache.hadoop.hdfs.server.blockmanagement.TestReplicationPolicyConsiderLoad
Tests run: 4, Failures: 0, Errors: 0, Skipped: 0, Time elapsed: 4.876 sec - in org.apache.hadoop.hdfs.server.blockmanagement.TestReplicationPolicyConsiderLoad
Running org.apache.hadoop.hdfs.server.blockmanagement.TestComputeInvalidateWork
Tests run: 3, Failures: 0, Errors: 0, Skipped: 0, Time elapsed: 11.157 sec - in org.apache.hadoop.hdfs.server.blockmanagement.TestComputeInvalidateWork
Running org.apache.hadoop.hdfs.server.blockmanagement.TestAvailableSpaceBlockPlacementPolicy
Tests run: 2, Failures: 0, Errors: 0, Skipped: 0, Time elapsed: 4.699 sec - in org.apache.hadoop.hdfs.server.blockmanagement.TestAvailableSpaceBlockPlacementPolicy
Running org.apache.hadoop.hdfs.server.blockmanagement.TestPendingDataNodeMessages
Tests run: 1, Failures: 0, Errors: 0, Skipped: 0, Time elapsed: 0.365 sec - in org.apache.hadoop.hdfs.server.blockmanagement.TestPendingDataNodeMessages
Running org.apache.hadoop.hdfs.server.blockmanagement.TestBlockReportRateLimiting
Tests run: 2, Failures: 0, Errors: 0, Skipped: 0, Time elapsed: 10.752 sec - in org.apache.hadoop.hdfs.server.blockmanagement.TestBlockReportRateLimiting
Running org.apache.hadoop.hdfs.server.blockmanagement.TestRBWBlockInvalidation
Tests run: 2, Failures: 0, Errors: 0, Skipped: 0, Time elapsed: 16.34 sec - in org.apache.hadoop.hdfs.server.blockmanagement.TestRBWBlockInvalidation
Running org.apache.hadoop.hdfs.server.blockmanagement.TestOverReplicatedBlocks
Tests run: 3, Failures: 0, Errors: 0, Skipped: 0, Time elapsed: 29.93 sec - in org.apache.hadoop.hdfs.server.blockmanagement.TestOverReplicatedBlocks
Running org.apache.hadoop.hdfs.server.common.TestGetUriFromString
Tests run: 3, Failures: 0, Errors: 0, Skipped: 0, Time elapsed: 0.231 sec - in org.apache.hadoop.hdfs.server.common.TestGetUriFromString
Running org.apache.hadoop.hdfs.server.common.TestJspHelper
Tests run: 9, Failures: 0, Errors: 0, Skipped: 0, Time elapsed: 2.173 sec - in org.apache.hadoop.hdfs.server.common.TestJspHelper
Running org.apache.hadoop.hdfs.server.namenode.TestEditsDoubleBuffer
Tests run: 2, Failures: 0, Errors: 0, Skipped: 0, Time elapsed: 0.129 sec - in org.apache.hadoop.hdfs.server.namenode.TestEditsDoubleBuffer
Running org.apache.hadoop.hdfs.server.namenode.TestFileJournalManager
Tests run: 14, Failures: 0, Errors: 0, Skipped: 0, Time elapsed: 5.28 sec - in org.apache.hadoop.hdfs.server.namenode.TestFileJournalManager
Running org.apache.hadoop.hdfs.server.namenode.TestFileContextXAttr
Tests run: 12, Failures: 0, Errors: 0, Skipped: 0, Time elapsed: 15.155 sec - in org.apache.hadoop.hdfs.server.namenode.TestFileContextXAttr
Running org.apache.hadoop.hdfs.server.namenode.TestClusterId
Tests run: 13, Failures: 0, Errors: 0, Skipped: 0, Time elapsed: 3.583 sec - in org.apache.hadoop.hdfs.server.namenode.TestClusterId
Running org.apache.hadoop.hdfs.server.namenode.TestStorageRestore
Tests run: 4, Failures: 0, Errors: 0, Skipped: 0, Time elapsed: 17.542 sec - in org.apache.hadoop.hdfs.server.namenode.TestStorageRestore
Running org.apache.hadoop.hdfs.server.namenode.TestEditLogFileOutputStream
Tests run: 4, Failures: 0, Errors: 0, Skipped: 0, Time elapsed: 0.801 sec - in org.apache.hadoop.hdfs.server.namenode.TestEditLogFileOutputStream
Running org.apache.hadoop.hdfs.server.namenode.TestNNStorageRetentionFunctional
Tests run: 1, Failures: 0, Errors: 0, Skipped: 0, Time elapsed: 4.361 sec - in org.apache.hadoop.hdfs.server.namenode.TestNNStorageRetentionFunctional
Running org.apache.hadoop.hdfs.server.namenode.TestProcessCorruptBlocks
Tests run: 4, Failures: 0, Errors: 0, Skipped: 0, Time elapsed: 26.54 sec - in org.apache.hadoop.hdfs.server.namenode.TestProcessCorruptBlocks
Running org.apache.hadoop.hdfs.server.namenode.TestAuditLogAtDebug
Tests run: 6, Failures: 0, Errors: 0, Skipped: 0, Time elapsed: 1.356 sec - in org.apache.hadoop.hdfs.server.namenode.TestAuditLogAtDebug
Running org.apache.hadoop.hdfs.server.namenode.TestAddOverReplicatedStripedBlocks
Tests run: 4, Failures: 0, Errors: 0, Skipped: 0, Time elapsed: 43.446 sec - in org.apache.hadoop.hdfs.server.namenode.TestAddOverReplicatedStripedBlocks
Running org.apache.hadoop.hdfs.server.namenode.TestValidateConfigurationSettings
Tests run: 3, Failures: 0, Errors: 0, Skipped: 0, Time elapsed: 4.09 sec - in org.apache.hadoop.hdfs.server.namenode.TestValidateConfigurationSettings
Running org.apache.hadoop.hdfs.server.namenode.web.resources.TestWebHdfsDataLocality
Tests run: 3, Failures: 0, Errors: 0, Skipped: 0, Time elapsed: 9.205 sec - in org.apache.hadoop.hdfs.server.namenode.web.resources.TestWebHdfsDataLocality
Running org.apache.hadoop.hdfs.server.namenode.TestEditLogRace
Tests run: 4, Failures: 0, Errors: 0, Skipped: 0, Time elapsed: 40.482 sec - in org.apache.hadoop.hdfs.server.namenode.TestEditLogRace
Running org.apache.hadoop.hdfs.server.namenode.startupprogress.TestStartupProgressMetrics
Tests run: 3, Failures: 0, Errors: 0, Skipped: 0, Time elapsed: 0.525 sec - in org.apache.hadoop.hdfs.server.namenode.startupprogress.TestStartupProgressMetrics
Running org.apache.hadoop.hdfs.server.namenode.startupprogress.TestStartupProgress
Tests run: 9, Failures: 0, Errors: 0, Skipped: 0, Time elapsed: 0.4 sec - in org.apache.hadoop.hdfs.server.namenode.startupprogress.TestStartupProgress
Running org.apache.hadoop.hdfs.server.namenode.TestParallelImageWrite
Tests run: 1, Failures: 0, Errors: 0, Skipped: 0, Time elapsed: 17.348 sec - in org.apache.hadoop.hdfs.server.namenode.TestParallelImageWrite
Running org.apache.hadoop.hdfs.server.namenode.TestNameNodeResourceChecker
Tests run: 6, Failures: 0, Errors: 0, Skipped: 0, Time elapsed: 6.329 sec - in org.apache.hadoop.hdfs.server.namenode.TestNameNodeResourceChecker
Running org.apache.hadoop.hdfs.server.namenode.TestSecondaryNameNodeUpgrade
Tests run: 3, Failures: 0, Errors: 0, Skipped: 0, Time elapsed: 11.401 sec - in org.apache.hadoop.hdfs.server.namenode.TestSecondaryNameNodeUpgrade
Running org.apache.hadoop.hdfs.server.namenode.TestNamenodeRetryCache
Tests run: 11, Failures: 0, Errors: 0, Skipped: 0, Time elapsed: 29.787 sec - in org.apache.hadoop.hdfs.server.namenode.TestNamenodeRetryCache
Running org.apache.hadoop.hdfs.server.namenode.TestNamenodeCapacityReport

Results :

Tests in error: 
  TestDatanodeConfig.setUp:58 ยป NoClassDefFound org/apache/hadoop/util/PlatformN...

Tests run: 1424, Failures: 0, Errors: 1, Skipped: 4

[INFO]                                                                         
[INFO] ------------------------------------------------------------------------
[INFO] Skipping Apache Hadoop HDFS Native Client
[INFO] This project has been banned from the build due to previous failures.
[INFO] ------------------------------------------------------------------------
[INFO]                                                                         
[INFO] ------------------------------------------------------------------------
[INFO] Skipping Apache Hadoop HttpFS
[INFO] This project has been banned from the build due to previous failures.
[INFO] ------------------------------------------------------------------------
[INFO]                                                                         
[INFO] ------------------------------------------------------------------------
[INFO] Skipping Apache Hadoop HDFS BookKeeper Journal
[INFO] This project has been banned from the build due to previous failures.
[INFO] ------------------------------------------------------------------------
[INFO]                                                                         
[INFO] ------------------------------------------------------------------------
[INFO] Skipping Apache Hadoop HDFS-NFS
[INFO] This project has been banned from the build due to previous failures.
[INFO] ------------------------------------------------------------------------
[INFO]                                                                         
[INFO] ------------------------------------------------------------------------
[INFO] Building Apache Hadoop HDFS Project 3.0.0-SNAPSHOT
[INFO] ------------------------------------------------------------------------
[INFO] 
[INFO] --- maven-clean-plugin:2.5:clean (default-clean) @ hadoop-hdfs-project ---
[INFO] Deleting <https://builds.apache.org/job/Hadoop-Hdfs-trunk/ws/hadoop-hdfs-project/target>
[INFO] 
[INFO] --- maven-antrun-plugin:1.7:run (create-testdirs) @ hadoop-hdfs-project ---
[INFO] Executing tasks

main:
    [mkdir] Created dir: <https://builds.apache.org/job/Hadoop-Hdfs-trunk/ws/hadoop-hdfs-project/target/test-dir>
[INFO] Executed tasks
[INFO] 
[INFO] --- maven-source-plugin:2.3:jar-no-fork (hadoop-java-sources) @ hadoop-hdfs-project
---
[INFO] 
[INFO] --- maven-source-plugin:2.3:test-jar-no-fork (hadoop-java-sources) @ hadoop-hdfs-project
---
[INFO] 
[INFO] --- maven-enforcer-plugin:1.3.1:enforce (dist-enforce) @ hadoop-hdfs-project ---
[INFO] 
[INFO] --- maven-site-plugin:3.4:attach-descriptor (attach-descriptor) @ hadoop-hdfs-project
---
[INFO] 
[INFO] --- maven-javadoc-plugin:2.8.1:jar (module-javadocs) @ hadoop-hdfs-project ---
[INFO] Skipping javadoc generation
[INFO] 
[INFO] --- maven-enforcer-plugin:1.3.1:enforce (depcheck) @ hadoop-hdfs-project ---
[INFO] 
[INFO] --- maven-checkstyle-plugin:2.15:checkstyle (default-cli) @ hadoop-hdfs-project ---
[INFO] 
[INFO] --- findbugs-maven-plugin:3.0.0:findbugs (default-cli) @ hadoop-hdfs-project ---
[INFO] ------------------------------------------------------------------------
[INFO] Reactor Summary:
[INFO] 
[INFO] Apache Hadoop HDFS Client ......................... SUCCESS [03:58 min]
[INFO] Apache Hadoop HDFS ................................ FAILURE [  01:24 h]
[INFO] Apache Hadoop HDFS Native Client .................. SKIPPED
[INFO] Apache Hadoop HttpFS .............................. SKIPPED
[INFO] Apache Hadoop HDFS BookKeeper Journal ............. SKIPPED
[INFO] Apache Hadoop HDFS-NFS ............................ SKIPPED
[INFO] Apache Hadoop HDFS Project ........................ SUCCESS [  0.057 s]
[INFO] ------------------------------------------------------------------------
[INFO] BUILD FAILURE
[INFO] ------------------------------------------------------------------------
[INFO] Total time: 01:28 h
[INFO] Finished at: 2016-01-07T16:18:09+00:00
[INFO] Final Memory: 68M/926M
[INFO] ------------------------------------------------------------------------
[ERROR] Failed to execute goal org.apache.maven.plugins:maven-surefire-plugin:2.17:test (default-test)
on project hadoop-hdfs: ExecutionException: java.lang.RuntimeException: The forked VM terminated
without properly saying goodbye. VM crash or System.exit called?
[ERROR] Command was /bin/sh -c cd <https://builds.apache.org/job/Hadoop-Hdfs-trunk/ws/hadoop-hdfs-project/hadoop-hdfs>
&& /home/jenkins/tools/java/jdk1.7.0_55/jre/bin/java -Xmx2048m -XX:MaxPermSize=768m
-XX:+HeapDumpOnOutOfMemoryError -jar <https://builds.apache.org/job/Hadoop-Hdfs-trunk/ws/hadoop-hdfs-project/hadoop-hdfs/target/surefire/surefirebooter1528310017426441100.jar>
<https://builds.apache.org/job/Hadoop-Hdfs-trunk/ws/hadoop-hdfs-project/hadoop-hdfs/target/surefire/surefire2468143498595166439tmp>
<https://builds.apache.org/job/Hadoop-Hdfs-trunk/ws/hadoop-hdfs-project/hadoop-hdfs/target/surefire/surefire_924836925247503179576tmp>
[ERROR] -> [Help 1]
[ERROR] 
[ERROR] To see the full stack trace of the errors, re-run Maven with the -e switch.
[ERROR] Re-run Maven using the -X switch to enable full debug logging.
[ERROR] 
[ERROR] For more information about the errors and possible solutions, please read the following
articles:
[ERROR] [Help 1] http://cwiki.apache.org/confluence/display/MAVEN/MojoFailureException
[ERROR] 
[ERROR] After correcting the problems, you can resume the build with the command
[ERROR]   mvn <goals> -rf :hadoop-hdfs
Build step 'Execute shell' marked build as failure
Archiving artifacts
Recording test results

Mime
View raw message