hadoop-hdfs-dev mailing list archives

Site index · List index
Message view « Date » · « Thread »
Top « Date » · « Thread »
From Apache Jenkins Server <jenk...@builds.apache.org>
Subject Hadoop-Hdfs-trunk-Java8 - Build # 850 - Still Failing
Date Sat, 30 Jan 2016 00:31:19 GMT
See https://builds.apache.org/job/Hadoop-Hdfs-trunk-Java8/850/

###################################################################################
########################## LAST 60 LINES OF THE CONSOLE ###########################
[...truncated 6028 lines...]
[INFO] --- maven-antrun-plugin:1.7:run (create-testdirs) @ hadoop-hdfs-project ---
[INFO] Executing tasks

main:
    [mkdir] Created dir: /home/jenkins/jenkins-slave/workspace/Hadoop-Hdfs-trunk-Java8/hadoop-hdfs-project/target/test-dir
[INFO] Executed tasks
[INFO] 
[INFO] --- maven-source-plugin:2.3:jar-no-fork (hadoop-java-sources) @ hadoop-hdfs-project
---
[INFO] 
[INFO] --- maven-source-plugin:2.3:test-jar-no-fork (hadoop-java-sources) @ hadoop-hdfs-project
---
[INFO] 
[INFO] --- maven-enforcer-plugin:1.3.1:enforce (dist-enforce) @ hadoop-hdfs-project ---
[INFO] 
[INFO] --- maven-site-plugin:3.4:attach-descriptor (attach-descriptor) @ hadoop-hdfs-project
---
[INFO] 
[INFO] --- maven-javadoc-plugin:2.8.1:jar (module-javadocs) @ hadoop-hdfs-project ---
[INFO] Not executing Javadoc as the project is not a Java classpath-capable package
[INFO] 
[INFO] --- maven-enforcer-plugin:1.3.1:enforce (depcheck) @ hadoop-hdfs-project ---
[INFO] 
[INFO] --- maven-checkstyle-plugin:2.15:checkstyle (default-cli) @ hadoop-hdfs-project ---
[INFO] 
[INFO] --- findbugs-maven-plugin:3.0.0:findbugs (default-cli) @ hadoop-hdfs-project ---
[INFO] ------------------------------------------------------------------------
[INFO] Reactor Summary:
[INFO] 
[INFO] Apache Hadoop HDFS Client ......................... SUCCESS [04:56 min]
[INFO] Apache Hadoop HDFS ................................ FAILURE [  03:39 h]
[INFO] Apache Hadoop HDFS Native Client .................. SKIPPED
[INFO] Apache Hadoop HttpFS .............................. SKIPPED
[INFO] Apache Hadoop HDFS BookKeeper Journal ............. SKIPPED
[INFO] Apache Hadoop HDFS-NFS ............................ SKIPPED
[INFO] Apache Hadoop HDFS Project ........................ SUCCESS [  0.076 s]
[INFO] ------------------------------------------------------------------------
[INFO] BUILD FAILURE
[INFO] ------------------------------------------------------------------------
[INFO] Total time: 03:44 h
[INFO] Finished at: 2016-01-30T00:31:12+00:00
[INFO] Final Memory: 56M/637M
[INFO] ------------------------------------------------------------------------
[ERROR] Failed to execute goal org.apache.maven.plugins:maven-surefire-plugin:2.17:test (default-test)
on project hadoop-hdfs: There are test failures.
[ERROR] 
[ERROR] Please refer to /home/jenkins/jenkins-slave/workspace/Hadoop-Hdfs-trunk-Java8/hadoop-hdfs-project/hadoop-hdfs/target/surefire-reports
for the individual test results.
[ERROR] -> [Help 1]
[ERROR] 
[ERROR] To see the full stack trace of the errors, re-run Maven with the -e switch.
[ERROR] Re-run Maven using the -X switch to enable full debug logging.
[ERROR] 
[ERROR] For more information about the errors and possible solutions, please read the following
articles:
[ERROR] [Help 1] http://cwiki.apache.org/confluence/display/MAVEN/MojoFailureException
[ERROR] 
[ERROR] After correcting the problems, you can resume the build with the command
[ERROR]   mvn <goals> -rf :hadoop-hdfs
Build step 'Execute shell' marked build as failure
Archiving artifacts
Recording test results
Sending e-mails to: hdfs-dev@hadoop.apache.org
Email was triggered for: Failure - Any
Sending email for trigger: Failure - Any



###################################################################################
############################## FAILED TESTS (if any) ##############################
4 tests failed.
FAILED:  org.apache.hadoop.hdfs.TestFileAppend.testMultipleAppends

Error Message:
Failed to replace a bad datanode on the existing pipeline due to no more good datanodes being
available to try. (Nodes: current=[DatanodeInfoWithStorage[127.0.0.1:59096,DS-4bd75f4b-d6a8-4541-bea0-c8ff69739c48,DISK],
DatanodeInfoWithStorage[127.0.0.1:51873,DS-17bdb986-7574-40d9-83ea-cbb515fb5ded,DISK]], original=[DatanodeInfoWithStorage[127.0.0.1:59096,DS-4bd75f4b-d6a8-4541-bea0-c8ff69739c48,DISK],
DatanodeInfoWithStorage[127.0.0.1:51873,DS-17bdb986-7574-40d9-83ea-cbb515fb5ded,DISK]]). The
current failed datanode replacement policy is DEFAULT, and a client may configure this via
'dfs.client.block.write.replace-datanode-on-failure.policy' in its configuration.

Stack Trace:
java.io.IOException: Failed to replace a bad datanode on the existing pipeline due to no more
good datanodes being available to try. (Nodes: current=[DatanodeInfoWithStorage[127.0.0.1:59096,DS-4bd75f4b-d6a8-4541-bea0-c8ff69739c48,DISK],
DatanodeInfoWithStorage[127.0.0.1:51873,DS-17bdb986-7574-40d9-83ea-cbb515fb5ded,DISK]], original=[DatanodeInfoWithStorage[127.0.0.1:59096,DS-4bd75f4b-d6a8-4541-bea0-c8ff69739c48,DISK],
DatanodeInfoWithStorage[127.0.0.1:51873,DS-17bdb986-7574-40d9-83ea-cbb515fb5ded,DISK]]). The
current failed datanode replacement policy is DEFAULT, and a client may configure this via
'dfs.client.block.write.replace-datanode-on-failure.policy' in its configuration.
	at org.apache.hadoop.hdfs.DataStreamer.findNewDatanode(DataStreamer.java:1169)
	at org.apache.hadoop.hdfs.DataStreamer.addDatanode2ExistingPipeline(DataStreamer.java:1235)
	at org.apache.hadoop.hdfs.DataStreamer.handleDatanodeReplacement(DataStreamer.java:1426)
	at org.apache.hadoop.hdfs.DataStreamer.setupPipelineInternal(DataStreamer.java:1341)
	at org.apache.hadoop.hdfs.DataStreamer.setupPipelineForAppendOrRecovery(DataStreamer.java:1324)
	at org.apache.hadoop.hdfs.DataStreamer.run(DataStreamer.java:598)


FAILED:  org.apache.hadoop.hdfs.server.namenode.ha.TestDelegationTokensWithHA.testDelegationTokenDFSApi

Error Message:
org/apache/hadoop/test/GenericTestUtils

Stack Trace:
java.lang.NoClassDefFoundError: org/apache/hadoop/test/GenericTestUtils
	at java.net.URLClassLoader$1.run(URLClassLoader.java:372)
	at java.net.URLClassLoader$1.run(URLClassLoader.java:361)
	at java.security.AccessController.doPrivileged(Native Method)
	at java.net.URLClassLoader.findClass(URLClassLoader.java:360)
	at java.lang.ClassLoader.loadClass(ClassLoader.java:424)
	at sun.misc.Launcher$AppClassLoader.loadClass(Launcher.java:308)
	at java.lang.ClassLoader.loadClass(ClassLoader.java:357)
	at org.apache.hadoop.hdfs.server.namenode.ha.TestDelegationTokensWithHA.testDelegationTokenDFSApi(TestDelegationTokensWithHA.java:142)


FAILED:  org.apache.hadoop.hdfs.server.namenode.ha.TestDelegationTokensWithHA.testDelegationTokenDuringNNFailover

Error Message:
org/apache/hadoop/test/GenericTestUtils

Stack Trace:
java.lang.NoClassDefFoundError: org/apache/hadoop/test/GenericTestUtils
	at org.apache.hadoop.hdfs.server.namenode.ha.TestDelegationTokensWithHA.testDelegationTokenDuringNNFailover(TestDelegationTokensWithHA.java:209)


FAILED:  org.apache.hadoop.hdfs.shortcircuit.TestShortCircuitCache.testDataXceiverCleansUpSlotsOnFailure

Error Message:
expected:<1> but was:<2>

Stack Trace:
java.lang.AssertionError: expected:<1> but was:<2>
	at org.junit.Assert.fail(Assert.java:88)
	at org.junit.Assert.failNotEquals(Assert.java:743)
	at org.junit.Assert.assertEquals(Assert.java:118)
	at org.junit.Assert.assertEquals(Assert.java:555)
	at org.junit.Assert.assertEquals(Assert.java:542)
	at org.apache.hadoop.hdfs.shortcircuit.TestShortCircuitCache$17.accept(TestShortCircuitCache.java:633)
	at org.apache.hadoop.hdfs.server.datanode.ShortCircuitRegistry.visit(ShortCircuitRegistry.java:403)
	at org.apache.hadoop.hdfs.shortcircuit.TestShortCircuitCache.checkNumberOfSegmentsAndSlots(TestShortCircuitCache.java:628)
	at org.apache.hadoop.hdfs.shortcircuit.TestShortCircuitCache.testDataXceiverCleansUpSlotsOnFailure(TestShortCircuitCache.java:682)



Mime
  • Unnamed multipart/mixed (inline, None, 0 bytes)
View raw message