hadoop-hdfs-dev mailing list archives

Site index · List index
Message view « Date » · « Thread »
Top « Date » · « Thread »
From Apache Jenkins Server <jenk...@builds.apache.org>
Subject Hadoop-Hdfs-trunk-Java8 - Build # 832 - Failure
Date Tue, 26 Jan 2016 01:00:39 GMT
See https://builds.apache.org/job/Hadoop-Hdfs-trunk-Java8/832/

###################################################################################
########################## LAST 60 LINES OF THE CONSOLE ###########################
[...truncated 6335 lines...]
[INFO] --- maven-antrun-plugin:1.7:run (create-testdirs) @ hadoop-hdfs-project ---
[INFO] Executing tasks

main:
    [mkdir] Created dir: /home/jenkins/jenkins-slave/workspace/Hadoop-Hdfs-trunk-Java8/hadoop-hdfs-project/target/test-dir
[INFO] Executed tasks
[INFO] 
[INFO] --- maven-source-plugin:2.3:jar-no-fork (hadoop-java-sources) @ hadoop-hdfs-project
---
[INFO] 
[INFO] --- maven-source-plugin:2.3:test-jar-no-fork (hadoop-java-sources) @ hadoop-hdfs-project
---
[INFO] 
[INFO] --- maven-enforcer-plugin:1.3.1:enforce (dist-enforce) @ hadoop-hdfs-project ---
[INFO] 
[INFO] --- maven-site-plugin:3.4:attach-descriptor (attach-descriptor) @ hadoop-hdfs-project
---
[INFO] 
[INFO] --- maven-javadoc-plugin:2.8.1:jar (module-javadocs) @ hadoop-hdfs-project ---
[INFO] Not executing Javadoc as the project is not a Java classpath-capable package
[INFO] 
[INFO] --- maven-enforcer-plugin:1.3.1:enforce (depcheck) @ hadoop-hdfs-project ---
[INFO] 
[INFO] --- maven-checkstyle-plugin:2.15:checkstyle (default-cli) @ hadoop-hdfs-project ---
[INFO] 
[INFO] --- findbugs-maven-plugin:3.0.0:findbugs (default-cli) @ hadoop-hdfs-project ---
[INFO] ------------------------------------------------------------------------
[INFO] Reactor Summary:
[INFO] 
[INFO] Apache Hadoop HDFS Client ......................... SUCCESS [03:58 min]
[INFO] Apache Hadoop HDFS ................................ FAILURE [  03:56 h]
[INFO] Apache Hadoop HDFS Native Client .................. SKIPPED
[INFO] Apache Hadoop HttpFS .............................. SKIPPED
[INFO] Apache Hadoop HDFS BookKeeper Journal ............. SKIPPED
[INFO] Apache Hadoop HDFS-NFS ............................ SKIPPED
[INFO] Apache Hadoop HDFS Project ........................ SUCCESS [  0.113 s]
[INFO] ------------------------------------------------------------------------
[INFO] BUILD FAILURE
[INFO] ------------------------------------------------------------------------
[INFO] Total time: 04:00 h
[INFO] Finished at: 2016-01-26T01:00:27+00:00
[INFO] Final Memory: 55M/686M
[INFO] ------------------------------------------------------------------------
[ERROR] Failed to execute goal org.apache.maven.plugins:maven-surefire-plugin:2.17:test (default-test)
on project hadoop-hdfs: There are test failures.
[ERROR] 
[ERROR] Please refer to /home/jenkins/jenkins-slave/workspace/Hadoop-Hdfs-trunk-Java8/hadoop-hdfs-project/hadoop-hdfs/target/surefire-reports
for the individual test results.
[ERROR] -> [Help 1]
[ERROR] 
[ERROR] To see the full stack trace of the errors, re-run Maven with the -e switch.
[ERROR] Re-run Maven using the -X switch to enable full debug logging.
[ERROR] 
[ERROR] For more information about the errors and possible solutions, please read the following
articles:
[ERROR] [Help 1] http://cwiki.apache.org/confluence/display/MAVEN/MojoFailureException
[ERROR] 
[ERROR] After correcting the problems, you can resume the build with the command
[ERROR]   mvn <goals> -rf :hadoop-hdfs
Build step 'Execute shell' marked build as failure
Archiving artifacts
Recording test results
Sending e-mails to: hdfs-dev@hadoop.apache.org
Email was triggered for: Failure - Any
Sending email for trigger: Failure - Any



###################################################################################
############################## FAILED TESTS (if any) ##############################
26 tests failed.
FAILED:  org.apache.hadoop.hdfs.TestDFSStripedOutputStreamWithFailure030.test5

Error Message:
failed, dn=0, length=720896java.lang.NoClassDefFoundError: org/apache/hadoop/util/PlatformName
 at org.apache.hadoop.security.UserGroupInformation.getOSLoginModuleName(UserGroupInformation.java:380)
 at org.apache.hadoop.security.UserGroupInformation.<clinit>(UserGroupInformation.java:425)
 at org.apache.hadoop.hdfs.server.namenode.NameNode.format(NameNode.java:1057)
 at org.apache.hadoop.hdfs.server.namenode.NameNode.format(NameNode.java:370)
 at org.apache.hadoop.hdfs.DFSTestUtil.formatNameNode(DFSTestUtil.java:228)
 at org.apache.hadoop.hdfs.MiniDFSCluster.configureNameService(MiniDFSCluster.java:1005)
 at org.apache.hadoop.hdfs.MiniDFSCluster.createNameNodesAndSetConf(MiniDFSCluster.java:891)
 at org.apache.hadoop.hdfs.MiniDFSCluster.initMiniDFSCluster(MiniDFSCluster.java:823)
 at org.apache.hadoop.hdfs.MiniDFSCluster.<init>(MiniDFSCluster.java:482)
 at org.apache.hadoop.hdfs.MiniDFSCluster$Builder.build(MiniDFSCluster.java:441)
 at org.apache.hadoop.hdfs.TestDFSStripedOutputStreamWithFailure.setup(TestDFSStripedOutputStreamWithFailure.java:147)
 at org.apache.hadoop.hdfs.TestDFSStripedOutputStreamWithFailure.runTest(TestDFSStripedOutputStreamWithFailure.java:280)
 at org.apache.hadoop.hdfs.TestDFSStripedOutputStreamWithFailure$TestBase.run(TestDFSStripedOutputStreamWithFailure.java:486)
 at org.apache.hadoop.hdfs.TestDFSStripedOutputStreamWithFailure$TestBase.test5(TestDFSStripedOutputStreamWithFailure.java:494)
 at sun.reflect.NativeMethodAccessorImpl.invoke0(Native Method)
 at sun.reflect.NativeMethodAccessorImpl.invoke(NativeMethodAccessorImpl.java:62)
 at sun.reflect.DelegatingMethodAccessorImpl.invoke(DelegatingMethodAccessorImpl.java:43)
 at java.lang.reflect.Method.invoke(Method.java:483)
 at org.junit.runners.model.FrameworkMethod$1.runReflectiveCall(FrameworkMethod.java:47)
 at org.junit.internal.runners.model.ReflectiveCallable.run(ReflectiveCallable.java:12)
 at org.junit.runners.model.FrameworkMethod.invokeExplosively(FrameworkMethod.java:44)
 at org.junit.internal.runners.statements.InvokeMethod.evaluate(InvokeMethod.java:17)
 at org.junit.internal.runners.statements.FailOnTimeout$StatementThread.run(FailOnTimeout.java:74)
Caused by: java.lang.ClassNotFoundException: org.apache.hadoop.util.PlatformName
 at java.net.URLClassLoader$1.run(URLClassLoader.java:372)
 at java.net.URLClassLoader$1.run(URLClassLoader.java:361)
 at java.security.AccessController.doPrivileged(Native Method)
 at java.net.URLClassLoader.findClass(URLClassLoader.java:360)
 at java.lang.ClassLoader.loadClass(ClassLoader.java:424)
 at sun.misc.Launcher$AppClassLoader.loadClass(Launcher.java:308)
 at java.lang.ClassLoader.loadClass(ClassLoader.java:357)
 ... 23 more


Stack Trace:
java.lang.AssertionError: failed, dn=0, length=720896java.lang.NoClassDefFoundError: org/apache/hadoop/util/PlatformName
	at org.apache.hadoop.security.UserGroupInformation.getOSLoginModuleName(UserGroupInformation.java:380)
	at org.apache.hadoop.security.UserGroupInformation.<clinit>(UserGroupInformation.java:425)
	at org.apache.hadoop.hdfs.server.namenode.NameNode.format(NameNode.java:1057)
	at org.apache.hadoop.hdfs.server.namenode.NameNode.format(NameNode.java:370)
	at org.apache.hadoop.hdfs.DFSTestUtil.formatNameNode(DFSTestUtil.java:228)
	at org.apache.hadoop.hdfs.MiniDFSCluster.configureNameService(MiniDFSCluster.java:1005)
	at org.apache.hadoop.hdfs.MiniDFSCluster.createNameNodesAndSetConf(MiniDFSCluster.java:891)
	at org.apache.hadoop.hdfs.MiniDFSCluster.initMiniDFSCluster(MiniDFSCluster.java:823)
	at org.apache.hadoop.hdfs.MiniDFSCluster.<init>(MiniDFSCluster.java:482)
	at org.apache.hadoop.hdfs.MiniDFSCluster$Builder.build(MiniDFSCluster.java:441)
	at org.apache.hadoop.hdfs.TestDFSStripedOutputStreamWithFailure.setup(TestDFSStripedOutputStreamWithFailure.java:147)
	at org.apache.hadoop.hdfs.TestDFSStripedOutputStreamWithFailure.runTest(TestDFSStripedOutputStreamWithFailure.java:280)
	at org.apache.hadoop.hdfs.TestDFSStripedOutputStreamWithFailure$TestBase.run(TestDFSStripedOutputStreamWithFailure.java:486)
	at org.apache.hadoop.hdfs.TestDFSStripedOutputStreamWithFailure$TestBase.test5(TestDFSStripedOutputStreamWithFailure.java:494)
	at sun.reflect.NativeMethodAccessorImpl.invoke0(Native Method)
	at sun.reflect.NativeMethodAccessorImpl.invoke(NativeMethodAccessorImpl.java:62)
	at sun.reflect.DelegatingMethodAccessorImpl.invoke(DelegatingMethodAccessorImpl.java:43)
	at java.lang.reflect.Method.invoke(Method.java:483)
	at org.junit.runners.model.FrameworkMethod$1.runReflectiveCall(FrameworkMethod.java:47)
	at org.junit.internal.runners.model.ReflectiveCallable.run(ReflectiveCallable.java:12)
	at org.junit.runners.model.FrameworkMethod.invokeExplosively(FrameworkMethod.java:44)
	at org.junit.internal.runners.statements.InvokeMethod.evaluate(InvokeMethod.java:17)
	at org.junit.internal.runners.statements.FailOnTimeout$StatementThread.run(FailOnTimeout.java:74)
Caused by: java.lang.ClassNotFoundException: org.apache.hadoop.util.PlatformName
	at java.net.URLClassLoader$1.run(URLClassLoader.java:372)
	at java.net.URLClassLoader$1.run(URLClassLoader.java:361)
	at java.security.AccessController.doPrivileged(Native Method)
	at java.net.URLClassLoader.findClass(URLClassLoader.java:360)
	at java.lang.ClassLoader.loadClass(ClassLoader.java:424)
	at sun.misc.Launcher$AppClassLoader.loadClass(Launcher.java:308)
	at java.lang.ClassLoader.loadClass(ClassLoader.java:357)
	... 23 more

	at org.junit.Assert.fail(Assert.java:88)
	at org.apache.hadoop.hdfs.TestDFSStripedOutputStreamWithFailure.runTest(TestDFSStripedOutputStreamWithFailure.java:286)
	at org.apache.hadoop.hdfs.TestDFSStripedOutputStreamWithFailure$TestBase.run(TestDFSStripedOutputStreamWithFailure.java:486)
	at org.apache.hadoop.hdfs.TestDFSStripedOutputStreamWithFailure$TestBase.test5(TestDFSStripedOutputStreamWithFailure.java:494)
	at sun.reflect.NativeMethodAccessorImpl.invoke0(Native Method)
	at sun.reflect.NativeMethodAccessorImpl.invoke(NativeMethodAccessorImpl.java:62)
	at sun.reflect.DelegatingMethodAccessorImpl.invoke(DelegatingMethodAccessorImpl.java:43)
	at java.lang.reflect.Method.invoke(Method.java:483)
	at org.junit.runners.model.FrameworkMethod$1.runReflectiveCall(FrameworkMethod.java:47)
	at org.junit.internal.runners.model.ReflectiveCallable.run(ReflectiveCallable.java:12)
	at org.junit.runners.model.FrameworkMethod.invokeExplosively(FrameworkMethod.java:44)
	at org.junit.internal.runners.statements.InvokeMethod.evaluate(InvokeMethod.java:17)
	at org.junit.internal.runners.statements.FailOnTimeout$StatementThread.run(FailOnTimeout.java:74)


FAILED:  org.apache.hadoop.hdfs.TestEncryptionZonesWithKMS.testGetEZAsNonSuperUser

Error Message:
org/apache/hadoop/fs/PathIsNotEmptyDirectoryException
 at org.apache.hadoop.hdfs.server.namenode.FSNamesystem.delete(FSNamesystem.java:2681)
 at org.apache.hadoop.hdfs.server.namenode.NameNodeRpcServer.delete(NameNodeRpcServer.java:1032)
 at org.apache.hadoop.hdfs.protocolPB.ClientNamenodeProtocolServerSideTranslatorPB.delete(ClientNamenodeProtocolServerSideTranslatorPB.java:622)
 at org.apache.hadoop.hdfs.protocol.proto.ClientNamenodeProtocolProtos$ClientNamenodeProtocol$2.callBlockingMethod(ClientNamenodeProtocolProtos.java)
 at org.apache.hadoop.ipc.ProtobufRpcEngine$Server$ProtoBufRpcInvoker.call(ProtobufRpcEngine.java:637)
 at org.apache.hadoop.ipc.RPC$Server.call(RPC.java:989)
 at org.apache.hadoop.ipc.Server$Handler$1.run(Server.java:2305)
 at org.apache.hadoop.ipc.Server$Handler$1.run(Server.java:2301)
 at java.security.AccessController.doPrivileged(Native Method)
 at javax.security.auth.Subject.doAs(Subject.java:422)
 at org.apache.hadoop.security.UserGroupInformation.doAs(UserGroupInformation.java:1727)
 at org.apache.hadoop.ipc.Server$Handler.run(Server.java:2301)
Caused by: java.lang.ClassNotFoundException: org.apache.hadoop.fs.PathIsNotEmptyDirectoryException
 at java.net.URLClassLoader$1.run(URLClassLoader.java:372)
 at java.net.URLClassLoader$1.run(URLClassLoader.java:361)
 at java.security.AccessController.doPrivileged(Native Method)
 at java.net.URLClassLoader.findClass(URLClassLoader.java:360)
 at java.lang.ClassLoader.loadClass(ClassLoader.java:424)
 at sun.misc.Launcher$AppClassLoader.loadClass(Launcher.java:308)
 at java.lang.ClassLoader.loadClass(ClassLoader.java:357)
 ... 12 more


Stack Trace:
org.apache.hadoop.ipc.RemoteException: org/apache/hadoop/fs/PathIsNotEmptyDirectoryException
	at org.apache.hadoop.hdfs.server.namenode.FSNamesystem.delete(FSNamesystem.java:2681)
	at org.apache.hadoop.hdfs.server.namenode.NameNodeRpcServer.delete(NameNodeRpcServer.java:1032)
	at org.apache.hadoop.hdfs.protocolPB.ClientNamenodeProtocolServerSideTranslatorPB.delete(ClientNamenodeProtocolServerSideTranslatorPB.java:622)
	at org.apache.hadoop.hdfs.protocol.proto.ClientNamenodeProtocolProtos$ClientNamenodeProtocol$2.callBlockingMethod(ClientNamenodeProtocolProtos.java)
	at org.apache.hadoop.ipc.ProtobufRpcEngine$Server$ProtoBufRpcInvoker.call(ProtobufRpcEngine.java:637)
	at org.apache.hadoop.ipc.RPC$Server.call(RPC.java:989)
	at org.apache.hadoop.ipc.Server$Handler$1.run(Server.java:2305)
	at org.apache.hadoop.ipc.Server$Handler$1.run(Server.java:2301)
	at java.security.AccessController.doPrivileged(Native Method)
	at javax.security.auth.Subject.doAs(Subject.java:422)
	at org.apache.hadoop.security.UserGroupInformation.doAs(UserGroupInformation.java:1727)
	at org.apache.hadoop.ipc.Server$Handler.run(Server.java:2301)
Caused by: java.lang.ClassNotFoundException: org.apache.hadoop.fs.PathIsNotEmptyDirectoryException
	at java.net.URLClassLoader$1.run(URLClassLoader.java:372)
	at java.net.URLClassLoader$1.run(URLClassLoader.java:361)
	at java.security.AccessController.doPrivileged(Native Method)
	at java.net.URLClassLoader.findClass(URLClassLoader.java:360)
	at java.lang.ClassLoader.loadClass(ClassLoader.java:424)
	at sun.misc.Launcher$AppClassLoader.loadClass(Launcher.java:308)
	at java.lang.ClassLoader.loadClass(ClassLoader.java:357)
	... 12 more

	at org.apache.hadoop.ipc.Client.call(Client.java:1449)
	at org.apache.hadoop.ipc.Client.call(Client.java:1386)
	at org.apache.hadoop.ipc.ProtobufRpcEngine$Invoker.invoke(ProtobufRpcEngine.java:230)
	at com.sun.proxy.$Proxy69.delete(Unknown Source)
	at org.apache.hadoop.hdfs.protocolPB.ClientNamenodeProtocolTranslatorPB.delete(ClientNamenodeProtocolTranslatorPB.java:520)
	at sun.reflect.NativeMethodAccessorImpl.invoke0(Native Method)
	at sun.reflect.NativeMethodAccessorImpl.invoke(NativeMethodAccessorImpl.java:62)
	at sun.reflect.DelegatingMethodAccessorImpl.invoke(DelegatingMethodAccessorImpl.java:43)
	at java.lang.reflect.Method.invoke(Method.java:483)
	at org.apache.hadoop.io.retry.RetryInvocationHandler.invokeMethod(RetryInvocationHandler.java:255)
	at org.apache.hadoop.io.retry.RetryInvocationHandler.invoke(RetryInvocationHandler.java:103)
	at com.sun.proxy.$Proxy70.delete(Unknown Source)
	at org.apache.hadoop.hdfs.DFSClient.delete(DFSClient.java:1538)
	at org.apache.hadoop.hdfs.DistributedFileSystem$15.doCall(DistributedFileSystem.java:700)
	at org.apache.hadoop.hdfs.DistributedFileSystem$15.doCall(DistributedFileSystem.java:697)
	at org.apache.hadoop.fs.FileSystemLinkResolver.resolve(FileSystemLinkResolver.java:81)
	at org.apache.hadoop.hdfs.DistributedFileSystem.delete(DistributedFileSystem.java:707)
	at org.apache.hadoop.hdfs.TestEncryptionZones$3.run(TestEncryptionZones.java:544)
	at java.security.AccessController.doPrivileged(Native Method)
	at javax.security.auth.Subject.doAs(Subject.java:422)
	at org.apache.hadoop.security.UserGroupInformation.doAs(UserGroupInformation.java:1727)
	at org.apache.hadoop.hdfs.TestEncryptionZones.testGetEZAsNonSuperUser(TestEncryptionZones.java:487)
	at sun.reflect.NativeMethodAccessorImpl.invoke0(Native Method)
	at sun.reflect.NativeMethodAccessorImpl.invoke(NativeMethodAccessorImpl.java:62)
	at sun.reflect.DelegatingMethodAccessorImpl.invoke(DelegatingMethodAccessorImpl.java:43)
	at java.lang.reflect.Method.invoke(Method.java:483)
	at org.junit.runners.model.FrameworkMethod$1.runReflectiveCall(FrameworkMethod.java:47)
	at org.junit.internal.runners.model.ReflectiveCallable.run(ReflectiveCallable.java:12)
	at org.junit.runners.model.FrameworkMethod.invokeExplosively(FrameworkMethod.java:44)
	at org.junit.internal.runners.statements.InvokeMethod.evaluate(InvokeMethod.java:17)
	at org.junit.internal.runners.statements.FailOnTimeout$StatementThread.run(FailOnTimeout.java:74)


FAILED:  org.apache.hadoop.hdfs.TestEncryptionZonesWithKMS.testEncryptionZoneWithTrash

Error Message:
fs.AbstractFileSystem.hdfs.impl=null: No AbstractFileSystem configured for scheme: hdfs

Stack Trace:
org.apache.hadoop.fs.UnsupportedFileSystemException: fs.AbstractFileSystem.hdfs.impl=null:
No AbstractFileSystem configured for scheme: hdfs
	at org.apache.hadoop.fs.AbstractFileSystem.createFileSystem(AbstractFileSystem.java:161)
	at org.apache.hadoop.fs.AbstractFileSystem.get(AbstractFileSystem.java:250)
	at org.apache.hadoop.fs.FileContext$2.run(FileContext.java:332)
	at org.apache.hadoop.fs.FileContext$2.run(FileContext.java:329)
	at java.security.AccessController.doPrivileged(Native Method)
	at javax.security.auth.Subject.doAs(Subject.java:422)
	at org.apache.hadoop.security.UserGroupInformation.doAs(UserGroupInformation.java:1727)
	at org.apache.hadoop.fs.FileContext.getAbstractFileSystem(FileContext.java:329)
	at org.apache.hadoop.fs.FileContext.getFileContext(FileContext.java:446)
	at org.apache.hadoop.hdfs.TestEncryptionZones.setup(TestEncryptionZones.java:155)
	at org.apache.hadoop.hdfs.TestEncryptionZonesWithKMS.setup(TestEncryptionZonesWithKMS.java:56)


FAILED:  org.apache.hadoop.hdfs.TestEncryptionZonesWithKMS.testGetEncryptionZoneOnANonExistentZoneFile

Error Message:
Can not read resource file 'mini-kms-acls-default.xml'

Stack Trace:
java.io.IOException: Can not read resource file 'mini-kms-acls-default.xml'
	at org.apache.hadoop.util.ThreadUtil.getResourceAsStream(ThreadUtil.java:74)
	at org.apache.hadoop.crypto.key.kms.server.MiniKMS.copyResource(MiniKMS.java:159)
	at org.apache.hadoop.crypto.key.kms.server.MiniKMS.start(MiniKMS.java:173)
	at org.apache.hadoop.hdfs.TestEncryptionZonesWithKMS.setup(TestEncryptionZonesWithKMS.java:55)


FAILED:  org.apache.hadoop.hdfs.TestEncryptionZonesWithKMS.testReadWriteUsingWebHdfs

Error Message:
Can not read resource file 'mini-kms-acls-default.xml'

Stack Trace:
java.io.IOException: Can not read resource file 'mini-kms-acls-default.xml'
	at org.apache.hadoop.util.ThreadUtil.getResourceAsStream(ThreadUtil.java:74)
	at org.apache.hadoop.crypto.key.kms.server.MiniKMS.copyResource(MiniKMS.java:159)
	at org.apache.hadoop.crypto.key.kms.server.MiniKMS.start(MiniKMS.java:173)
	at org.apache.hadoop.hdfs.TestEncryptionZonesWithKMS.setup(TestEncryptionZonesWithKMS.java:55)


FAILED:  org.apache.hadoop.hdfs.TestEncryptionZonesWithKMS.testEncryptionZonesOnRootPath

Error Message:
Can not read resource file 'mini-kms-acls-default.xml'

Stack Trace:
java.io.IOException: Can not read resource file 'mini-kms-acls-default.xml'
	at org.apache.hadoop.util.ThreadUtil.getResourceAsStream(ThreadUtil.java:74)
	at org.apache.hadoop.crypto.key.kms.server.MiniKMS.copyResource(MiniKMS.java:159)
	at org.apache.hadoop.crypto.key.kms.server.MiniKMS.start(MiniKMS.java:173)
	at org.apache.hadoop.hdfs.TestEncryptionZonesWithKMS.setup(TestEncryptionZonesWithKMS.java:55)


FAILED:  org.apache.hadoop.hdfs.TestEncryptionZonesWithKMS.testReadWrite

Error Message:
Can not read resource file 'mini-kms-acls-default.xml'

Stack Trace:
java.io.IOException: Can not read resource file 'mini-kms-acls-default.xml'
	at org.apache.hadoop.util.ThreadUtil.getResourceAsStream(ThreadUtil.java:74)
	at org.apache.hadoop.crypto.key.kms.server.MiniKMS.copyResource(MiniKMS.java:159)
	at org.apache.hadoop.crypto.key.kms.server.MiniKMS.start(MiniKMS.java:173)
	at org.apache.hadoop.hdfs.TestEncryptionZonesWithKMS.setup(TestEncryptionZonesWithKMS.java:55)


FAILED:  org.apache.hadoop.hdfs.TestEncryptionZonesWithKMS.testRenameFileSystem

Error Message:
Can not read resource file 'mini-kms-acls-default.xml'

Stack Trace:
java.io.IOException: Can not read resource file 'mini-kms-acls-default.xml'
	at org.apache.hadoop.util.ThreadUtil.getResourceAsStream(ThreadUtil.java:74)
	at org.apache.hadoop.crypto.key.kms.server.MiniKMS.copyResource(MiniKMS.java:159)
	at org.apache.hadoop.crypto.key.kms.server.MiniKMS.start(MiniKMS.java:173)
	at org.apache.hadoop.hdfs.TestEncryptionZonesWithKMS.setup(TestEncryptionZonesWithKMS.java:55)


FAILED:  org.apache.hadoop.hdfs.TestEncryptionZonesWithKMS.testListEncryptionZonesAsNonSuperUser

Error Message:
Can not read resource file 'mini-kms-acls-default.xml'

Stack Trace:
java.io.IOException: Can not read resource file 'mini-kms-acls-default.xml'
	at org.apache.hadoop.util.ThreadUtil.getResourceAsStream(ThreadUtil.java:74)
	at org.apache.hadoop.crypto.key.kms.server.MiniKMS.copyResource(MiniKMS.java:159)
	at org.apache.hadoop.crypto.key.kms.server.MiniKMS.start(MiniKMS.java:173)
	at org.apache.hadoop.hdfs.TestEncryptionZonesWithKMS.setup(TestEncryptionZonesWithKMS.java:55)


FAILED:  org.apache.hadoop.hdfs.TestEncryptionZonesWithKMS.testSnapshotsOnEncryptionZones

Error Message:
Can not read resource file 'mini-kms-acls-default.xml'

Stack Trace:
java.io.IOException: Can not read resource file 'mini-kms-acls-default.xml'
	at org.apache.hadoop.util.ThreadUtil.getResourceAsStream(ThreadUtil.java:74)
	at org.apache.hadoop.crypto.key.kms.server.MiniKMS.copyResource(MiniKMS.java:159)
	at org.apache.hadoop.crypto.key.kms.server.MiniKMS.start(MiniKMS.java:173)
	at org.apache.hadoop.hdfs.TestEncryptionZonesWithKMS.setup(TestEncryptionZonesWithKMS.java:55)


FAILED:  org.apache.hadoop.hdfs.TestEncryptionZonesWithKMS.testConcatFailsInEncryptionZones

Error Message:
Can not read resource file 'mini-kms-acls-default.xml'

Stack Trace:
java.io.IOException: Can not read resource file 'mini-kms-acls-default.xml'
	at org.apache.hadoop.util.ThreadUtil.getResourceAsStream(ThreadUtil.java:74)
	at org.apache.hadoop.crypto.key.kms.server.MiniKMS.copyResource(MiniKMS.java:159)
	at org.apache.hadoop.crypto.key.kms.server.MiniKMS.start(MiniKMS.java:173)
	at org.apache.hadoop.hdfs.TestEncryptionZonesWithKMS.setup(TestEncryptionZonesWithKMS.java:55)


FAILED:  org.apache.hadoop.hdfs.TestEncryptionZonesWithKMS.testOfflineImageViewerOnEncryptionZones

Error Message:
Can not read resource file 'mini-kms-acls-default.xml'

Stack Trace:
java.io.IOException: Can not read resource file 'mini-kms-acls-default.xml'
	at org.apache.hadoop.util.ThreadUtil.getResourceAsStream(ThreadUtil.java:74)
	at org.apache.hadoop.crypto.key.kms.server.MiniKMS.copyResource(MiniKMS.java:159)
	at org.apache.hadoop.crypto.key.kms.server.MiniKMS.start(MiniKMS.java:173)
	at org.apache.hadoop.hdfs.TestEncryptionZonesWithKMS.setup(TestEncryptionZonesWithKMS.java:55)


FAILED:  org.apache.hadoop.hdfs.TestEncryptionZonesWithKMS.testRenameFileContext

Error Message:
Can not read resource file 'mini-kms-acls-default.xml'

Stack Trace:
java.io.IOException: Can not read resource file 'mini-kms-acls-default.xml'
	at org.apache.hadoop.util.ThreadUtil.getResourceAsStream(ThreadUtil.java:74)
	at org.apache.hadoop.crypto.key.kms.server.MiniKMS.copyResource(MiniKMS.java:159)
	at org.apache.hadoop.crypto.key.kms.server.MiniKMS.start(MiniKMS.java:173)
	at org.apache.hadoop.hdfs.TestEncryptionZonesWithKMS.setup(TestEncryptionZonesWithKMS.java:55)


FAILED:  org.apache.hadoop.hdfs.TestEncryptionZonesWithKMS.testBasicOperationsRootDir

Error Message:
Can not read resource file 'mini-kms-acls-default.xml'

Stack Trace:
java.io.IOException: Can not read resource file 'mini-kms-acls-default.xml'
	at org.apache.hadoop.util.ThreadUtil.getResourceAsStream(ThreadUtil.java:74)
	at org.apache.hadoop.crypto.key.kms.server.MiniKMS.copyResource(MiniKMS.java:159)
	at org.apache.hadoop.crypto.key.kms.server.MiniKMS.start(MiniKMS.java:173)
	at org.apache.hadoop.hdfs.TestEncryptionZonesWithKMS.setup(TestEncryptionZonesWithKMS.java:55)


FAILED:  org.apache.hadoop.hdfs.TestEncryptionZonesWithKMS.testFsckOnEncryptionZones

Error Message:
Can not read resource file 'mini-kms-acls-default.xml'

Stack Trace:
java.io.IOException: Can not read resource file 'mini-kms-acls-default.xml'
	at org.apache.hadoop.util.ThreadUtil.getResourceAsStream(ThreadUtil.java:74)
	at org.apache.hadoop.crypto.key.kms.server.MiniKMS.copyResource(MiniKMS.java:159)
	at org.apache.hadoop.crypto.key.kms.server.MiniKMS.start(MiniKMS.java:173)
	at org.apache.hadoop.hdfs.TestEncryptionZonesWithKMS.setup(TestEncryptionZonesWithKMS.java:55)


FAILED:  org.apache.hadoop.hdfs.TestEncryptionZonesWithKMS.testBasicOperations

Error Message:
Can not read resource file 'mini-kms-acls-default.xml'

Stack Trace:
java.io.IOException: Can not read resource file 'mini-kms-acls-default.xml'
	at org.apache.hadoop.util.ThreadUtil.getResourceAsStream(ThreadUtil.java:74)
	at org.apache.hadoop.crypto.key.kms.server.MiniKMS.copyResource(MiniKMS.java:159)
	at org.apache.hadoop.crypto.key.kms.server.MiniKMS.start(MiniKMS.java:173)
	at org.apache.hadoop.hdfs.TestEncryptionZonesWithKMS.setup(TestEncryptionZonesWithKMS.java:55)


FAILED:  org.apache.hadoop.hdfs.TestEncryptionZonesWithKMS.testCreateEZWithNoProvider

Error Message:
Can not read resource file 'mini-kms-acls-default.xml'

Stack Trace:
java.io.IOException: Can not read resource file 'mini-kms-acls-default.xml'
	at org.apache.hadoop.util.ThreadUtil.getResourceAsStream(ThreadUtil.java:74)
	at org.apache.hadoop.crypto.key.kms.server.MiniKMS.copyResource(MiniKMS.java:159)
	at org.apache.hadoop.crypto.key.kms.server.MiniKMS.start(MiniKMS.java:173)
	at org.apache.hadoop.hdfs.TestEncryptionZonesWithKMS.setup(TestEncryptionZonesWithKMS.java:55)


FAILED:  org.apache.hadoop.hdfs.TestEncryptionZonesWithKMS.testStartFileRetry

Error Message:
Can not read resource file 'mini-kms-acls-default.xml'

Stack Trace:
java.io.IOException: Can not read resource file 'mini-kms-acls-default.xml'
	at org.apache.hadoop.util.ThreadUtil.getResourceAsStream(ThreadUtil.java:74)
	at org.apache.hadoop.crypto.key.kms.server.MiniKMS.copyResource(MiniKMS.java:159)
	at org.apache.hadoop.crypto.key.kms.server.MiniKMS.start(MiniKMS.java:173)
	at org.apache.hadoop.hdfs.TestEncryptionZonesWithKMS.setup(TestEncryptionZonesWithKMS.java:55)


FAILED:  org.apache.hadoop.hdfs.TestEncryptionZonesWithKMS.testEncryptionZonesOnRelativePath

Error Message:
Can not read resource file 'mini-kms-acls-default.xml'

Stack Trace:
java.io.IOException: Can not read resource file 'mini-kms-acls-default.xml'
	at org.apache.hadoop.util.ThreadUtil.getResourceAsStream(ThreadUtil.java:74)
	at org.apache.hadoop.crypto.key.kms.server.MiniKMS.copyResource(MiniKMS.java:159)
	at org.apache.hadoop.crypto.key.kms.server.MiniKMS.start(MiniKMS.java:173)
	at org.apache.hadoop.hdfs.TestEncryptionZonesWithKMS.setup(TestEncryptionZonesWithKMS.java:55)


FAILED:  org.apache.hadoop.hdfs.TestEncryptionZonesWithKMS.testEncryptionZonesWithSymlinks

Error Message:
Can not read resource file 'mini-kms-acls-default.xml'

Stack Trace:
java.io.IOException: Can not read resource file 'mini-kms-acls-default.xml'
	at org.apache.hadoop.util.ThreadUtil.getResourceAsStream(ThreadUtil.java:74)
	at org.apache.hadoop.crypto.key.kms.server.MiniKMS.copyResource(MiniKMS.java:159)
	at org.apache.hadoop.crypto.key.kms.server.MiniKMS.start(MiniKMS.java:173)
	at org.apache.hadoop.hdfs.TestEncryptionZonesWithKMS.setup(TestEncryptionZonesWithKMS.java:55)


FAILED:  org.apache.hadoop.hdfs.TestEncryptionZonesWithKMS.testIsEncryptedMethod

Error Message:
Can not read resource file 'mini-kms-acls-default.xml'

Stack Trace:
java.io.IOException: Can not read resource file 'mini-kms-acls-default.xml'
	at org.apache.hadoop.util.ThreadUtil.getResourceAsStream(ThreadUtil.java:74)
	at org.apache.hadoop.crypto.key.kms.server.MiniKMS.copyResource(MiniKMS.java:159)
	at org.apache.hadoop.crypto.key.kms.server.MiniKMS.start(MiniKMS.java:173)
	at org.apache.hadoop.hdfs.TestEncryptionZonesWithKMS.setup(TestEncryptionZonesWithKMS.java:55)


FAILED:  org.apache.hadoop.hdfs.TestRecoverStripedFile.testRecoverThreeDataBlocks1

Error Message:
expected:<131072> but was:<0>

Stack Trace:
java.lang.AssertionError: expected:<131072> but was:<0>
	at org.junit.Assert.fail(Assert.java:88)
	at org.junit.Assert.failNotEquals(Assert.java:743)
	at org.junit.Assert.assertEquals(Assert.java:118)
	at org.junit.Assert.assertEquals(Assert.java:555)
	at org.junit.Assert.assertEquals(Assert.java:542)
	at org.apache.hadoop.hdfs.TestRecoverStripedFile.assertFileBlocksRecovery(TestRecoverStripedFile.java:345)
	at org.apache.hadoop.hdfs.TestRecoverStripedFile.testRecoverThreeDataBlocks1(TestRecoverStripedFile.java:159)


FAILED:  org.apache.hadoop.hdfs.TestRecoverStripedFile.testRecoverThreeDataBlocks

Error Message:
expected:<131072> but was:<0>

Stack Trace:
java.lang.AssertionError: expected:<131072> but was:<0>
	at org.junit.Assert.fail(Assert.java:88)
	at org.junit.Assert.failNotEquals(Assert.java:743)
	at org.junit.Assert.assertEquals(Assert.java:118)
	at org.junit.Assert.assertEquals(Assert.java:555)
	at org.junit.Assert.assertEquals(Assert.java:542)
	at org.apache.hadoop.hdfs.TestRecoverStripedFile.assertFileBlocksRecovery(TestRecoverStripedFile.java:345)
	at org.apache.hadoop.hdfs.TestRecoverStripedFile.testRecoverThreeDataBlocks(TestRecoverStripedFile.java:152)


FAILED:  org.apache.hadoop.hdfs.TestRollingUpgrade.testCheckpointWithMultipleNN

Error Message:
Test resulted in an unexpected exit

Stack Trace:
java.lang.AssertionError: Test resulted in an unexpected exit
	at org.apache.hadoop.hdfs.MiniDFSCluster.shutdown(MiniDFSCluster.java:1895)
	at org.apache.hadoop.hdfs.MiniDFSCluster.shutdown(MiniDFSCluster.java:1882)
	at org.apache.hadoop.hdfs.MiniDFSCluster.shutdown(MiniDFSCluster.java:1875)
	at org.apache.hadoop.hdfs.qjournal.MiniQJMHACluster.shutdown(MiniQJMHACluster.java:168)
	at org.apache.hadoop.hdfs.TestRollingUpgrade.testCheckpoint(TestRollingUpgrade.java:602)
	at org.apache.hadoop.hdfs.TestRollingUpgrade.testCheckpointWithMultipleNN(TestRollingUpgrade.java:566)


FAILED:  org.apache.hadoop.hdfs.TestRollingUpgrade.testDFSAdminRollingUpgradeCommands

Error Message:
expected null, but was:<javax.management.openmbean.CompositeDataSupport(compositeType=javax.management.openmbean.CompositeType(name=org.apache.hadoop.hdfs.protocol.RollingUpgradeInfo$Bean,items=((itemName=blockPoolId,itemType=javax.management.openmbean.SimpleType(name=java.lang.String)),(itemName=createdRollbackImages,itemType=javax.management.openmbean.SimpleType(name=java.lang.Boolean)),(itemName=finalizeTime,itemType=javax.management.openmbean.SimpleType(name=java.lang.Long)),(itemName=startTime,itemType=javax.management.openmbean.SimpleType(name=java.lang.Long)))),contents={blockPoolId=BP-1805732511-67.195.81.152-1453766458843,
createdRollbackImages=true, finalizeTime=0, startTime=1453766461468})>

Stack Trace:
java.lang.AssertionError: expected null, but was:<javax.management.openmbean.CompositeDataSupport(compositeType=javax.management.openmbean.CompositeType(name=org.apache.hadoop.hdfs.protocol.RollingUpgradeInfo$Bean,items=((itemName=blockPoolId,itemType=javax.management.openmbean.SimpleType(name=java.lang.String)),(itemName=createdRollbackImages,itemType=javax.management.openmbean.SimpleType(name=java.lang.Boolean)),(itemName=finalizeTime,itemType=javax.management.openmbean.SimpleType(name=java.lang.Long)),(itemName=startTime,itemType=javax.management.openmbean.SimpleType(name=java.lang.Long)))),contents={blockPoolId=BP-1805732511-67.195.81.152-1453766458843,
createdRollbackImages=true, finalizeTime=0, startTime=1453766461468})>
	at org.junit.Assert.fail(Assert.java:88)
	at org.junit.Assert.failNotNull(Assert.java:664)
	at org.junit.Assert.assertNull(Assert.java:646)
	at org.junit.Assert.assertNull(Assert.java:656)
	at org.apache.hadoop.hdfs.TestRollingUpgrade.checkMxBeanIsNull(TestRollingUpgrade.java:294)
	at org.apache.hadoop.hdfs.TestRollingUpgrade.testDFSAdminRollingUpgradeCommands(TestRollingUpgrade.java:101)


FAILED:  org.apache.hadoop.hdfs.TestRollingUpgrade.testRollback

Error Message:
expected null, but was:<javax.management.openmbean.CompositeDataSupport(compositeType=javax.management.openmbean.CompositeType(name=org.apache.hadoop.hdfs.protocol.RollingUpgradeInfo$Bean,items=((itemName=blockPoolId,itemType=javax.management.openmbean.SimpleType(name=java.lang.String)),(itemName=createdRollbackImages,itemType=javax.management.openmbean.SimpleType(name=java.lang.Boolean)),(itemName=finalizeTime,itemType=javax.management.openmbean.SimpleType(name=java.lang.Long)),(itemName=startTime,itemType=javax.management.openmbean.SimpleType(name=java.lang.Long)))),contents={blockPoolId=BP-1805732511-67.195.81.152-1453766458843,
createdRollbackImages=true, finalizeTime=0, startTime=1453766461468})>

Stack Trace:
java.lang.AssertionError: expected null, but was:<javax.management.openmbean.CompositeDataSupport(compositeType=javax.management.openmbean.CompositeType(name=org.apache.hadoop.hdfs.protocol.RollingUpgradeInfo$Bean,items=((itemName=blockPoolId,itemType=javax.management.openmbean.SimpleType(name=java.lang.String)),(itemName=createdRollbackImages,itemType=javax.management.openmbean.SimpleType(name=java.lang.Boolean)),(itemName=finalizeTime,itemType=javax.management.openmbean.SimpleType(name=java.lang.Long)),(itemName=startTime,itemType=javax.management.openmbean.SimpleType(name=java.lang.Long)))),contents={blockPoolId=BP-1805732511-67.195.81.152-1453766458843,
createdRollbackImages=true, finalizeTime=0, startTime=1453766461468})>
	at org.junit.Assert.fail(Assert.java:88)
	at org.junit.Assert.failNotNull(Assert.java:664)
	at org.junit.Assert.assertNull(Assert.java:646)
	at org.junit.Assert.assertNull(Assert.java:656)
	at org.apache.hadoop.hdfs.TestRollingUpgrade.checkMxBeanIsNull(TestRollingUpgrade.java:294)
	at org.apache.hadoop.hdfs.TestRollingUpgrade.testRollback(TestRollingUpgrade.java:323)



Mime
  • Unnamed multipart/mixed (inline, None, 0 bytes)
View raw message