hadoop-hdfs-dev mailing list archives

Site index · List index
Message view « Date » · « Thread »
Top « Date » · « Thread »
From Apache Jenkins Server <jenk...@builds.apache.org>
Subject Hadoop-Hdfs-trunk - Build # 2639 - Still Failing
Date Fri, 18 Dec 2015 01:16:45 GMT
See https://builds.apache.org/job/Hadoop-Hdfs-trunk/2639/

###################################################################################
########################## LAST 60 LINES OF THE CONSOLE ###########################
[...truncated 6462 lines...]
[INFO] --- maven-antrun-plugin:1.7:run (create-testdirs) @ hadoop-hdfs-project ---
[INFO] Executing tasks

main:
    [mkdir] Created dir: /home/jenkins/jenkins-slave/workspace/Hadoop-Hdfs-trunk/hadoop-hdfs-project/target/test-dir
[INFO] Executed tasks
[INFO] 
[INFO] --- maven-source-plugin:2.3:jar-no-fork (hadoop-java-sources) @ hadoop-hdfs-project
---
[INFO] 
[INFO] --- maven-source-plugin:2.3:test-jar-no-fork (hadoop-java-sources) @ hadoop-hdfs-project
---
[INFO] 
[INFO] --- maven-enforcer-plugin:1.3.1:enforce (dist-enforce) @ hadoop-hdfs-project ---
[INFO] 
[INFO] --- maven-site-plugin:3.4:attach-descriptor (attach-descriptor) @ hadoop-hdfs-project
---
[INFO] 
[INFO] --- maven-javadoc-plugin:2.8.1:jar (module-javadocs) @ hadoop-hdfs-project ---
[INFO] Skipping javadoc generation
[INFO] 
[INFO] --- maven-enforcer-plugin:1.3.1:enforce (depcheck) @ hadoop-hdfs-project ---
[INFO] 
[INFO] --- maven-checkstyle-plugin:2.15:checkstyle (default-cli) @ hadoop-hdfs-project ---
[INFO] 
[INFO] --- findbugs-maven-plugin:3.0.0:findbugs (default-cli) @ hadoop-hdfs-project ---
[INFO] ------------------------------------------------------------------------
[INFO] Reactor Summary:
[INFO] 
[INFO] Apache Hadoop HDFS Client ......................... SUCCESS [04:03 min]
[INFO] Apache Hadoop HDFS ................................ FAILURE [  03:11 h]
[INFO] Apache Hadoop HDFS Native Client .................. SKIPPED
[INFO] Apache Hadoop HttpFS .............................. SKIPPED
[INFO] Apache Hadoop HDFS BookKeeper Journal ............. SKIPPED
[INFO] Apache Hadoop HDFS-NFS ............................ SKIPPED
[INFO] Apache Hadoop HDFS Project ........................ SUCCESS [  0.058 s]
[INFO] ------------------------------------------------------------------------
[INFO] BUILD FAILURE
[INFO] ------------------------------------------------------------------------
[INFO] Total time: 03:15 h
[INFO] Finished at: 2015-12-18T01:16:36+00:00
[INFO] Final Memory: 56M/746M
[INFO] ------------------------------------------------------------------------
[ERROR] Failed to execute goal org.apache.maven.plugins:maven-surefire-plugin:2.17:test (default-test)
on project hadoop-hdfs: There are test failures.
[ERROR] 
[ERROR] Please refer to /home/jenkins/jenkins-slave/workspace/Hadoop-Hdfs-trunk/hadoop-hdfs-project/hadoop-hdfs/target/surefire-reports
for the individual test results.
[ERROR] -> [Help 1]
[ERROR] 
[ERROR] To see the full stack trace of the errors, re-run Maven with the -e switch.
[ERROR] Re-run Maven using the -X switch to enable full debug logging.
[ERROR] 
[ERROR] For more information about the errors and possible solutions, please read the following
articles:
[ERROR] [Help 1] http://cwiki.apache.org/confluence/display/MAVEN/MojoFailureException
[ERROR] 
[ERROR] After correcting the problems, you can resume the build with the command
[ERROR]   mvn <goals> -rf :hadoop-hdfs
Build step 'Execute shell' marked build as failure
Archiving artifacts
Recording test results
Sending e-mails to: hdfs-dev@hadoop.apache.org
Email was triggered for: Failure - Any
Sending email for trigger: Failure - Any



###################################################################################
############################## FAILED TESTS (if any) ##############################
4 tests failed.
FAILED:  org.apache.hadoop.hdfs.TestParallelRead.testParallelNoChecksums

Error Message:
Check log for errors

Stack Trace:
java.lang.AssertionError: Check log for errors
	at org.junit.Assert.fail(Assert.java:88)
	at org.apache.hadoop.hdfs.TestParallelReadUtil.runTestWorkload(TestParallelReadUtil.java:382)
	at org.apache.hadoop.hdfs.TestParallelReadUtil.testParallelNoChecksums(TestParallelReadUtil.java:421)
	at sun.reflect.NativeMethodAccessorImpl.invoke0(Native Method)
	at sun.reflect.NativeMethodAccessorImpl.invoke(NativeMethodAccessorImpl.java:57)
	at sun.reflect.DelegatingMethodAccessorImpl.invoke(DelegatingMethodAccessorImpl.java:43)
	at java.lang.reflect.Method.invoke(Method.java:606)
	at org.junit.runners.model.FrameworkMethod$1.runReflectiveCall(FrameworkMethod.java:47)
	at org.junit.internal.runners.model.ReflectiveCallable.run(ReflectiveCallable.java:12)
	at org.junit.runners.model.FrameworkMethod.invokeExplosively(FrameworkMethod.java:44)
	at org.junit.internal.runners.statements.InvokeMethod.evaluate(InvokeMethod.java:17)
	at org.junit.runners.ParentRunner.runLeaf(ParentRunner.java:271)
	at org.junit.runners.BlockJUnit4ClassRunner.runChild(BlockJUnit4ClassRunner.java:70)
	at org.junit.runners.BlockJUnit4ClassRunner.runChild(BlockJUnit4ClassRunner.java:50)
	at org.junit.runners.ParentRunner$3.run(ParentRunner.java:238)
	at org.junit.runners.ParentRunner$1.schedule(ParentRunner.java:63)
	at org.junit.runners.ParentRunner.runChildren(ParentRunner.java:236)
	at org.junit.runners.ParentRunner.access$000(ParentRunner.java:53)
	at org.junit.runners.ParentRunner$2.evaluate(ParentRunner.java:229)
	at org.junit.internal.runners.statements.RunBefores.evaluate(RunBefores.java:26)
	at org.junit.internal.runners.statements.RunAfters.evaluate(RunAfters.java:27)
	at org.junit.runners.ParentRunner.run(ParentRunner.java:309)
	at org.apache.maven.surefire.junit4.JUnit4Provider.execute(JUnit4Provider.java:264)
	at org.apache.maven.surefire.junit4.JUnit4Provider.executeTestSet(JUnit4Provider.java:153)
	at org.apache.maven.surefire.junit4.JUnit4Provider.invoke(JUnit4Provider.java:124)
	at org.apache.maven.surefire.booter.ForkedBooter.invokeProviderInSameClassLoader(ForkedBooter.java:200)
	at org.apache.maven.surefire.booter.ForkedBooter.runSuitesInProcess(ForkedBooter.java:153)
	at org.apache.maven.surefire.booter.ForkedBooter.main(ForkedBooter.java:103)


FAILED:  org.apache.hadoop.hdfs.TestParallelRead.org.apache.hadoop.hdfs.TestParallelRead

Error Message:
org/apache/hadoop/util/IntrusiveCollection$IntrusiveIterator

Stack Trace:
java.lang.NoClassDefFoundError: org/apache/hadoop/util/IntrusiveCollection$IntrusiveIterator
	at org.apache.hadoop.util.IntrusiveCollection.iterator(IntrusiveCollection.java:213)
	at org.apache.hadoop.util.IntrusiveCollection.clear(IntrusiveCollection.java:368)
	at org.apache.hadoop.hdfs.server.blockmanagement.DatanodeManager.clearPendingCachingCommands(DatanodeManager.java:1571)
	at org.apache.hadoop.hdfs.server.namenode.FSNamesystem.stopActiveServices(FSNamesystem.java:1185)
	at org.apache.hadoop.hdfs.server.namenode.FSNamesystem.close(FSNamesystem.java:1531)
	at org.apache.hadoop.hdfs.server.namenode.NameNode.stopCommonServices(NameNode.java:774)
	at org.apache.hadoop.hdfs.server.namenode.NameNode.stop(NameNode.java:953)
	at org.apache.hadoop.hdfs.MiniDFSCluster.shutdown(MiniDFSCluster.java:1913)
	at org.apache.hadoop.hdfs.MiniDFSCluster.shutdown(MiniDFSCluster.java:1882)
	at org.apache.hadoop.hdfs.MiniDFSCluster.shutdown(MiniDFSCluster.java:1875)
	at org.apache.hadoop.hdfs.BlockReaderTestUtil.shutdown(BlockReaderTestUtil.java:93)
	at org.apache.hadoop.hdfs.TestParallelReadUtil.teardownCluster(TestParallelReadUtil.java:393)
	at org.apache.hadoop.hdfs.TestParallelRead.teardownCluster(TestParallelRead.java:42)


FAILED:  org.apache.hadoop.hdfs.qjournal.client.TestQuorumJournalManager.testChangeWritersLogsOutOfSync3

Error Message:
Got too many exceptions to achieve quorum size 2/3. 1 successful responses:
127.0.0.1:53387: null [success]
2 exceptions thrown:
127.0.0.1:60274: Call From asf901.gq1.ygridcore.net/67.195.81.145 to localhost:60274 failed
on connection exception: java.net.ConnectException: Connection refused; For more details see:
 http://wiki.apache.org/hadoop/ConnectionRefused
127.0.0.1:59028: Read timed out
 at java.net.SocketInputStream.socketRead0(Native Method)
 at java.net.SocketInputStream.read(SocketInputStream.java:152)
 at java.net.SocketInputStream.read(SocketInputStream.java:122)
 at java.io.BufferedInputStream.fill(BufferedInputStream.java:235)
 at java.io.BufferedInputStream.read1(BufferedInputStream.java:275)
 at java.io.BufferedInputStream.read(BufferedInputStream.java:334)
 at sun.net.www.http.HttpClient.parseHTTPHeader(HttpClient.java:687)
 at sun.net.www.http.HttpClient.parseHTTP(HttpClient.java:633)
 at sun.net.www.protocol.http.HttpURLConnection.getInputStream(HttpURLConnection.java:1323)
 at java.net.HttpURLConnection.getResponseCode(HttpURLConnection.java:468)
 at org.apache.hadoop.hdfs.server.namenode.TransferFsImage.doGetUrl(TransferFsImage.java:438)
 at org.apache.hadoop.hdfs.qjournal.server.Journal$1.run(Journal.java:908)
 at org.apache.hadoop.hdfs.qjournal.server.Journal$1.run(Journal.java:898)
 at java.security.AccessController.doPrivileged(Native Method)
 at javax.security.auth.Subject.doAs(Subject.java:415)
 at org.apache.hadoop.security.UserGroupInformation.doAs(UserGroupInformation.java:1669)
 at org.apache.hadoop.security.SecurityUtil.doAsUser(SecurityUtil.java:477)
 at org.apache.hadoop.security.SecurityUtil.doAsLoginUser(SecurityUtil.java:458)
 at org.apache.hadoop.hdfs.qjournal.server.Journal.syncLog(Journal.java:897)
 at org.apache.hadoop.hdfs.qjournal.server.Journal.acceptRecovery(Journal.java:836)
 at org.apache.hadoop.hdfs.qjournal.server.JournalNodeRpcServer.acceptRecovery(JournalNodeRpcServer.java:206)
 at org.apache.hadoop.hdfs.qjournal.protocolPB.QJournalProtocolServerSideTranslatorPB.acceptRecovery(QJournalProtocolServerSideTranslatorPB.java:249)
 at org.apache.hadoop.hdfs.qjournal.protocol.QJournalProtocolProtos$QJournalProtocolService$2.callBlockingMethod(QJournalProtocolProtos.java:25435)
 at org.apache.hadoop.ipc.ProtobufRpcEngine$Server$ProtoBufRpcInvoker.call(ProtobufRpcEngine.java:637)
 at org.apache.hadoop.ipc.RPC$Server.call(RPC.java:976)
 at org.apache.hadoop.ipc.Server$Handler$1.run(Server.java:2305)
 at org.apache.hadoop.ipc.Server$Handler$1.run(Server.java:2301)
 at java.security.AccessController.doPrivileged(Native Method)
 at javax.security.auth.Subject.doAs(Subject.java:415)
 at org.apache.hadoop.security.UserGroupInformation.doAs(UserGroupInformation.java:1669)
 at org.apache.hadoop.ipc.Server$Handler.run(Server.java:2299)


Stack Trace:
org.apache.hadoop.hdfs.qjournal.client.QuorumException: Got too many exceptions to achieve
quorum size 2/3. 1 successful responses:
127.0.0.1:53387: null [success]
2 exceptions thrown:
127.0.0.1:60274: Call From asf901.gq1.ygridcore.net/67.195.81.145 to localhost:60274 failed
on connection exception: java.net.ConnectException: Connection refused; For more details see:
 http://wiki.apache.org/hadoop/ConnectionRefused
127.0.0.1:59028: Read timed out
	at java.net.SocketInputStream.socketRead0(Native Method)
	at java.net.SocketInputStream.read(SocketInputStream.java:152)
	at java.net.SocketInputStream.read(SocketInputStream.java:122)
	at java.io.BufferedInputStream.fill(BufferedInputStream.java:235)
	at java.io.BufferedInputStream.read1(BufferedInputStream.java:275)
	at java.io.BufferedInputStream.read(BufferedInputStream.java:334)
	at sun.net.www.http.HttpClient.parseHTTPHeader(HttpClient.java:687)
	at sun.net.www.http.HttpClient.parseHTTP(HttpClient.java:633)
	at sun.net.www.protocol.http.HttpURLConnection.getInputStream(HttpURLConnection.java:1323)
	at java.net.HttpURLConnection.getResponseCode(HttpURLConnection.java:468)
	at org.apache.hadoop.hdfs.server.namenode.TransferFsImage.doGetUrl(TransferFsImage.java:438)
	at org.apache.hadoop.hdfs.qjournal.server.Journal$1.run(Journal.java:908)
	at org.apache.hadoop.hdfs.qjournal.server.Journal$1.run(Journal.java:898)
	at java.security.AccessController.doPrivileged(Native Method)
	at javax.security.auth.Subject.doAs(Subject.java:415)
	at org.apache.hadoop.security.UserGroupInformation.doAs(UserGroupInformation.java:1669)
	at org.apache.hadoop.security.SecurityUtil.doAsUser(SecurityUtil.java:477)
	at org.apache.hadoop.security.SecurityUtil.doAsLoginUser(SecurityUtil.java:458)
	at org.apache.hadoop.hdfs.qjournal.server.Journal.syncLog(Journal.java:897)
	at org.apache.hadoop.hdfs.qjournal.server.Journal.acceptRecovery(Journal.java:836)
	at org.apache.hadoop.hdfs.qjournal.server.JournalNodeRpcServer.acceptRecovery(JournalNodeRpcServer.java:206)
	at org.apache.hadoop.hdfs.qjournal.protocolPB.QJournalProtocolServerSideTranslatorPB.acceptRecovery(QJournalProtocolServerSideTranslatorPB.java:249)
	at org.apache.hadoop.hdfs.qjournal.protocol.QJournalProtocolProtos$QJournalProtocolService$2.callBlockingMethod(QJournalProtocolProtos.java:25435)
	at org.apache.hadoop.ipc.ProtobufRpcEngine$Server$ProtoBufRpcInvoker.call(ProtobufRpcEngine.java:637)
	at org.apache.hadoop.ipc.RPC$Server.call(RPC.java:976)
	at org.apache.hadoop.ipc.Server$Handler$1.run(Server.java:2305)
	at org.apache.hadoop.ipc.Server$Handler$1.run(Server.java:2301)
	at java.security.AccessController.doPrivileged(Native Method)
	at javax.security.auth.Subject.doAs(Subject.java:415)
	at org.apache.hadoop.security.UserGroupInformation.doAs(UserGroupInformation.java:1669)
	at org.apache.hadoop.ipc.Server$Handler.run(Server.java:2299)

	at org.apache.hadoop.hdfs.qjournal.client.QuorumException.create(QuorumException.java:81)
	at org.apache.hadoop.hdfs.qjournal.client.QuorumCall.rethrowException(QuorumCall.java:223)
	at org.apache.hadoop.hdfs.qjournal.client.AsyncLoggerSet.waitForWriteQuorum(AsyncLoggerSet.java:142)
	at org.apache.hadoop.hdfs.qjournal.client.QuorumJournalManager.recoverUnclosedSegment(QuorumJournalManager.java:345)
	at org.apache.hadoop.hdfs.qjournal.client.QuorumJournalManager.recoverUnfinalizedSegments(QuorumJournalManager.java:455)
	at org.apache.hadoop.hdfs.qjournal.client.TestQuorumJournalManager.doOutOfSyncTest(TestQuorumJournalManager.java:439)
	at org.apache.hadoop.hdfs.qjournal.client.TestQuorumJournalManager.testChangeWritersLogsOutOfSync3(TestQuorumJournalManager.java:422)


FAILED:  org.apache.hadoop.hdfs.server.namenode.TestNNThroughputBenchmark.testNNThroughput

Error Message:
Not replicated yet: /nnThroughputBenchmark/blockReport/ThroughputBenchDir0/ThroughputBench27

Stack Trace:
org.apache.hadoop.hdfs.server.namenode.NotReplicatedYetException: Not replicated yet: /nnThroughputBenchmark/blockReport/ThroughputBenchDir0/ThroughputBench27
	at org.apache.hadoop.hdfs.server.namenode.FSDirWriteFileOp.validateAddBlock(FSDirWriteFileOp.java:190)
	at org.apache.hadoop.hdfs.server.namenode.FSNamesystem.getAdditionalBlock(FSNamesystem.java:2379)
	at org.apache.hadoop.hdfs.server.namenode.NameNodeRpcServer.addBlock(NameNodeRpcServer.java:797)
	at org.apache.hadoop.hdfs.server.namenode.NNThroughputBenchmark$BlockReportStats.addBlocks(NNThroughputBenchmark.java:1184)
	at org.apache.hadoop.hdfs.server.namenode.NNThroughputBenchmark$BlockReportStats.generateInputs(NNThroughputBenchmark.java:1171)
	at org.apache.hadoop.hdfs.server.namenode.NNThroughputBenchmark$OperationStatsBase.benchmark(NNThroughputBenchmark.java:281)
	at org.apache.hadoop.hdfs.server.namenode.NNThroughputBenchmark.run(NNThroughputBenchmark.java:1519)
	at org.apache.hadoop.hdfs.server.namenode.NNThroughputBenchmark.runBenchmark(NNThroughputBenchmark.java:1422)
	at org.apache.hadoop.hdfs.server.namenode.TestNNThroughputBenchmark.testNNThroughput(TestNNThroughputBenchmark.java:53)



Mime
  • Unnamed multipart/mixed (inline, None, 0 bytes)
View raw message