hadoop-hdfs-dev mailing list archives

Site index · List index
Message view « Date » · « Thread »
Top « Date » · « Thread »
From Apache Jenkins Server <jenk...@builds.apache.org>
Subject Hadoop-Hdfs-trunk - Build # 2625 - Failure
Date Sat, 12 Dec 2015 15:06:03 GMT
See https://builds.apache.org/job/Hadoop-Hdfs-trunk/2625/

###################################################################################
########################## LAST 60 LINES OF THE CONSOLE ###########################
[...truncated 9128 lines...]
[INFO] --- maven-antrun-plugin:1.7:run (create-testdirs) @ hadoop-hdfs-project ---
[INFO] Executing tasks

main:
    [mkdir] Created dir: /home/jenkins/jenkins-slave/workspace/Hadoop-Hdfs-trunk/hadoop-hdfs-project/target/test-dir
[INFO] Executed tasks
[INFO] 
[INFO] --- maven-source-plugin:2.3:jar-no-fork (hadoop-java-sources) @ hadoop-hdfs-project
---
[INFO] 
[INFO] --- maven-source-plugin:2.3:test-jar-no-fork (hadoop-java-sources) @ hadoop-hdfs-project
---
[INFO] 
[INFO] --- maven-enforcer-plugin:1.3.1:enforce (dist-enforce) @ hadoop-hdfs-project ---
[INFO] 
[INFO] --- maven-site-plugin:3.4:attach-descriptor (attach-descriptor) @ hadoop-hdfs-project
---
[INFO] 
[INFO] --- maven-javadoc-plugin:2.8.1:jar (module-javadocs) @ hadoop-hdfs-project ---
[INFO] Skipping javadoc generation
[INFO] 
[INFO] --- maven-enforcer-plugin:1.3.1:enforce (depcheck) @ hadoop-hdfs-project ---
[INFO] 
[INFO] --- maven-checkstyle-plugin:2.15:checkstyle (default-cli) @ hadoop-hdfs-project ---
[INFO] 
[INFO] --- findbugs-maven-plugin:3.0.0:findbugs (default-cli) @ hadoop-hdfs-project ---
[INFO] ------------------------------------------------------------------------
[INFO] Reactor Summary:
[INFO] 
[INFO] Apache Hadoop HDFS Client ......................... SUCCESS [13:01 min]
[INFO] Apache Hadoop HDFS ................................ FAILURE [  07:22 h]
[INFO] Apache Hadoop HDFS Native Client .................. SKIPPED
[INFO] Apache Hadoop HttpFS .............................. SKIPPED
[INFO] Apache Hadoop HDFS BookKeeper Journal ............. SKIPPED
[INFO] Apache Hadoop HDFS-NFS ............................ SKIPPED
[INFO] Apache Hadoop HDFS Project ........................ SUCCESS [  0.215 s]
[INFO] ------------------------------------------------------------------------
[INFO] BUILD FAILURE
[INFO] ------------------------------------------------------------------------
[INFO] Total time: 07:35 h
[INFO] Finished at: 2015-12-12T15:05:43+00:00
[INFO] Final Memory: 56M/556M
[INFO] ------------------------------------------------------------------------
[ERROR] Failed to execute goal org.apache.maven.plugins:maven-surefire-plugin:2.17:test (default-test)
on project hadoop-hdfs: There are test failures.
[ERROR] 
[ERROR] Please refer to /home/jenkins/jenkins-slave/workspace/Hadoop-Hdfs-trunk/hadoop-hdfs-project/hadoop-hdfs/target/surefire-reports
for the individual test results.
[ERROR] -> [Help 1]
[ERROR] 
[ERROR] To see the full stack trace of the errors, re-run Maven with the -e switch.
[ERROR] Re-run Maven using the -X switch to enable full debug logging.
[ERROR] 
[ERROR] For more information about the errors and possible solutions, please read the following
articles:
[ERROR] [Help 1] http://cwiki.apache.org/confluence/display/MAVEN/MojoFailureException
[ERROR] 
[ERROR] After correcting the problems, you can resume the build with the command
[ERROR]   mvn <goals> -rf :hadoop-hdfs
Build step 'Execute shell' marked build as failure
Archiving artifacts
Recording test results
Sending e-mails to: hdfs-dev@hadoop.apache.org
Email was triggered for: Failure - Any
Sending email for trigger: Failure - Any



###################################################################################
############################## FAILED TESTS (if any) ##############################
14 tests failed.
FAILED:  org.apache.hadoop.hdfs.TestReadStripedFileWithDecoding.testReadCorruptedDataByDeleting

Error Message:
4 missing blocks, the stripe is: Offset=0, length=262144, fetchedChunksNum=0, missingChunksNum=4

Stack Trace:
java.io.IOException: 4 missing blocks, the stripe is: Offset=0, length=262144, fetchedChunksNum=0,
missingChunksNum=4
	at org.apache.hadoop.hdfs.DFSStripedInputStream$StripeReader.checkMissingBlocks(DFSStripedInputStream.java:604)
	at org.apache.hadoop.hdfs.DFSStripedInputStream$StripeReader.readParityChunks(DFSStripedInputStream.java:637)
	at org.apache.hadoop.hdfs.DFSStripedInputStream$StripeReader.readStripe(DFSStripedInputStream.java:752)
	at org.apache.hadoop.hdfs.DFSStripedInputStream.fetchBlockByteRange(DFSStripedInputStream.java:535)
	at org.apache.hadoop.hdfs.DFSInputStream.pread(DFSInputStream.java:1435)
	at org.apache.hadoop.hdfs.DFSInputStream.read(DFSInputStream.java:1401)
	at org.apache.hadoop.fs.FSInputStream.readFully(FSInputStream.java:78)
	at org.apache.hadoop.fs.FSDataInputStream.readFully(FSDataInputStream.java:107)
	at org.apache.hadoop.hdfs.StripedFileTestUtil.verifyPread(StripedFileTestUtil.java:112)
	at org.apache.hadoop.hdfs.TestReadStripedFileWithDecoding.verifyRead(TestReadStripedFileWithDecoding.java:161)
	at org.apache.hadoop.hdfs.TestReadStripedFileWithDecoding.testReadWithBlockCorrupted(TestReadStripedFileWithDecoding.java:320)
	at org.apache.hadoop.hdfs.TestReadStripedFileWithDecoding.testReadCorruptedDataByDeleting(TestReadStripedFileWithDecoding.java:136)


FAILED:  org.apache.hadoop.hdfs.qjournal.TestSecureNNWithQJM.testSecureMode

Error Message:
test timed out after 30000 milliseconds

Stack Trace:
java.lang.Exception: test timed out after 30000 milliseconds
	at java.lang.Object.wait(Native Method)
	at org.apache.hadoop.hdfs.qjournal.client.QuorumCall.waitFor(QuorumCall.java:146)
	at org.apache.hadoop.hdfs.qjournal.client.AsyncLoggerSet.waitForWriteQuorum(AsyncLoggerSet.java:127)
	at org.apache.hadoop.hdfs.qjournal.client.QuorumJournalManager.createNewUniqueEpoch(QuorumJournalManager.java:182)
	at org.apache.hadoop.hdfs.qjournal.client.QuorumJournalManager.recoverUnfinalizedSegments(QuorumJournalManager.java:436)
	at org.apache.hadoop.hdfs.server.namenode.JournalSet$8.apply(JournalSet.java:623)
	at org.apache.hadoop.hdfs.server.namenode.JournalSet.mapJournalsAndReportErrors(JournalSet.java:392)
	at org.apache.hadoop.hdfs.server.namenode.JournalSet.recoverUnfinalizedSegments(JournalSet.java:620)
	at org.apache.hadoop.hdfs.server.namenode.FSEditLog.recoverUnclosedStreams(FSEditLog.java:1500)
	at org.apache.hadoop.hdfs.server.namenode.FSImage.initEditLog(FSImage.java:761)
	at org.apache.hadoop.hdfs.server.namenode.FSImage.loadFSImage(FSImage.java:630)
	at org.apache.hadoop.hdfs.server.namenode.FSImage.recoverTransitionRead(FSImage.java:290)
	at org.apache.hadoop.hdfs.server.namenode.FSNamesystem.loadFSImage(FSNamesystem.java:946)
	at org.apache.hadoop.hdfs.server.namenode.FSNamesystem.loadFromDisk(FSNamesystem.java:656)
	at org.apache.hadoop.hdfs.server.namenode.NameNode.loadNamesystem(NameNode.java:621)
	at org.apache.hadoop.hdfs.server.namenode.NameNode.initialize(NameNode.java:678)
	at org.apache.hadoop.hdfs.server.namenode.NameNode.<init>(NameNode.java:884)
	at org.apache.hadoop.hdfs.server.namenode.NameNode.<init>(NameNode.java:863)
	at org.apache.hadoop.hdfs.server.namenode.NameNode.createNameNode(NameNode.java:1565)
	at org.apache.hadoop.hdfs.MiniDFSCluster.restartNameNode(MiniDFSCluster.java:2017)
	at org.apache.hadoop.hdfs.MiniDFSCluster.restartNameNode(MiniDFSCluster.java:1982)
	at org.apache.hadoop.hdfs.qjournal.TestSecureNNWithQJM.restartNameNode(TestSecureNNWithQJM.java:203)
	at org.apache.hadoop.hdfs.qjournal.TestSecureNNWithQJM.doNNWithQJMTest(TestSecureNNWithQJM.java:191)
	at org.apache.hadoop.hdfs.qjournal.TestSecureNNWithQJM.testSecureMode(TestSecureNNWithQJM.java:165)


FAILED:  org.apache.hadoop.hdfs.qjournal.TestSecureNNWithQJM.testSecondaryNameNodeHttpAddressNotNeeded

Error Message:
Error replaying edit log at offset 0.  Expected transaction ID was 6

Stack Trace:
org.apache.hadoop.hdfs.server.namenode.EditLogInputException: Error replaying edit log at
offset 0.  Expected transaction ID was 6
	at org.apache.hadoop.hdfs.server.namenode.RedundantEditLogInputStream.nextOp(RedundantEditLogInputStream.java:194)
	at org.apache.hadoop.hdfs.server.namenode.EditLogInputStream.readOp(EditLogInputStream.java:85)
	at org.apache.hadoop.hdfs.server.namenode.EditLogInputStream.skipUntil(EditLogInputStream.java:151)
	at org.apache.hadoop.hdfs.server.namenode.RedundantEditLogInputStream.nextOp(RedundantEditLogInputStream.java:178)
	at org.apache.hadoop.hdfs.server.namenode.EditLogInputStream.readOp(EditLogInputStream.java:85)
	at org.apache.hadoop.hdfs.server.namenode.FSEditLogLoader.loadEditRecords(FSEditLogLoader.java:194)
	at org.apache.hadoop.hdfs.server.namenode.FSEditLogLoader.loadFSEdits(FSEditLogLoader.java:147)
	at org.apache.hadoop.hdfs.server.namenode.FSImage.loadEdits(FSImage.java:831)
	at org.apache.hadoop.hdfs.server.namenode.FSImage.loadFSImage(FSImage.java:688)
	at org.apache.hadoop.hdfs.server.namenode.FSImage.recoverTransitionRead(FSImage.java:290)
	at org.apache.hadoop.hdfs.server.namenode.FSNamesystem.loadFSImage(FSNamesystem.java:946)
	at org.apache.hadoop.hdfs.server.namenode.FSNamesystem.loadFromDisk(FSNamesystem.java:656)
	at org.apache.hadoop.hdfs.server.namenode.NameNode.loadNamesystem(NameNode.java:621)
	at org.apache.hadoop.hdfs.server.namenode.NameNode.initialize(NameNode.java:678)
	at org.apache.hadoop.hdfs.server.namenode.NameNode.<init>(NameNode.java:884)
	at org.apache.hadoop.hdfs.server.namenode.NameNode.<init>(NameNode.java:863)
	at org.apache.hadoop.hdfs.server.namenode.NameNode.createNameNode(NameNode.java:1565)
	at org.apache.hadoop.hdfs.MiniDFSCluster.restartNameNode(MiniDFSCluster.java:2017)
	at org.apache.hadoop.hdfs.MiniDFSCluster.restartNameNode(MiniDFSCluster.java:1982)
	at org.apache.hadoop.hdfs.qjournal.TestSecureNNWithQJM.restartNameNode(TestSecureNNWithQJM.java:203)
	at org.apache.hadoop.hdfs.qjournal.TestSecureNNWithQJM.doNNWithQJMTest(TestSecureNNWithQJM.java:191)
	at org.apache.hadoop.hdfs.qjournal.TestSecureNNWithQJM.testSecondaryNameNodeHttpAddressNotNeeded(TestSecureNNWithQJM.java:171)


FAILED:  org.apache.hadoop.hdfs.security.TestDelegationTokenForProxyUser.testWebHdfsDoAs

Error Message:
test timed out after 5000 milliseconds

Stack Trace:
java.lang.Exception: test timed out after 5000 milliseconds
	at java.net.SocketInputStream.socketRead0(Native Method)
	at java.net.SocketInputStream.read(SocketInputStream.java:152)
	at java.net.SocketInputStream.read(SocketInputStream.java:122)
	at java.io.BufferedInputStream.fill(BufferedInputStream.java:235)
	at java.io.BufferedInputStream.read1(BufferedInputStream.java:275)
	at java.io.BufferedInputStream.read(BufferedInputStream.java:334)
	at sun.net.www.http.HttpClient.parseHTTPHeader(HttpClient.java:687)
	at sun.net.www.http.HttpClient.parseHTTPHeader(HttpClient.java:798)
	at sun.net.www.http.HttpClient.parseHTTP(HttpClient.java:633)
	at sun.net.www.protocol.http.HttpURLConnection.getInputStream(HttpURLConnection.java:1323)
	at java.net.HttpURLConnection.getResponseCode(HttpURLConnection.java:468)
	at org.apache.hadoop.hdfs.web.WebHdfsFileSystem.validateResponse(WebHdfsFileSystem.java:365)
	at org.apache.hadoop.hdfs.web.WebHdfsFileSystem.access$200(WebHdfsFileSystem.java:91)
	at org.apache.hadoop.hdfs.web.WebHdfsFileSystem$FsPathOutputStreamRunner$1.close(WebHdfsFileSystem.java:820)
	at org.apache.hadoop.hdfs.security.TestDelegationTokenForProxyUser.testWebHdfsDoAs(TestDelegationTokenForProxyUser.java:170)


FAILED:  org.apache.hadoop.hdfs.server.datanode.TestBlockReplacement.testDeletedBlockWhenAddBlockIsInEdit

Error Message:
The block should be only on 1 datanode  expected:<1> but was:<2>

Stack Trace:
java.lang.AssertionError: The block should be only on 1 datanode  expected:<1> but was:<2>
	at org.junit.Assert.fail(Assert.java:88)
	at org.junit.Assert.failNotEquals(Assert.java:743)
	at org.junit.Assert.assertEquals(Assert.java:118)
	at org.junit.Assert.assertEquals(Assert.java:555)
	at org.apache.hadoop.hdfs.server.datanode.TestBlockReplacement.testDeletedBlockWhenAddBlockIsInEdit(TestBlockReplacement.java:435)


FAILED:  org.apache.hadoop.hdfs.server.datanode.TestBlockReplacement.testBlockReplacement

Error Message:
Did not achieve expected replication to expected nodes after more than 20000 msec.  See logs
for details.

Stack Trace:
java.util.concurrent.TimeoutException: Did not achieve expected replication to expected nodes
after more than 20000 msec.  See logs for details.
	at org.apache.hadoop.hdfs.server.datanode.TestBlockReplacement.checkBlocks(TestBlockReplacement.java:297)
	at org.apache.hadoop.hdfs.server.datanode.TestBlockReplacement.testBlockReplacement(TestBlockReplacement.java:203)


FAILED:  org.apache.hadoop.hdfs.server.datanode.TestDataNodeVolumeFailure.testUnderReplicationAfterVolFailure

Error Message:
There is no under replicated block after volume failure

Stack Trace:
java.lang.AssertionError: There is no under replicated block after volume failure
	at org.junit.Assert.fail(Assert.java:88)
	at org.junit.Assert.assertTrue(Assert.java:41)
	at org.apache.hadoop.hdfs.server.datanode.TestDataNodeVolumeFailure.testUnderReplicationAfterVolFailure(TestDataNodeVolumeFailure.java:398)


FAILED:  org.apache.hadoop.hdfs.server.datanode.TestDirectoryScanner.testThrottling

Error Message:
test timed out after 300000 milliseconds

Stack Trace:
java.lang.Exception: test timed out after 300000 milliseconds
	at java.lang.Object.wait(Native Method)
	at java.lang.Object.wait(Object.java:503)
	at org.apache.hadoop.hdfs.DataStreamer.waitAndQueuePacket(DataStreamer.java:804)
	at org.apache.hadoop.hdfs.DFSOutputStream.enqueueCurrentPacket(DFSOutputStream.java:423)
	at org.apache.hadoop.hdfs.DFSOutputStream.enqueueCurrentPacketFull(DFSOutputStream.java:432)
	at org.apache.hadoop.hdfs.DFSOutputStream.writeChunk(DFSOutputStream.java:418)
	at org.apache.hadoop.fs.FSOutputSummer.writeChecksumChunks(FSOutputSummer.java:217)
	at org.apache.hadoop.fs.FSOutputSummer.write1(FSOutputSummer.java:125)
	at org.apache.hadoop.fs.FSOutputSummer.write(FSOutputSummer.java:111)
	at org.apache.hadoop.fs.FSDataOutputStream$PositionCache.write(FSDataOutputStream.java:57)
	at java.io.DataOutputStream.write(DataOutputStream.java:107)
	at org.apache.hadoop.hdfs.DFSTestUtil.createFile(DFSTestUtil.java:418)
	at org.apache.hadoop.hdfs.DFSTestUtil.createFile(DFSTestUtil.java:376)
	at org.apache.hadoop.hdfs.server.datanode.TestDirectoryScanner.createFile(TestDirectoryScanner.java:104)
	at org.apache.hadoop.hdfs.server.datanode.TestDirectoryScanner.testThrottling(TestDirectoryScanner.java:580)


FAILED:  org.apache.hadoop.hdfs.server.datanode.TestFsDatasetCache.testPageRounder

Error Message:
test timed out after 60000 milliseconds

Stack Trace:
java.lang.Exception: test timed out after 60000 milliseconds
	at java.lang.Thread.sleep(Native Method)
	at org.apache.hadoop.test.GenericTestUtils.waitFor(GenericTestUtils.java:183)
	at org.apache.hadoop.hdfs.DFSTestUtil.verifyExpectedCacheUsage(DFSTestUtil.java:1438)
	at org.apache.hadoop.hdfs.server.datanode.TestFsDatasetCache.testPageRounder(TestFsDatasetCache.java:472)


FAILED:  org.apache.hadoop.hdfs.server.datanode.fsdataset.impl.TestSpaceReservation.testTmpSpaceReserve

Error Message:
Wrong reserve space for Tmp  expected:<200> but was:<1000>

Stack Trace:
java.lang.AssertionError: Wrong reserve space for Tmp  expected:<200> but was:<1000>
	at org.junit.Assert.fail(Assert.java:88)
	at org.junit.Assert.failNotEquals(Assert.java:743)
	at org.junit.Assert.assertEquals(Assert.java:118)
	at org.junit.Assert.assertEquals(Assert.java:555)
	at org.apache.hadoop.hdfs.server.datanode.fsdataset.impl.TestSpaceReservation.testTmpSpaceReserve(TestSpaceReservation.java:454)


FAILED:  org.apache.hadoop.hdfs.server.namenode.TestFileTruncate.testTruncateWithDataNodesRestart

Error Message:
Timed out waiting for /test/testTruncateWithDataNodesRestart to reach 3 replicas

Stack Trace:
java.util.concurrent.TimeoutException: Timed out waiting for /test/testTruncateWithDataNodesRestart
to reach 3 replicas
	at org.apache.hadoop.hdfs.DFSTestUtil.waitReplication(DFSTestUtil.java:768)
	at org.apache.hadoop.hdfs.server.namenode.TestFileTruncate.testTruncateWithDataNodesRestart(TestFileTruncate.java:698)


FAILED:  org.apache.hadoop.hdfs.server.namenode.ha.TestRequestHedgingProxyProvider.testHedgingWhenOneFails

Error Message:

Wanted but not invoked:
namenodeProtocols.getStats();
-> at org.apache.hadoop.hdfs.server.namenode.ha.TestRequestHedgingProxyProvider.testHedgingWhenOneFails(TestRequestHedgingProxyProvider.java:78)
Actually, there were zero interactions with this mock.


Stack Trace:
org.mockito.exceptions.verification.WantedButNotInvoked: 
Wanted but not invoked:
namenodeProtocols.getStats();
-> at org.apache.hadoop.hdfs.server.namenode.ha.TestRequestHedgingProxyProvider.testHedgingWhenOneFails(TestRequestHedgingProxyProvider.java:78)
Actually, there were zero interactions with this mock.

	at org.apache.hadoop.hdfs.server.namenode.ha.TestRequestHedgingProxyProvider.testHedgingWhenOneFails(TestRequestHedgingProxyProvider.java:78)


FAILED:  org.apache.hadoop.hdfs.shortcircuit.TestShortCircuitCache.testDataXceiverCleansUpSlotsOnFailure

Error Message:
expected:<1> but was:<2>

Stack Trace:
java.lang.AssertionError: expected:<1> but was:<2>
	at org.junit.Assert.fail(Assert.java:88)
	at org.junit.Assert.failNotEquals(Assert.java:743)
	at org.junit.Assert.assertEquals(Assert.java:118)
	at org.junit.Assert.assertEquals(Assert.java:555)
	at org.junit.Assert.assertEquals(Assert.java:542)
	at org.apache.hadoop.hdfs.shortcircuit.TestShortCircuitCache$17.accept(TestShortCircuitCache.java:633)
	at org.apache.hadoop.hdfs.server.datanode.ShortCircuitRegistry.visit(ShortCircuitRegistry.java:395)
	at org.apache.hadoop.hdfs.shortcircuit.TestShortCircuitCache.checkNumberOfSegmentsAndSlots(TestShortCircuitCache.java:628)
	at org.apache.hadoop.hdfs.shortcircuit.TestShortCircuitCache.testDataXceiverCleansUpSlotsOnFailure(TestShortCircuitCache.java:682)


FAILED:  org.apache.hadoop.tracing.TestTracing.testTracing

Error Message:
expected:<9013978194353249336> but was:<5178288772254918946>

Stack Trace:
java.lang.AssertionError: expected:<9013978194353249336> but was:<5178288772254918946>
	at org.junit.Assert.fail(Assert.java:88)
	at org.junit.Assert.failNotEquals(Assert.java:743)
	at org.junit.Assert.assertEquals(Assert.java:118)
	at org.junit.Assert.assertEquals(Assert.java:555)
	at org.junit.Assert.assertEquals(Assert.java:542)
	at org.apache.hadoop.tracing.TestTracing.readWithTracing(TestTracing.java:177)
	at org.apache.hadoop.tracing.TestTracing.testTracing(TestTracing.java:80)



Mime
  • Unnamed multipart/mixed (inline, None, 0 bytes)
View raw message