hadoop-hdfs-dev mailing list archives

Site index · List index
Message view « Date » · « Thread »
Top « Date » · « Thread »
From Apache Jenkins Server <jenk...@builds.apache.org>
Subject Hadoop-Hdfs-trunk - Build # 2648 - Still Failing
Date Sun, 20 Dec 2015 22:22:04 GMT
See https://builds.apache.org/job/Hadoop-Hdfs-trunk/2648/

###################################################################################
########################## LAST 60 LINES OF THE CONSOLE ###########################
[...truncated 10032 lines...]
[INFO] --- maven-antrun-plugin:1.7:run (create-testdirs) @ hadoop-hdfs-project ---
[INFO] Executing tasks

main:
    [mkdir] Created dir: /home/jenkins/jenkins-slave/workspace/Hadoop-Hdfs-trunk/hadoop-hdfs-project/target/test-dir
[INFO] Executed tasks
[INFO] 
[INFO] --- maven-source-plugin:2.3:jar-no-fork (hadoop-java-sources) @ hadoop-hdfs-project
---
[INFO] 
[INFO] --- maven-source-plugin:2.3:test-jar-no-fork (hadoop-java-sources) @ hadoop-hdfs-project
---
[INFO] 
[INFO] --- maven-enforcer-plugin:1.3.1:enforce (dist-enforce) @ hadoop-hdfs-project ---
[INFO] 
[INFO] --- maven-site-plugin:3.4:attach-descriptor (attach-descriptor) @ hadoop-hdfs-project
---
[INFO] 
[INFO] --- maven-javadoc-plugin:2.8.1:jar (module-javadocs) @ hadoop-hdfs-project ---
[INFO] Skipping javadoc generation
[INFO] 
[INFO] --- maven-enforcer-plugin:1.3.1:enforce (depcheck) @ hadoop-hdfs-project ---
[INFO] 
[INFO] --- maven-checkstyle-plugin:2.15:checkstyle (default-cli) @ hadoop-hdfs-project ---
[INFO] 
[INFO] --- findbugs-maven-plugin:3.0.0:findbugs (default-cli) @ hadoop-hdfs-project ---
[INFO] ------------------------------------------------------------------------
[INFO] Reactor Summary:
[INFO] 
[INFO] Apache Hadoop HDFS Client ......................... SUCCESS [09:06 min]
[INFO] Apache Hadoop HDFS ................................ FAILURE [  06:12 h]
[INFO] Apache Hadoop HDFS Native Client .................. SKIPPED
[INFO] Apache Hadoop HttpFS .............................. SKIPPED
[INFO] Apache Hadoop HDFS BookKeeper Journal ............. SKIPPED
[INFO] Apache Hadoop HDFS-NFS ............................ SKIPPED
[INFO] Apache Hadoop HDFS Project ........................ SUCCESS [ 12.799 s]
[INFO] ------------------------------------------------------------------------
[INFO] BUILD FAILURE
[INFO] ------------------------------------------------------------------------
[INFO] Total time: 06:21 h
[INFO] Finished at: 2015-12-20T22:18:01+00:00
[INFO] Final Memory: 56M/832M
[INFO] ------------------------------------------------------------------------
[ERROR] Failed to execute goal org.apache.maven.plugins:maven-surefire-plugin:2.17:test (default-test)
on project hadoop-hdfs: There are test failures.
[ERROR] 
[ERROR] Please refer to /home/jenkins/jenkins-slave/workspace/Hadoop-Hdfs-trunk/hadoop-hdfs-project/hadoop-hdfs/target/surefire-reports
for the individual test results.
[ERROR] -> [Help 1]
[ERROR] 
[ERROR] To see the full stack trace of the errors, re-run Maven with the -e switch.
[ERROR] Re-run Maven using the -X switch to enable full debug logging.
[ERROR] 
[ERROR] For more information about the errors and possible solutions, please read the following
articles:
[ERROR] [Help 1] http://cwiki.apache.org/confluence/display/MAVEN/MojoFailureException
[ERROR] 
[ERROR] After correcting the problems, you can resume the build with the command
[ERROR]   mvn <goals> -rf :hadoop-hdfs
Build step 'Execute shell' marked build as failure
Archiving artifacts
Recording test results
Sending e-mails to: hdfs-dev@hadoop.apache.org
Email was triggered for: Failure - Any
Sending email for trigger: Failure - Any



###################################################################################
############################## FAILED TESTS (if any) ##############################
10 tests failed.
FAILED:  org.apache.hadoop.hdfs.TestEncryptionZones.testStartFileRetry

Error Message:
test timed out after 120000 milliseconds

Stack Trace:
java.lang.Exception: test timed out after 120000 milliseconds
	at sun.misc.Unsafe.park(Native Method)
	at java.util.concurrent.locks.LockSupport.park(LockSupport.java:186)
	at java.util.concurrent.locks.AbstractQueuedSynchronizer.parkAndCheckInterrupt(AbstractQueuedSynchronizer.java:834)
	at java.util.concurrent.locks.AbstractQueuedSynchronizer.doAcquireSharedInterruptibly(AbstractQueuedSynchronizer.java:994)
	at java.util.concurrent.locks.AbstractQueuedSynchronizer.acquireSharedInterruptibly(AbstractQueuedSynchronizer.java:1303)
	at java.util.concurrent.CountDownLatch.await(CountDownLatch.java:236)
	at org.apache.hadoop.hdfs.TestEncryptionZones.testStartFileRetry(TestEncryptionZones.java:1094)


FAILED:  org.apache.hadoop.hdfs.TestRollingUpgrade.testRollback

Error Message:
Test resulted in an unexpected exit

Stack Trace:
java.lang.AssertionError: Test resulted in an unexpected exit
	at org.apache.hadoop.hdfs.MiniDFSCluster.shutdown(MiniDFSCluster.java:1895)
	at org.apache.hadoop.hdfs.MiniDFSCluster.shutdown(MiniDFSCluster.java:1882)
	at org.apache.hadoop.hdfs.MiniDFSCluster.shutdown(MiniDFSCluster.java:1875)
	at org.apache.hadoop.hdfs.TestRollingUpgrade.testRollback(TestRollingUpgrade.java:350)


FAILED:  org.apache.hadoop.hdfs.security.TestDelegationTokenForProxyUser.testWebHdfsDoAs

Error Message:
test timed out after 5000 milliseconds

Stack Trace:
java.lang.Exception: test timed out after 5000 milliseconds
	at java.util.HashMap.inflateTable(HashMap.java:320)
	at java.util.HashMap.putAll(HashMap.java:623)
	at org.codehaus.jackson.map.introspect.POJOPropertiesCollector._sortProperties(POJOPropertiesCollector.java:318)
	at org.codehaus.jackson.map.introspect.POJOPropertiesCollector.collect(POJOPropertiesCollector.java:248)
	at org.codehaus.jackson.map.introspect.BasicClassIntrospector.collectProperties(BasicClassIntrospector.java:160)
	at org.codehaus.jackson.map.introspect.BasicClassIntrospector.forCreation(BasicClassIntrospector.java:119)
	at org.codehaus.jackson.map.introspect.BasicClassIntrospector.forCreation(BasicClassIntrospector.java:16)
	at org.codehaus.jackson.map.DeserializationConfig.introspectForCreation(DeserializationConfig.java:877)
	at org.codehaus.jackson.map.deser.BasicDeserializerFactory.createMapDeserializer(BasicDeserializerFactory.java:430)
	at org.codehaus.jackson.map.deser.StdDeserializerProvider._createDeserializer(StdDeserializerProvider.java:380)
	at org.codehaus.jackson.map.deser.StdDeserializerProvider._createAndCache2(StdDeserializerProvider.java:310)
	at org.codehaus.jackson.map.deser.StdDeserializerProvider._createAndCacheValueDeserializer(StdDeserializerProvider.java:290)
	at org.codehaus.jackson.map.deser.StdDeserializerProvider.findValueDeserializer(StdDeserializerProvider.java:159)
	at org.codehaus.jackson.map.deser.StdDeserializerProvider.findTypedValueDeserializer(StdDeserializerProvider.java:180)
	at org.codehaus.jackson.map.ObjectReader._findRootDeserializer(ObjectReader.java:854)
	at org.codehaus.jackson.map.ObjectReader._bindAndClose(ObjectReader.java:763)
	at org.codehaus.jackson.map.ObjectReader.readValue(ObjectReader.java:434)
	at org.apache.hadoop.hdfs.web.WebHdfsFileSystem.jsonParse(WebHdfsFileSystem.java:356)
	at org.apache.hadoop.hdfs.web.WebHdfsFileSystem$FsPathResponseRunner.getResponse(WebHdfsFileSystem.java:761)
	at org.apache.hadoop.hdfs.web.WebHdfsFileSystem$AbstractRunner.runWithRetry(WebHdfsFileSystem.java:643)
	at org.apache.hadoop.hdfs.web.WebHdfsFileSystem$AbstractRunner.access$100(WebHdfsFileSystem.java:490)
	at org.apache.hadoop.hdfs.web.WebHdfsFileSystem$AbstractRunner$1.run(WebHdfsFileSystem.java:520)
	at java.security.AccessController.doPrivileged(Native Method)
	at javax.security.auth.Subject.doAs(Subject.java:415)
	at org.apache.hadoop.security.UserGroupInformation.doAs(UserGroupInformation.java:1669)
	at org.apache.hadoop.hdfs.web.WebHdfsFileSystem$AbstractRunner.run(WebHdfsFileSystem.java:516)
	at org.apache.hadoop.hdfs.web.WebHdfsFileSystem.getHdfsFileStatus(WebHdfsFileSystem.java:872)
	at org.apache.hadoop.hdfs.web.WebHdfsFileSystem.getFileStatus(WebHdfsFileSystem.java:887)
	at org.apache.hadoop.hdfs.security.TestDelegationTokenForProxyUser.testWebHdfsDoAs(TestDelegationTokenForProxyUser.java:182)


FAILED:  org.apache.hadoop.hdfs.server.datanode.TestDataNodeMultipleRegistrations.testClusterIdMismatchAtStartupWithHA

Error Message:
test timed out after 20000 milliseconds

Stack Trace:
java.lang.Exception: test timed out after 20000 milliseconds
	at java.lang.Thread.sleep(Native Method)
	at org.mortbay.thread.QueuedThreadPool.doStop(QueuedThreadPool.java:435)
	at org.mortbay.component.AbstractLifeCycle.stop(AbstractLifeCycle.java:76)
	at org.mortbay.jetty.Server.doStop(Server.java:291)
	at org.mortbay.component.AbstractLifeCycle.stop(AbstractLifeCycle.java:76)
	at org.apache.hadoop.http.HttpServer2.stop(HttpServer2.java:952)
	at org.apache.hadoop.hdfs.server.namenode.NameNodeHttpServer.stop(NameNodeHttpServer.java:199)
	at org.apache.hadoop.hdfs.server.namenode.NameNode.stopHttpServer(NameNode.java:828)
	at org.apache.hadoop.hdfs.server.namenode.NameNode.stopCommonServices(NameNode.java:785)
	at org.apache.hadoop.hdfs.server.namenode.NameNode.stop(NameNode.java:953)
	at org.apache.hadoop.hdfs.MiniDFSCluster.shutdown(MiniDFSCluster.java:1913)
	at org.apache.hadoop.hdfs.MiniDFSCluster.shutdown(MiniDFSCluster.java:1882)
	at org.apache.hadoop.hdfs.MiniDFSCluster.shutdown(MiniDFSCluster.java:1875)
	at org.apache.hadoop.hdfs.server.datanode.TestDataNodeMultipleRegistrations.testClusterIdMismatchAtStartupWithHA(TestDataNodeMultipleRegistrations.java:259)


FAILED:  org.apache.hadoop.hdfs.server.datanode.fsdataset.impl.TestLazyPersistReplicaRecovery.testDnRestartWithSavedReplicas

Error Message:

Expected: is <DISK>
     but: was <RAM_DISK>

Stack Trace:
java.lang.AssertionError: 
Expected: is <DISK>
     but: was <RAM_DISK>
	at org.hamcrest.MatcherAssert.assertThat(MatcherAssert.java:20)
	at org.junit.Assert.assertThat(Assert.java:865)
	at org.junit.Assert.assertThat(Assert.java:832)
	at org.apache.hadoop.hdfs.server.datanode.fsdataset.impl.LazyPersistTestCase.ensureFileReplicasOnStorageType(LazyPersistTestCase.java:141)
	at org.apache.hadoop.hdfs.server.datanode.fsdataset.impl.TestLazyPersistReplicaRecovery.testDnRestartWithSavedReplicas(TestLazyPersistReplicaRecovery.java:53)


FAILED:  org.apache.hadoop.hdfs.server.namenode.TestNamenodeCapacityReport.testXceiverCount

Error Message:
expected:<14.0> but was:<15.0>

Stack Trace:
java.lang.AssertionError: expected:<14.0> but was:<15.0>
	at org.junit.Assert.fail(Assert.java:88)
	at org.junit.Assert.failNotEquals(Assert.java:743)
	at org.junit.Assert.assertEquals(Assert.java:494)
	at org.junit.Assert.assertEquals(Assert.java:592)
	at org.apache.hadoop.hdfs.server.namenode.TestNamenodeCapacityReport.checkClusterHealth(TestNamenodeCapacityReport.java:320)
	at org.apache.hadoop.hdfs.server.namenode.TestNamenodeCapacityReport.testXceiverCount(TestNamenodeCapacityReport.java:280)


FAILED:  org.apache.hadoop.hdfs.server.blockmanagement.TestBlockManager.testBlockReportQueueing

Error Message:
null

Stack Trace:
java.lang.AssertionError: null
	at org.junit.Assert.fail(Assert.java:86)
	at org.junit.Assert.assertTrue(Assert.java:41)
	at org.junit.Assert.assertTrue(Assert.java:52)
	at org.apache.hadoop.hdfs.server.blockmanagement.TestBlockManager.testBlockReportQueueing(TestBlockManager.java:926)


FAILED:  org.apache.hadoop.hdfs.server.datanode.TestBlockReplacement.testDeletedBlockWhenAddBlockIsInEdit

Error Message:
The block should be only on 1 datanode  expected:<1> but was:<2>

Stack Trace:
java.lang.AssertionError: The block should be only on 1 datanode  expected:<1> but was:<2>
	at org.junit.Assert.fail(Assert.java:88)
	at org.junit.Assert.failNotEquals(Assert.java:743)
	at org.junit.Assert.assertEquals(Assert.java:118)
	at org.junit.Assert.assertEquals(Assert.java:555)
	at org.apache.hadoop.hdfs.server.datanode.TestBlockReplacement.testDeletedBlockWhenAddBlockIsInEdit(TestBlockReplacement.java:435)


FAILED:  org.apache.hadoop.hdfs.server.datanode.TestBlockScanner.testVolumeIteratorWithCaching

Error Message:
test timed out after 60000 milliseconds

Stack Trace:
java.lang.Exception: test timed out after 60000 milliseconds
	at sun.nio.ch.FileDispatcherImpl.write0(Native Method)
	at sun.nio.ch.SocketDispatcher.write(SocketDispatcher.java:47)
	at sun.nio.ch.IOUtil.writeFromNativeBuffer(IOUtil.java:93)
	at sun.nio.ch.IOUtil.write(IOUtil.java:65)
	at sun.nio.ch.SocketChannelImpl.write(SocketChannelImpl.java:487)
	at org.apache.hadoop.net.SocketOutputStream$Writer.performIO(SocketOutputStream.java:63)
	at org.apache.hadoop.net.SocketIOWithTimeout.doIO(SocketIOWithTimeout.java:142)
	at org.apache.hadoop.net.SocketOutputStream.write(SocketOutputStream.java:159)
	at org.apache.hadoop.net.SocketOutputStream.write(SocketOutputStream.java:117)
	at com.google.protobuf.CodedOutputStream.refreshBuffer(CodedOutputStream.java:833)
	at com.google.protobuf.CodedOutputStream.flush(CodedOutputStream.java:843)
	at com.google.protobuf.AbstractMessageLite.writeDelimitedTo(AbstractMessageLite.java:91)
	at org.apache.hadoop.hdfs.RemoteBlockReader2.writeReadResult(RemoteBlockReader2.java:346)
	at org.apache.hadoop.hdfs.RemoteBlockReader2.sendReadResult(RemoteBlockReader2.java:331)
	at org.apache.hadoop.hdfs.RemoteBlockReader2.readNextPacket(RemoteBlockReader2.java:237)
	at org.apache.hadoop.hdfs.RemoteBlockReader2.read(RemoteBlockReader2.java:146)
	at org.apache.hadoop.hdfs.DFSInputStream$ByteArrayStrategy.doRead(DFSInputStream.java:764)
	at org.apache.hadoop.hdfs.DFSInputStream.readBuffer(DFSInputStream.java:839)
	at org.apache.hadoop.hdfs.DFSInputStream.readWithStrategy(DFSInputStream.java:898)
	at org.apache.hadoop.hdfs.DFSInputStream.read(DFSInputStream.java:941)
	at org.apache.hadoop.hdfs.DFSInputStream.read(DFSInputStream.java:714)
	at java.io.DataInputStream.readByte(DataInputStream.java:265)
	at org.apache.hadoop.hdfs.DFSTestUtil.getFirstBlock(DFSTestUtil.java:783)
	at org.apache.hadoop.hdfs.server.datanode.TestBlockScanner$TestContext.getFileBlock(TestBlockScanner.java:140)
	at org.apache.hadoop.hdfs.server.datanode.TestBlockScanner.testVolumeIteratorImpl(TestBlockScanner.java:174)
	at org.apache.hadoop.hdfs.server.datanode.TestBlockScanner.testVolumeIteratorWithCaching(TestBlockScanner.java:250)


FAILED:  org.apache.hadoop.hdfs.server.datanode.TestDirectoryScanner.testThrottling

Error Message:
test timed out after 300000 milliseconds

Stack Trace:
java.lang.Exception: test timed out after 300000 milliseconds
	at sun.misc.Unsafe.park(Native Method)
	at java.util.concurrent.locks.LockSupport.park(LockSupport.java:186)
	at java.util.concurrent.FutureTask.awaitDone(FutureTask.java:425)
	at java.util.concurrent.FutureTask.get(FutureTask.java:187)
	at org.apache.hadoop.hdfs.server.datanode.DirectoryScanner.getDiskReport(DirectoryScanner.java:731)
	at org.apache.hadoop.hdfs.server.datanode.DirectoryScanner.scan(DirectoryScanner.java:581)
	at org.apache.hadoop.hdfs.server.datanode.DirectoryScanner.reconcile(DirectoryScanner.java:562)
	at org.apache.hadoop.hdfs.server.datanode.TestDirectoryScanner.scan(TestDirectoryScanner.java:307)
	at org.apache.hadoop.hdfs.server.datanode.TestDirectoryScanner.scan(TestDirectoryScanner.java:301)
	at org.apache.hadoop.hdfs.server.datanode.TestDirectoryScanner.runThrottleTest(TestDirectoryScanner.java:760)
	at org.apache.hadoop.hdfs.server.datanode.TestDirectoryScanner.testThrottling(TestDirectoryScanner.java:588)



Mime
  • Unnamed multipart/mixed (inline, None, 0 bytes)
View raw message