hadoop-hdfs-dev mailing list archives

Site index · List index
Message view « Date » · « Thread »
Top « Date » · « Thread »
From Apache Jenkins Server <jenk...@builds.apache.org>
Subject Hadoop-Hdfs-trunk - Build # 2671 - Still Failing
Date Thu, 24 Dec 2015 13:20:54 GMT
See https://builds.apache.org/job/Hadoop-Hdfs-trunk/2671/

###################################################################################
########################## LAST 60 LINES OF THE CONSOLE ###########################
[...truncated 7580 lines...]
[INFO] --- maven-antrun-plugin:1.7:run (create-testdirs) @ hadoop-hdfs-project ---
[INFO] Executing tasks

main:
    [mkdir] Created dir: /home/jenkins/jenkins-slave/workspace/Hadoop-Hdfs-trunk/hadoop-hdfs-project/target/test-dir
[INFO] Executed tasks
[INFO] 
[INFO] --- maven-source-plugin:2.3:jar-no-fork (hadoop-java-sources) @ hadoop-hdfs-project
---
[INFO] 
[INFO] --- maven-source-plugin:2.3:test-jar-no-fork (hadoop-java-sources) @ hadoop-hdfs-project
---
[INFO] 
[INFO] --- maven-enforcer-plugin:1.3.1:enforce (dist-enforce) @ hadoop-hdfs-project ---
[INFO] 
[INFO] --- maven-site-plugin:3.4:attach-descriptor (attach-descriptor) @ hadoop-hdfs-project
---
[INFO] 
[INFO] --- maven-javadoc-plugin:2.8.1:jar (module-javadocs) @ hadoop-hdfs-project ---
[INFO] Skipping javadoc generation
[INFO] 
[INFO] --- maven-enforcer-plugin:1.3.1:enforce (depcheck) @ hadoop-hdfs-project ---
[INFO] 
[INFO] --- maven-checkstyle-plugin:2.15:checkstyle (default-cli) @ hadoop-hdfs-project ---
[INFO] 
[INFO] --- findbugs-maven-plugin:3.0.0:findbugs (default-cli) @ hadoop-hdfs-project ---
[INFO] ------------------------------------------------------------------------
[INFO] Reactor Summary:
[INFO] 
[INFO] Apache Hadoop HDFS Client ......................... SUCCESS [04:11 min]
[INFO] Apache Hadoop HDFS ................................ FAILURE [  03:26 h]
[INFO] Apache Hadoop HDFS Native Client .................. SKIPPED
[INFO] Apache Hadoop HttpFS .............................. SKIPPED
[INFO] Apache Hadoop HDFS BookKeeper Journal ............. SKIPPED
[INFO] Apache Hadoop HDFS-NFS ............................ SKIPPED
[INFO] Apache Hadoop HDFS Project ........................ SUCCESS [  0.080 s]
[INFO] ------------------------------------------------------------------------
[INFO] BUILD FAILURE
[INFO] ------------------------------------------------------------------------
[INFO] Total time: 03:30 h
[INFO] Finished at: 2015-12-24T13:20:46+00:00
[INFO] Final Memory: 56M/780M
[INFO] ------------------------------------------------------------------------
[ERROR] Failed to execute goal org.apache.maven.plugins:maven-surefire-plugin:2.17:test (default-test)
on project hadoop-hdfs: There are test failures.
[ERROR] 
[ERROR] Please refer to /home/jenkins/jenkins-slave/workspace/Hadoop-Hdfs-trunk/hadoop-hdfs-project/hadoop-hdfs/target/surefire-reports
for the individual test results.
[ERROR] -> [Help 1]
[ERROR] 
[ERROR] To see the full stack trace of the errors, re-run Maven with the -e switch.
[ERROR] Re-run Maven using the -X switch to enable full debug logging.
[ERROR] 
[ERROR] For more information about the errors and possible solutions, please read the following
articles:
[ERROR] [Help 1] http://cwiki.apache.org/confluence/display/MAVEN/MojoFailureException
[ERROR] 
[ERROR] After correcting the problems, you can resume the build with the command
[ERROR]   mvn <goals> -rf :hadoop-hdfs
Build step 'Execute shell' marked build as failure
Archiving artifacts
Recording test results
Sending e-mails to: hdfs-dev@hadoop.apache.org
Email was triggered for: Failure - Any
Sending email for trigger: Failure - Any



###################################################################################
############################## FAILED TESTS (if any) ##############################
5 tests failed.
FAILED:  org.apache.hadoop.hdfs.qjournal.TestSecureNNWithQJM.testSecureMode

Error Message:
test timed out after 30000 milliseconds

Stack Trace:
java.lang.Exception: test timed out after 30000 milliseconds
	at java.lang.Thread.sleep(Native Method)
	at org.mortbay.thread.QueuedThreadPool.doStop(QueuedThreadPool.java:435)
	at org.mortbay.component.AbstractLifeCycle.stop(AbstractLifeCycle.java:76)
	at org.mortbay.jetty.Server.doStop(Server.java:291)
	at org.mortbay.component.AbstractLifeCycle.stop(AbstractLifeCycle.java:76)
	at org.apache.hadoop.http.HttpServer2.stop(HttpServer2.java:952)
	at org.apache.hadoop.hdfs.qjournal.server.JournalNodeHttpServer.stop(JournalNodeHttpServer.java:75)
	at org.apache.hadoop.hdfs.qjournal.server.JournalNode.stop(JournalNode.java:200)
	at org.apache.hadoop.hdfs.qjournal.server.JournalNode.stopAndJoin(JournalNode.java:234)
	at org.apache.hadoop.hdfs.qjournal.MiniJournalCluster.shutdown(MiniJournalCluster.java:154)
	at org.apache.hadoop.hdfs.qjournal.TestSecureNNWithQJM.shutdown(TestSecureNNWithQJM.java:160)


FAILED:  org.apache.hadoop.hdfs.server.blockmanagement.TestReplicationPolicyConsiderLoad.testChooseTargetWithDecomNodes[0]

Error Message:
expected:<1.6666666666666667> but was:<0.0>

Stack Trace:
java.lang.AssertionError: expected:<1.6666666666666667> but was:<0.0>
	at org.junit.Assert.fail(Assert.java:88)
	at org.junit.Assert.failNotEquals(Assert.java:743)
	at org.junit.Assert.assertEquals(Assert.java:494)
	at org.junit.Assert.assertEquals(Assert.java:592)
	at org.apache.hadoop.hdfs.server.blockmanagement.TestReplicationPolicyConsiderLoad.testChooseTargetWithDecomNodes(TestReplicationPolicyConsiderLoad.java:96)


FAILED:  org.apache.hadoop.hdfs.server.blockmanagement.TestReplicationPolicyConsiderLoad.testChooseTargetWithDecomNodes[1]

Error Message:
expected:<1.6666666666666667> but was:<0.0>

Stack Trace:
java.lang.AssertionError: expected:<1.6666666666666667> but was:<0.0>
	at org.junit.Assert.fail(Assert.java:88)
	at org.junit.Assert.failNotEquals(Assert.java:743)
	at org.junit.Assert.assertEquals(Assert.java:494)
	at org.junit.Assert.assertEquals(Assert.java:592)
	at org.apache.hadoop.hdfs.server.blockmanagement.TestReplicationPolicyConsiderLoad.testChooseTargetWithDecomNodes(TestReplicationPolicyConsiderLoad.java:96)


FAILED:  org.apache.hadoop.hdfs.server.namenode.TestNNThroughputBenchmark.testNNThroughput

Error Message:
Not replicated yet: /nnThroughputBenchmark/blockReport/ThroughputBenchDir0/ThroughputBench2

Stack Trace:
org.apache.hadoop.hdfs.server.namenode.NotReplicatedYetException: Not replicated yet: /nnThroughputBenchmark/blockReport/ThroughputBenchDir0/ThroughputBench2
	at org.apache.hadoop.hdfs.server.namenode.FSDirWriteFileOp.validateAddBlock(FSDirWriteFileOp.java:190)
	at org.apache.hadoop.hdfs.server.namenode.FSNamesystem.getAdditionalBlock(FSNamesystem.java:2378)
	at org.apache.hadoop.hdfs.server.namenode.NameNodeRpcServer.addBlock(NameNodeRpcServer.java:797)
	at org.apache.hadoop.hdfs.server.namenode.NNThroughputBenchmark$BlockReportStats.addBlocks(NNThroughputBenchmark.java:1184)
	at org.apache.hadoop.hdfs.server.namenode.NNThroughputBenchmark$BlockReportStats.generateInputs(NNThroughputBenchmark.java:1171)
	at org.apache.hadoop.hdfs.server.namenode.NNThroughputBenchmark$ReplicationStats.generateInputs(NNThroughputBenchmark.java:1318)
	at org.apache.hadoop.hdfs.server.namenode.NNThroughputBenchmark$OperationStatsBase.benchmark(NNThroughputBenchmark.java:281)
	at org.apache.hadoop.hdfs.server.namenode.NNThroughputBenchmark.run(NNThroughputBenchmark.java:1519)
	at org.apache.hadoop.hdfs.server.namenode.NNThroughputBenchmark.runBenchmark(NNThroughputBenchmark.java:1422)
	at org.apache.hadoop.hdfs.server.namenode.TestNNThroughputBenchmark.testNNThroughput(TestNNThroughputBenchmark.java:53)


FAILED:  org.apache.hadoop.hdfs.server.namenode.ha.TestFailureToReadEdits.testCheckpointStartingMidEditsFile[1]

Error Message:

Unfinished stubbing detected here:
-> at org.apache.hadoop.hdfs.server.namenode.ha.TestFailureToReadEdits.causeFailureOnEditLogRead(TestFailureToReadEdits.java:306)

E.g. thenReturn() may be missing.
Examples of correct stubbing:
    when(mock.isOk()).thenReturn(true);
    when(mock.isOk()).thenThrow(exception);
    doThrow(exception).when(mock).someVoidMethod();
Hints:
 1. missing thenReturn()
 2. although stubbed methods may return mocks, you cannot inline mock creation (mock()) call
inside a thenReturn method (see issue 53)


Stack Trace:
org.mockito.exceptions.misusing.UnfinishedStubbingException: 
Unfinished stubbing detected here:
-> at org.apache.hadoop.hdfs.server.namenode.ha.TestFailureToReadEdits.causeFailureOnEditLogRead(TestFailureToReadEdits.java:306)

E.g. thenReturn() may be missing.
Examples of correct stubbing:
    when(mock.isOk()).thenReturn(true);
    when(mock.isOk()).thenThrow(exception);
    doThrow(exception).when(mock).someVoidMethod();
Hints:
 1. missing thenReturn()
 2. although stubbed methods may return mocks, you cannot inline mock creation (mock()) call
inside a thenReturn method (see issue 53)

	at org.apache.hadoop.hdfs.server.namenode.ha.TestFailureToReadEdits.causeFailureOnEditLogRead(TestFailureToReadEdits.java:306)
	at org.apache.hadoop.hdfs.server.namenode.ha.TestFailureToReadEdits.testCheckpointStartingMidEditsFile(TestFailureToReadEdits.java:227)



Mime
  • Unnamed multipart/mixed (inline, None, 0 bytes)
View raw message