hadoop-hdfs-dev mailing list archives

Site index · List index
Message view « Date » · « Thread »
Top « Date » · « Thread »
From Apache Jenkins Server <jenk...@builds.apache.org>
Subject Build failed in Jenkins: Hadoop-Hdfs-trunk #2594
Date Wed, 02 Dec 2015 23:46:04 GMT
See <https://builds.apache.org/job/Hadoop-Hdfs-trunk/2594/changes>

Changes:

[jianhe] YARN-4398. Remove unnecessary synchronization in RMStateStore.

------------------------------------------
[...truncated 6162 lines...]
Tests run: 2, Failures: 0, Errors: 0, Skipped: 0, Time elapsed: 4.528 sec - in org.apache.hadoop.hdfs.TestHdfsAdmin
Running org.apache.hadoop.hdfs.TestDFSStripedOutputStreamWithFailure
Tests run: 4, Failures: 0, Errors: 0, Skipped: 0, Time elapsed: 90.923 sec - in org.apache.hadoop.hdfs.TestDFSStripedOutputStreamWithFailure
Running org.apache.hadoop.hdfs.TestDFSStripedOutputStreamWithFailure120
Tests run: 10, Failures: 0, Errors: 0, Skipped: 0, Time elapsed: 0.37 sec - in org.apache.hadoop.hdfs.TestDFSStripedOutputStreamWithFailure120
Running org.apache.hadoop.hdfs.TestSnapshotCommands
Tests run: 6, Failures: 0, Errors: 0, Skipped: 0, Time elapsed: 5.105 sec - in org.apache.hadoop.hdfs.TestSnapshotCommands
Running org.apache.hadoop.hdfs.TestDFSStripedOutputStreamWithFailure130
Tests run: 10, Failures: 0, Errors: 0, Skipped: 0, Time elapsed: 0.351 sec - in org.apache.hadoop.hdfs.TestDFSStripedOutputStreamWithFailure130
Running org.apache.hadoop.hdfs.TestDFSInotifyEventInputStream
Tests run: 5, Failures: 0, Errors: 0, Skipped: 0, Time elapsed: 18.681 sec - in org.apache.hadoop.hdfs.TestDFSInotifyEventInputStream
Running org.apache.hadoop.hdfs.TestIsMethodSupported
Tests run: 10, Failures: 0, Errors: 0, Skipped: 0, Time elapsed: 4.659 sec - in org.apache.hadoop.hdfs.TestIsMethodSupported
Running org.apache.hadoop.hdfs.TestRecoverStripedFile
Tests run: 13, Failures: 0, Errors: 0, Skipped: 0, Time elapsed: 82.893 sec - in org.apache.hadoop.hdfs.TestRecoverStripedFile
Running org.apache.hadoop.hdfs.TestDFSStorageStateRecovery
Tests run: 3, Failures: 0, Errors: 0, Skipped: 0, Time elapsed: 66.642 sec - in org.apache.hadoop.hdfs.TestDFSStorageStateRecovery
Running org.apache.hadoop.hdfs.TestGetFileChecksum
Tests run: 2, Failures: 0, Errors: 0, Skipped: 0, Time elapsed: 8.855 sec - in org.apache.hadoop.hdfs.TestGetFileChecksum
Running org.apache.hadoop.hdfs.TestDFSStripedOutputStreamWithFailure180
Tests run: 10, Failures: 0, Errors: 0, Skipped: 0, Time elapsed: 47.143 sec - in org.apache.hadoop.hdfs.TestDFSStripedOutputStreamWithFailure180
Running org.apache.hadoop.hdfs.TestFileConcurrentReader
Tests run: 7, Failures: 0, Errors: 0, Skipped: 0, Time elapsed: 21.603 sec - in org.apache.hadoop.hdfs.TestFileConcurrentReader
Running org.apache.hadoop.hdfs.util.TestBestEffortLongFile
Tests run: 2, Failures: 0, Errors: 0, Skipped: 0, Time elapsed: 0.301 sec - in org.apache.hadoop.hdfs.util.TestBestEffortLongFile
Running org.apache.hadoop.hdfs.util.TestStripedBlockUtil
Tests run: 3, Failures: 0, Errors: 0, Skipped: 0, Time elapsed: 4.121 sec - in org.apache.hadoop.hdfs.util.TestStripedBlockUtil
Running org.apache.hadoop.hdfs.util.TestLightWeightLinkedSet
Tests run: 17, Failures: 0, Errors: 0, Skipped: 0, Time elapsed: 0.292 sec - in org.apache.hadoop.hdfs.util.TestLightWeightLinkedSet
Running org.apache.hadoop.hdfs.util.TestMD5FileUtils
Tests run: 5, Failures: 0, Errors: 0, Skipped: 0, Time elapsed: 0.373 sec - in org.apache.hadoop.hdfs.util.TestMD5FileUtils
Running org.apache.hadoop.hdfs.util.TestAtomicFileOutputStream
Tests run: 4, Failures: 0, Errors: 0, Skipped: 1, Time elapsed: 0.322 sec - in org.apache.hadoop.hdfs.util.TestAtomicFileOutputStream
Running org.apache.hadoop.hdfs.util.TestXMLUtils
Tests run: 6, Failures: 0, Errors: 0, Skipped: 0, Time elapsed: 0.103 sec - in org.apache.hadoop.hdfs.util.TestXMLUtils
Running org.apache.hadoop.hdfs.util.TestLightWeightHashSet
Tests run: 14, Failures: 0, Errors: 0, Skipped: 0, Time elapsed: 0.271 sec - in org.apache.hadoop.hdfs.util.TestLightWeightHashSet
Running org.apache.hadoop.hdfs.util.TestCyclicIteration
Tests run: 1, Failures: 0, Errors: 0, Skipped: 0, Time elapsed: 0.107 sec - in org.apache.hadoop.hdfs.util.TestCyclicIteration
Running org.apache.hadoop.hdfs.util.TestDiff
Tests run: 1, Failures: 0, Errors: 0, Skipped: 0, Time elapsed: 3.356 sec - in org.apache.hadoop.hdfs.util.TestDiff
Running org.apache.hadoop.hdfs.TestRemoteBlockReader
Tests run: 1, Failures: 0, Errors: 0, Skipped: 0, Time elapsed: 5.224 sec - in org.apache.hadoop.hdfs.TestRemoteBlockReader
Running org.apache.hadoop.hdfs.TestDFSStartupVersions
Tests run: 1, Failures: 0, Errors: 0, Skipped: 0, Time elapsed: 12.111 sec - in org.apache.hadoop.hdfs.TestDFSStartupVersions
Running org.apache.hadoop.hdfs.TestWriteBlockGetsBlockLengthHint
Tests run: 1, Failures: 0, Errors: 0, Skipped: 0, Time elapsed: 4.913 sec - in org.apache.hadoop.hdfs.TestWriteBlockGetsBlockLengthHint
Running org.apache.hadoop.hdfs.TestReservedRawPaths
Tests run: 8, Failures: 0, Errors: 0, Skipped: 0, Time elapsed: 10.43 sec - in org.apache.hadoop.hdfs.TestReservedRawPaths
Running org.apache.hadoop.hdfs.TestRead
Tests run: 3, Failures: 0, Errors: 0, Skipped: 0, Time elapsed: 7.229 sec - in org.apache.hadoop.hdfs.TestRead
Running org.apache.hadoop.hdfs.TestAppendDifferentChecksum
Tests run: 3, Failures: 0, Errors: 0, Skipped: 1, Time elapsed: 9.891 sec - in org.apache.hadoop.hdfs.TestAppendDifferentChecksum
Running org.apache.hadoop.hdfs.TestDFSRollback
Tests run: 1, Failures: 0, Errors: 0, Skipped: 0, Time elapsed: 14.854 sec - in org.apache.hadoop.hdfs.TestDFSRollback
Running org.apache.hadoop.hdfs.TestMiniDFSCluster
Tests run: 7, Failures: 0, Errors: 0, Skipped: 0, Time elapsed: 11.535 sec - in org.apache.hadoop.hdfs.TestMiniDFSCluster
Running org.apache.hadoop.hdfs.TestClientReportBadBlock
Tests run: 3, Failures: 0, Errors: 0, Skipped: 0, Time elapsed: 9.439 sec - in org.apache.hadoop.hdfs.TestClientReportBadBlock
Running org.apache.hadoop.hdfs.TestFileStatusWithECPolicy
Tests run: 1, Failures: 0, Errors: 0, Skipped: 0, Time elapsed: 4.763 sec - in org.apache.hadoop.hdfs.TestFileStatusWithECPolicy
Running org.apache.hadoop.hdfs.TestReadStripedFileWithMissingBlocks
Tests run: 6, Failures: 0, Errors: 0, Skipped: 0, Time elapsed: 42.713 sec - in org.apache.hadoop.hdfs.TestReadStripedFileWithMissingBlocks
Running org.apache.hadoop.hdfs.TestLeaseRecovery2
Tests run: 7, Failures: 0, Errors: 0, Skipped: 0, Time elapsed: 70.092 sec - in org.apache.hadoop.hdfs.TestLeaseRecovery2
Running org.apache.hadoop.hdfs.protocol.TestLayoutVersion
Tests run: 11, Failures: 0, Errors: 0, Skipped: 0, Time elapsed: 0.368 sec - in org.apache.hadoop.hdfs.protocol.TestLayoutVersion
Running org.apache.hadoop.hdfs.protocol.datatransfer.TestPacketReceiver
Tests run: 1, Failures: 0, Errors: 0, Skipped: 0, Time elapsed: 0.535 sec - in org.apache.hadoop.hdfs.protocol.datatransfer.TestPacketReceiver
Running org.apache.hadoop.hdfs.protocol.datatransfer.sasl.TestSaslDataTransfer
Tests run: 8, Failures: 0, Errors: 0, Skipped: 0, Time elapsed: 24.366 sec - in org.apache.hadoop.hdfs.protocol.datatransfer.sasl.TestSaslDataTransfer
Running org.apache.hadoop.hdfs.protocol.TestAnnotations
Tests run: 1, Failures: 0, Errors: 0, Skipped: 0, Time elapsed: 0.174 sec - in org.apache.hadoop.hdfs.protocol.TestAnnotations
Running org.apache.hadoop.hdfs.protocol.TestLocatedBlock
Tests run: 1, Failures: 0, Errors: 0, Skipped: 0, Time elapsed: 0.326 sec - in org.apache.hadoop.hdfs.protocol.TestLocatedBlock
Running org.apache.hadoop.hdfs.protocol.TestBlockListAsLongs
Tests run: 7, Failures: 0, Errors: 0, Skipped: 0, Time elapsed: 1.201 sec - in org.apache.hadoop.hdfs.protocol.TestBlockListAsLongs
Running org.apache.hadoop.hdfs.TestAbandonBlock
Tests run: 2, Failures: 0, Errors: 0, Skipped: 0, Time elapsed: 12.423 sec - in org.apache.hadoop.hdfs.TestAbandonBlock
Running org.apache.hadoop.hdfs.TestDFSStripedOutputStreamWithFailure190
Tests run: 10, Failures: 0, Errors: 0, Skipped: 0, Time elapsed: 0.352 sec - in org.apache.hadoop.hdfs.TestDFSStripedOutputStreamWithFailure190
Running org.apache.hadoop.hdfs.crypto.TestHdfsCryptoStreams
Tests run: 14, Failures: 0, Errors: 0, Skipped: 0, Time elapsed: 26.693 sec - in org.apache.hadoop.hdfs.crypto.TestHdfsCryptoStreams
Running org.apache.hadoop.hdfs.TestFileAppendRestart
Tests run: 3, Failures: 0, Errors: 0, Skipped: 0, Time elapsed: 15.398 sec - in org.apache.hadoop.hdfs.TestFileAppendRestart
Running org.apache.hadoop.hdfs.TestFetchImage
Tests run: 1, Failures: 0, Errors: 0, Skipped: 0, Time elapsed: 4.67 sec - in org.apache.hadoop.hdfs.TestFetchImage
Running org.apache.hadoop.hdfs.TestDFSStripedOutputStreamWithFailure200
Tests run: 10, Failures: 0, Errors: 0, Skipped: 0, Time elapsed: 88.817 sec - in org.apache.hadoop.hdfs.TestDFSStripedOutputStreamWithFailure200
Running org.apache.hadoop.hdfs.TestSafeModeWithStripedFile
Tests run: 2, Failures: 0, Errors: 0, Skipped: 0, Time elapsed: 28.387 sec - in org.apache.hadoop.hdfs.TestSafeModeWithStripedFile
Running org.apache.hadoop.hdfs.TestDFSStripedOutputStreamWithFailure170
Tests run: 10, Failures: 0, Errors: 0, Skipped: 0, Time elapsed: 0.348 sec - in org.apache.hadoop.hdfs.TestDFSStripedOutputStreamWithFailure170
Running org.apache.hadoop.hdfs.TestDFSStripedOutputStreamWithFailure010
Tests run: 10, Failures: 0, Errors: 0, Skipped: 0, Time elapsed: 0.366 sec - in org.apache.hadoop.hdfs.TestDFSStripedOutputStreamWithFailure010
Running org.apache.hadoop.hdfs.TestFileCreationDelete
Tests run: 1, Failures: 0, Errors: 0, Skipped: 0, Time elapsed: 15.759 sec - in org.apache.hadoop.hdfs.TestFileCreationDelete
Running org.apache.hadoop.hdfs.TestCrcCorruption
Tests run: 4, Failures: 0, Errors: 0, Skipped: 0, Time elapsed: 17.227 sec - in org.apache.hadoop.hdfs.TestCrcCorruption
Running org.apache.hadoop.hdfs.TestHDFSFileSystemContract
Tests run: 44, Failures: 0, Errors: 0, Skipped: 0, Time elapsed: 53.355 sec - in org.apache.hadoop.hdfs.TestHDFSFileSystemContract
Running org.apache.hadoop.hdfs.TestBlockStoragePolicy
Tests run: 20, Failures: 0, Errors: 0, Skipped: 0, Time elapsed: 41.403 sec - in org.apache.hadoop.hdfs.TestBlockStoragePolicy
Running org.apache.hadoop.hdfs.TestDatanodeDeath
Tests run: 4, Failures: 0, Errors: 0, Skipped: 0, Time elapsed: 59.771 sec - in org.apache.hadoop.hdfs.TestDatanodeDeath
Running org.apache.hadoop.hdfs.TestParallelReadUtil
Tests run: 1, Failures: 0, Errors: 0, Skipped: 1, Time elapsed: 0.039 sec - in org.apache.hadoop.hdfs.TestParallelReadUtil
Running org.apache.hadoop.hdfs.TestDFSUpgrade
Tests run: 2, Failures: 0, Errors: 0, Skipped: 0, Time elapsed: 15.031 sec - in org.apache.hadoop.hdfs.TestDFSUpgrade
Running org.apache.hadoop.hdfs.TestDFSShell
Tests run: 42, Failures: 0, Errors: 0, Skipped: 0, Time elapsed: 39.269 sec - in org.apache.hadoop.hdfs.TestDFSShell
Running org.apache.hadoop.hdfs.TestFileAppend2
Tests run: 5, Failures: 0, Errors: 0, Skipped: 0, Time elapsed: 27.398 sec - in org.apache.hadoop.hdfs.TestFileAppend2
Running org.apache.hadoop.hdfs.TestKeyProviderCache
Tests run: 1, Failures: 0, Errors: 0, Skipped: 0, Time elapsed: 0.691 sec - in org.apache.hadoop.hdfs.TestKeyProviderCache
Running org.apache.hadoop.hdfs.TestListFilesInDFS
Tests run: 2, Failures: 0, Errors: 0, Skipped: 0, Time elapsed: 5.927 sec - in org.apache.hadoop.hdfs.TestListFilesInDFS
Running org.apache.hadoop.hdfs.TestDFSStripedOutputStreamWithFailure160
Tests run: 10, Failures: 0, Errors: 0, Skipped: 0, Time elapsed: 0.362 sec - in org.apache.hadoop.hdfs.TestDFSStripedOutputStreamWithFailure160
Running org.apache.hadoop.hdfs.TestAppendSnapshotTruncate
Tests run: 1, Failures: 0, Errors: 0, Skipped: 0, Time elapsed: 29.031 sec - in org.apache.hadoop.hdfs.TestAppendSnapshotTruncate
Running org.apache.hadoop.hdfs.TestDFSStripedOutputStreamWithFailure150
Tests run: 10, Failures: 0, Errors: 0, Skipped: 0, Time elapsed: 0.387 sec - in org.apache.hadoop.hdfs.TestDFSStripedOutputStreamWithFailure150
Running org.apache.hadoop.hdfs.TestDFSOutputStream
Tests run: 3, Failures: 0, Errors: 0, Skipped: 0, Time elapsed: 9.449 sec - in org.apache.hadoop.hdfs.TestDFSOutputStream
Running org.apache.hadoop.hdfs.TestHDFSServerPorts
Tests run: 4, Failures: 0, Errors: 0, Skipped: 0, Time elapsed: 7.257 sec - in org.apache.hadoop.hdfs.TestHDFSServerPorts
Running org.apache.hadoop.hdfs.TestDFSStripedOutputStreamWithFailure060
Tests run: 10, Failures: 0, Errors: 0, Skipped: 0, Time elapsed: 0.338 sec - in org.apache.hadoop.hdfs.TestDFSStripedOutputStreamWithFailure060
Running org.apache.hadoop.hdfs.TestDFSClientExcludedNodes
Tests run: 2, Failures: 0, Errors: 0, Skipped: 0, Time elapsed: 12.6 sec - in org.apache.hadoop.hdfs.TestDFSClientExcludedNodes
Running org.apache.hadoop.hdfs.TestDFSPermission
Tests run: 8, Failures: 0, Errors: 0, Skipped: 0, Time elapsed: 22.79 sec - in org.apache.hadoop.hdfs.TestDFSPermission
Running org.apache.hadoop.hdfs.TestRestartDFS
Tests run: 2, Failures: 0, Errors: 0, Skipped: 0, Time elapsed: 14.44 sec - in org.apache.hadoop.hdfs.TestRestartDFS
Running org.apache.hadoop.cli.TestCryptoAdminCLI
Tests run: 1, Failures: 0, Errors: 0, Skipped: 0, Time elapsed: 7.632 sec - in org.apache.hadoop.cli.TestCryptoAdminCLI
Running org.apache.hadoop.cli.TestHDFSCLI
Tests run: 1, Failures: 0, Errors: 0, Skipped: 0, Time elapsed: 38.208 sec - in org.apache.hadoop.cli.TestHDFSCLI
Running org.apache.hadoop.cli.TestAclCLI
Tests run: 1, Failures: 0, Errors: 0, Skipped: 0, Time elapsed: 6.715 sec - in org.apache.hadoop.cli.TestAclCLI
Running org.apache.hadoop.cli.TestDeleteCLI
Tests run: 1, Failures: 0, Errors: 0, Skipped: 0, Time elapsed: 7.674 sec - in org.apache.hadoop.cli.TestDeleteCLI
Running org.apache.hadoop.cli.TestCacheAdminCLI
Tests run: 1, Failures: 0, Errors: 0, Skipped: 0, Time elapsed: 7.363 sec - in org.apache.hadoop.cli.TestCacheAdminCLI
Running org.apache.hadoop.cli.TestErasureCodingCLI
Tests run: 1, Failures: 0, Errors: 0, Skipped: 0, Time elapsed: 7.649 sec - in org.apache.hadoop.cli.TestErasureCodingCLI
Running org.apache.hadoop.cli.TestXAttrCLI
Tests run: 1, Failures: 0, Errors: 0, Skipped: 0, Time elapsed: 7.717 sec - in org.apache.hadoop.cli.TestXAttrCLI
Running org.apache.hadoop.TestRefreshCallQueue
Tests run: 1, Failures: 0, Errors: 0, Skipped: 0, Time elapsed: 4.865 sec - in org.apache.hadoop.TestRefreshCallQueue
Running org.apache.hadoop.security.TestPermissionSymlinks
Tests run: 15, Failures: 0, Errors: 0, Skipped: 0, Time elapsed: 6.282 sec - in org.apache.hadoop.security.TestPermissionSymlinks
Running org.apache.hadoop.security.TestPermission
Tests run: 3, Failures: 0, Errors: 0, Skipped: 0, Time elapsed: 7.104 sec - in org.apache.hadoop.security.TestPermission
Running org.apache.hadoop.security.TestRefreshUserMappings
Tests run: 2, Failures: 0, Errors: 0, Skipped: 0, Time elapsed: 6.539 sec - in org.apache.hadoop.security.TestRefreshUserMappings

Results :

Tests in error: 
  TestDataNodeHotSwapVolumes.testRemoveVolumeBeingWritten:569->testRemoveVolumeBeingWrittenForDatanode:644
ยป Timeout

Tests run: 4112, Failures: 0, Errors: 1, Skipped: 17

[INFO]                                                                         
[INFO] ------------------------------------------------------------------------
[INFO] Skipping Apache Hadoop HDFS Native Client
[INFO] This project has been banned from the build due to previous failures.
[INFO] ------------------------------------------------------------------------
[INFO]                                                                         
[INFO] ------------------------------------------------------------------------
[INFO] Skipping Apache Hadoop HttpFS
[INFO] This project has been banned from the build due to previous failures.
[INFO] ------------------------------------------------------------------------
[INFO]                                                                         
[INFO] ------------------------------------------------------------------------
[INFO] Skipping Apache Hadoop HDFS BookKeeper Journal
[INFO] This project has been banned from the build due to previous failures.
[INFO] ------------------------------------------------------------------------
[INFO]                                                                         
[INFO] ------------------------------------------------------------------------
[INFO] Skipping Apache Hadoop HDFS-NFS
[INFO] This project has been banned from the build due to previous failures.
[INFO] ------------------------------------------------------------------------
[INFO]                                                                         
[INFO] ------------------------------------------------------------------------
[INFO] Building Apache Hadoop HDFS Project 3.0.0-SNAPSHOT
[INFO] ------------------------------------------------------------------------
[INFO] 
[INFO] --- maven-clean-plugin:2.5:clean (default-clean) @ hadoop-hdfs-project ---
[INFO] Deleting <https://builds.apache.org/job/Hadoop-Hdfs-trunk/ws/hadoop-hdfs-project/target>
[INFO] 
[INFO] --- maven-antrun-plugin:1.7:run (create-testdirs) @ hadoop-hdfs-project ---
[INFO] Executing tasks

main:
    [mkdir] Created dir: <https://builds.apache.org/job/Hadoop-Hdfs-trunk/ws/hadoop-hdfs-project/target/test-dir>
[INFO] Executed tasks
[INFO] 
[INFO] --- maven-source-plugin:2.3:jar-no-fork (hadoop-java-sources) @ hadoop-hdfs-project
---
[INFO] 
[INFO] --- maven-source-plugin:2.3:test-jar-no-fork (hadoop-java-sources) @ hadoop-hdfs-project
---
[INFO] 
[INFO] --- maven-enforcer-plugin:1.3.1:enforce (dist-enforce) @ hadoop-hdfs-project ---
[INFO] 
[INFO] --- maven-site-plugin:3.4:attach-descriptor (attach-descriptor) @ hadoop-hdfs-project
---
[INFO] 
[INFO] --- maven-javadoc-plugin:2.8.1:jar (module-javadocs) @ hadoop-hdfs-project ---
[INFO] Skipping javadoc generation
[INFO] 
[INFO] --- maven-enforcer-plugin:1.3.1:enforce (depcheck) @ hadoop-hdfs-project ---
[INFO] 
[INFO] --- maven-checkstyle-plugin:2.15:checkstyle (default-cli) @ hadoop-hdfs-project ---
[INFO] 
[INFO] --- findbugs-maven-plugin:3.0.0:findbugs (default-cli) @ hadoop-hdfs-project ---
[INFO] ------------------------------------------------------------------------
[INFO] Reactor Summary:
[INFO] 
[INFO] Apache Hadoop HDFS Client ......................... SUCCESS [04:18 min]
[INFO] Apache Hadoop HDFS ................................ FAILURE [  03:16 h]
[INFO] Apache Hadoop HDFS Native Client .................. SKIPPED
[INFO] Apache Hadoop HttpFS .............................. SKIPPED
[INFO] Apache Hadoop HDFS BookKeeper Journal ............. SKIPPED
[INFO] Apache Hadoop HDFS-NFS ............................ SKIPPED
[INFO] Apache Hadoop HDFS Project ........................ SUCCESS [  0.060 s]
[INFO] ------------------------------------------------------------------------
[INFO] BUILD FAILURE
[INFO] ------------------------------------------------------------------------
[INFO] Total time: 03:21 h
[INFO] Finished at: 2015-12-02T23:45:38+00:00
[INFO] Final Memory: 57M/790M
[INFO] ------------------------------------------------------------------------
[ERROR] Failed to execute goal org.apache.maven.plugins:maven-surefire-plugin:2.17:test (default-test)
on project hadoop-hdfs: There are test failures.
[ERROR] 
[ERROR] Please refer to <https://builds.apache.org/job/Hadoop-Hdfs-trunk/ws/hadoop-hdfs-project/hadoop-hdfs/target/surefire-reports>
for the individual test results.
[ERROR] -> [Help 1]
[ERROR] 
[ERROR] To see the full stack trace of the errors, re-run Maven with the -e switch.
[ERROR] Re-run Maven using the -X switch to enable full debug logging.
[ERROR] 
[ERROR] For more information about the errors and possible solutions, please read the following
articles:
[ERROR] [Help 1] http://cwiki.apache.org/confluence/display/MAVEN/MojoFailureException
[ERROR] 
[ERROR] After correcting the problems, you can resume the build with the command
[ERROR]   mvn <goals> -rf :hadoop-hdfs
Build step 'Execute shell' marked build as failure
Archiving artifacts
Recording test results

Mime
View raw message