hadoop-hdfs-dev mailing list archives

Site index · List index
Message view « Date » · « Thread »
Top « Date » · « Thread »
From Apache Jenkins Server <jenk...@builds.apache.org>
Subject Hadoop-Hdfs-trunk - Build # 2649 - Still Failing
Date Mon, 21 Dec 2015 05:18:10 GMT
See https://builds.apache.org/job/Hadoop-Hdfs-trunk/2649/

###################################################################################
########################## LAST 60 LINES OF THE CONSOLE ###########################
[...truncated 7677 lines...]
[INFO] --- maven-antrun-plugin:1.7:run (create-testdirs) @ hadoop-hdfs-project ---
[INFO] Executing tasks

main:
    [mkdir] Created dir: /home/jenkins/jenkins-slave/workspace/Hadoop-Hdfs-trunk/hadoop-hdfs-project/target/test-dir
[INFO] Executed tasks
[INFO] 
[INFO] --- maven-source-plugin:2.3:jar-no-fork (hadoop-java-sources) @ hadoop-hdfs-project
---
[INFO] 
[INFO] --- maven-source-plugin:2.3:test-jar-no-fork (hadoop-java-sources) @ hadoop-hdfs-project
---
[INFO] 
[INFO] --- maven-enforcer-plugin:1.3.1:enforce (dist-enforce) @ hadoop-hdfs-project ---
[INFO] 
[INFO] --- maven-site-plugin:3.4:attach-descriptor (attach-descriptor) @ hadoop-hdfs-project
---
[INFO] 
[INFO] --- maven-javadoc-plugin:2.8.1:jar (module-javadocs) @ hadoop-hdfs-project ---
[INFO] Skipping javadoc generation
[INFO] 
[INFO] --- maven-enforcer-plugin:1.3.1:enforce (depcheck) @ hadoop-hdfs-project ---
[INFO] 
[INFO] --- maven-checkstyle-plugin:2.15:checkstyle (default-cli) @ hadoop-hdfs-project ---
[INFO] 
[INFO] --- findbugs-maven-plugin:3.0.0:findbugs (default-cli) @ hadoop-hdfs-project ---
[INFO] ------------------------------------------------------------------------
[INFO] Reactor Summary:
[INFO] 
[INFO] Apache Hadoop HDFS Client ......................... SUCCESS [08:37 min]
[INFO] Apache Hadoop HDFS ................................ FAILURE [  06:34 h]
[INFO] Apache Hadoop HDFS Native Client .................. SKIPPED
[INFO] Apache Hadoop HttpFS .............................. SKIPPED
[INFO] Apache Hadoop HDFS BookKeeper Journal ............. SKIPPED
[INFO] Apache Hadoop HDFS-NFS ............................ SKIPPED
[INFO] Apache Hadoop HDFS Project ........................ SUCCESS [  7.244 s]
[INFO] ------------------------------------------------------------------------
[INFO] BUILD FAILURE
[INFO] ------------------------------------------------------------------------
[INFO] Total time: 06:43 h
[INFO] Finished at: 2015-12-21T05:15:06+00:00
[INFO] Final Memory: 56M/755M
[INFO] ------------------------------------------------------------------------
[ERROR] Failed to execute goal org.apache.maven.plugins:maven-surefire-plugin:2.17:test (default-test)
on project hadoop-hdfs: There are test failures.
[ERROR] 
[ERROR] Please refer to /home/jenkins/jenkins-slave/workspace/Hadoop-Hdfs-trunk/hadoop-hdfs-project/hadoop-hdfs/target/surefire-reports
for the individual test results.
[ERROR] -> [Help 1]
[ERROR] 
[ERROR] To see the full stack trace of the errors, re-run Maven with the -e switch.
[ERROR] Re-run Maven using the -X switch to enable full debug logging.
[ERROR] 
[ERROR] For more information about the errors and possible solutions, please read the following
articles:
[ERROR] [Help 1] http://cwiki.apache.org/confluence/display/MAVEN/MojoFailureException
[ERROR] 
[ERROR] After correcting the problems, you can resume the build with the command
[ERROR]   mvn <goals> -rf :hadoop-hdfs
Build step 'Execute shell' marked build as failure
Archiving artifacts
Recording test results
Sending e-mails to: hdfs-dev@hadoop.apache.org
Email was triggered for: Failure - Any
Sending email for trigger: Failure - Any



###################################################################################
############################## FAILED TESTS (if any) ##############################
4 tests failed.
FAILED:  org.apache.hadoop.hdfs.server.namenode.TestNameNodeMetadataConsistency.testGenerationStampInFuture

Error Message:
expected:<18> but was:<0>

Stack Trace:
java.lang.AssertionError: expected:<18> but was:<0>
	at org.junit.Assert.fail(Assert.java:88)
	at org.junit.Assert.failNotEquals(Assert.java:743)
	at org.junit.Assert.assertEquals(Assert.java:118)
	at org.junit.Assert.assertEquals(Assert.java:555)
	at org.junit.Assert.assertEquals(Assert.java:542)
	at org.apache.hadoop.hdfs.server.namenode.TestNameNodeMetadataConsistency.testGenerationStampInFuture(TestNameNodeMetadataConsistency.java:124)


FAILED:  org.apache.hadoop.hdfs.web.TestWebHdfsTokens.testNoTokenForRenewToken

Error Message:
test timed out after 5000 milliseconds

Stack Trace:
java.lang.Exception: test timed out after 5000 milliseconds
	at org.mockito.cglib.core.Signature.toString(Signature.java:58)
	at org.mockito.cglib.reflect.FastClassEmitter$1.transform(FastClassEmitter.java:117)
	at org.mockito.cglib.core.CollectionUtils.transform(CollectionUtils.java:62)
	at org.mockito.cglib.reflect.FastClassEmitter.emitIndexBySignature(FastClassEmitter.java:115)
	at org.mockito.cglib.reflect.FastClassEmitter.<init>(FastClassEmitter.java:75)
	at org.mockito.cglib.reflect.FastClass$Generator.generateClass(FastClass.java:73)
	at org.mockito.cglib.core.DefaultGeneratorStrategy.generate(DefaultGeneratorStrategy.java:25)
	at org.mockito.cglib.core.AbstractClassGenerator.create(AbstractClassGenerator.java:217)
	at org.mockito.cglib.reflect.FastClass$Generator.create(FastClass.java:65)
	at org.mockito.cglib.proxy.MethodProxy.helper(MethodProxy.java:121)
	at org.mockito.cglib.proxy.MethodProxy.init(MethodProxy.java:76)
	at org.mockito.cglib.proxy.MethodProxy.invokeSuper(MethodProxy.java:214)
	at org.mockito.internal.creation.AbstractMockitoMethodProxy.invokeSuper(AbstractMockitoMethodProxy.java:10)
	at org.mockito.internal.invocation.realmethod.CGLIBProxyRealMethod.invoke(CGLIBProxyRealMethod.java:22)
	at org.mockito.internal.invocation.realmethod.FilteredCGLIBProxyRealMethod.invoke(FilteredCGLIBProxyRealMethod.java:27)
	at org.mockito.internal.invocation.Invocation.callRealMethod(Invocation.java:211)
	at org.mockito.internal.stubbing.answers.CallsRealMethods.answer(CallsRealMethods.java:36)
	at org.mockito.internal.MockHandler.handle(MockHandler.java:99)
	at org.mockito.internal.creation.MethodInterceptorFilter.intercept(MethodInterceptorFilter.java:47)
	at org.apache.hadoop.hdfs.web.WebHdfsFileSystem$$EnhancerByMockitoWithCGLIB$$e6558549.initialize(<generated>)
	at org.apache.hadoop.hdfs.web.TestWebHdfsTokens.checkNoTokenForOperation(TestWebHdfsTokens.java:123)
	at org.apache.hadoop.hdfs.web.TestWebHdfsTokens.testNoTokenForRenewToken(TestWebHdfsTokens.java:112)


FAILED:  org.apache.hadoop.hdfs.TestEncryptionZones.testStartFileRetry

Error Message:
test timed out after 120000 milliseconds

Stack Trace:
java.lang.Exception: test timed out after 120000 milliseconds
	at sun.misc.Unsafe.park(Native Method)
	at java.util.concurrent.locks.LockSupport.park(LockSupport.java:186)
	at java.util.concurrent.locks.AbstractQueuedSynchronizer.parkAndCheckInterrupt(AbstractQueuedSynchronizer.java:834)
	at java.util.concurrent.locks.AbstractQueuedSynchronizer.doAcquireSharedInterruptibly(AbstractQueuedSynchronizer.java:994)
	at java.util.concurrent.locks.AbstractQueuedSynchronizer.acquireSharedInterruptibly(AbstractQueuedSynchronizer.java:1303)
	at java.util.concurrent.CountDownLatch.await(CountDownLatch.java:236)
	at org.apache.hadoop.hdfs.TestEncryptionZones.testStartFileRetry(TestEncryptionZones.java:1094)


FAILED:  org.apache.hadoop.hdfs.security.TestDelegationTokenForProxyUser.testWebHdfsDoAs

Error Message:
test timed out after 5000 milliseconds

Stack Trace:
java.lang.Exception: test timed out after 5000 milliseconds
	at java.net.SocketInputStream.socketRead0(Native Method)
	at java.net.SocketInputStream.read(SocketInputStream.java:152)
	at java.net.SocketInputStream.read(SocketInputStream.java:122)
	at java.io.BufferedInputStream.fill(BufferedInputStream.java:235)
	at java.io.BufferedInputStream.read1(BufferedInputStream.java:275)
	at java.io.BufferedInputStream.read(BufferedInputStream.java:334)
	at sun.net.www.http.HttpClient.parseHTTPHeader(HttpClient.java:687)
	at sun.net.www.http.HttpClient.parseHTTPHeader(HttpClient.java:798)
	at sun.net.www.http.HttpClient.parseHTTP(HttpClient.java:633)
	at sun.net.www.protocol.http.HttpURLConnection.getInputStream(HttpURLConnection.java:1323)
	at java.net.HttpURLConnection.getResponseCode(HttpURLConnection.java:468)
	at org.apache.hadoop.hdfs.web.WebHdfsFileSystem.validateResponse(WebHdfsFileSystem.java:365)
	at org.apache.hadoop.hdfs.web.WebHdfsFileSystem.access$200(WebHdfsFileSystem.java:91)
	at org.apache.hadoop.hdfs.web.WebHdfsFileSystem$FsPathOutputStreamRunner$1.close(WebHdfsFileSystem.java:820)
	at org.apache.hadoop.hdfs.security.TestDelegationTokenForProxyUser.testWebHdfsDoAs(TestDelegationTokenForProxyUser.java:170)



Mime
  • Unnamed multipart/mixed (inline, None, 0 bytes)
View raw message