hadoop-hdfs-dev mailing list archives

Site index · List index
Message view « Date » · « Thread »
Top « Date » · « Thread »
From Apache Jenkins Server <jenk...@builds.apache.org>
Subject Hadoop-Hdfs-trunk - Build # 2636 - Still Failing
Date Thu, 17 Dec 2015 11:39:27 GMT
See https://builds.apache.org/job/Hadoop-Hdfs-trunk/2636/

###################################################################################
########################## LAST 60 LINES OF THE CONSOLE ###########################
[...truncated 16035 lines...]
[INFO] --- maven-clean-plugin:2.5:clean (default-clean) @ hadoop-hdfs-project ---
[INFO] Deleting /home/jenkins/jenkins-slave/workspace/Hadoop-Hdfs-trunk/hadoop-hdfs-project/target
[INFO] 
[INFO] --- maven-antrun-plugin:1.7:run (create-testdirs) @ hadoop-hdfs-project ---
[INFO] Executing tasks

main:
    [mkdir] Created dir: /home/jenkins/jenkins-slave/workspace/Hadoop-Hdfs-trunk/hadoop-hdfs-project/target/test-dir
[INFO] Executed tasks
[INFO] 
[INFO] --- maven-source-plugin:2.3:jar-no-fork (hadoop-java-sources) @ hadoop-hdfs-project
---
[INFO] 
[INFO] --- maven-source-plugin:2.3:test-jar-no-fork (hadoop-java-sources) @ hadoop-hdfs-project
---
[INFO] 
[INFO] --- maven-enforcer-plugin:1.3.1:enforce (dist-enforce) @ hadoop-hdfs-project ---
[INFO] 
[INFO] --- maven-site-plugin:3.4:attach-descriptor (attach-descriptor) @ hadoop-hdfs-project
---
[INFO] 
[INFO] --- maven-javadoc-plugin:2.8.1:jar (module-javadocs) @ hadoop-hdfs-project ---
[INFO] Skipping javadoc generation
[INFO] 
[INFO] --- maven-enforcer-plugin:1.3.1:enforce (depcheck) @ hadoop-hdfs-project ---
[INFO] 
[INFO] --- maven-checkstyle-plugin:2.15:checkstyle (default-cli) @ hadoop-hdfs-project ---
[INFO] 
[INFO] --- findbugs-maven-plugin:3.0.0:findbugs (default-cli) @ hadoop-hdfs-project ---
[INFO] ------------------------------------------------------------------------
[INFO] Reactor Summary:
[INFO] 
[INFO] Apache Hadoop HDFS Client ......................... SUCCESS [08:52 min]
[INFO] Apache Hadoop HDFS ................................ FAILURE [  06:49 h]
[INFO] Apache Hadoop HDFS Native Client .................. SKIPPED
[INFO] Apache Hadoop HttpFS .............................. SKIPPED
[INFO] Apache Hadoop HDFS BookKeeper Journal ............. SKIPPED
[INFO] Apache Hadoop HDFS-NFS ............................ SKIPPED
[INFO] Apache Hadoop HDFS Project ........................ SUCCESS [  3.134 s]
[INFO] ------------------------------------------------------------------------
[INFO] BUILD FAILURE
[INFO] ------------------------------------------------------------------------
[INFO] Total time: 06:58 h
[INFO] Finished at: 2015-12-17T11:37:54+00:00
[INFO] Final Memory: 74M/701M
[INFO] ------------------------------------------------------------------------
[ERROR] Failed to execute goal org.apache.maven.plugins:maven-surefire-plugin:2.17:test (default-test)
on project hadoop-hdfs: ExecutionException: java.lang.RuntimeException: java.lang.RuntimeException:
java.io.IOException: Stream Closed -> [Help 1]
[ERROR] 
[ERROR] To see the full stack trace of the errors, re-run Maven with the -e switch.
[ERROR] Re-run Maven using the -X switch to enable full debug logging.
[ERROR] 
[ERROR] For more information about the errors and possible solutions, please read the following
articles:
[ERROR] [Help 1] http://cwiki.apache.org/confluence/display/MAVEN/MojoFailureException
[ERROR] 
[ERROR] After correcting the problems, you can resume the build with the command
[ERROR]   mvn <goals> -rf :hadoop-hdfs
Build step 'Execute shell' marked build as failure
Archiving artifacts
Recording test results
Sending e-mails to: hdfs-dev@hadoop.apache.org
Email was triggered for: Failure - Any
Sending email for trigger: Failure - Any



###################################################################################
############################## FAILED TESTS (if any) ##############################
15 tests failed.
FAILED:  org.apache.hadoop.hdfs.TestDFSStripedOutputStreamWithFailure170.test9

Error Message:
test timed out after 240000 milliseconds

Stack Trace:
java.lang.Exception: test timed out after 240000 milliseconds
	at sun.nio.ch.EPollArrayWrapper.interrupt(Native Method)
	at sun.nio.ch.EPollArrayWrapper.interrupt(EPollArrayWrapper.java:317)
	at sun.nio.ch.EPollSelectorImpl.wakeup(EPollSelectorImpl.java:193)
	at io.netty.channel.nio.NioEventLoop.wakeup(NioEventLoop.java:590)
	at io.netty.util.concurrent.SingleThreadEventExecutor.shutdownGracefully(SingleThreadEventExecutor.java:503)
	at io.netty.util.concurrent.MultithreadEventExecutorGroup.shutdownGracefully(MultithreadEventExecutorGroup.java:160)
	at io.netty.util.concurrent.AbstractEventExecutorGroup.shutdownGracefully(AbstractEventExecutorGroup.java:70)
	at org.apache.hadoop.hdfs.server.datanode.web.DatanodeHttpServer.close(DatanodeHttpServer.java:232)
	at org.apache.hadoop.hdfs.server.datanode.DataNode.shutdown(DataNode.java:1820)
	at org.apache.hadoop.hdfs.MiniDFSCluster.shutdownDataNodes(MiniDFSCluster.java:1937)
	at org.apache.hadoop.hdfs.MiniDFSCluster.shutdown(MiniDFSCluster.java:1908)
	at org.apache.hadoop.hdfs.MiniDFSCluster.shutdown(MiniDFSCluster.java:1882)
	at org.apache.hadoop.hdfs.MiniDFSCluster.shutdown(MiniDFSCluster.java:1875)
	at org.apache.hadoop.hdfs.TestDFSStripedOutputStreamWithFailure.tearDown(TestDFSStripedOutputStreamWithFailure.java:156)
	at org.apache.hadoop.hdfs.TestDFSStripedOutputStreamWithFailure.runTest(TestDFSStripedOutputStreamWithFailure.java:288)
	at org.apache.hadoop.hdfs.TestDFSStripedOutputStreamWithFailure$TestBase.run(TestDFSStripedOutputStreamWithFailure.java:486)
	at org.apache.hadoop.hdfs.TestDFSStripedOutputStreamWithFailure$TestBase.test9(TestDFSStripedOutputStreamWithFailure.java:498)
	at sun.reflect.NativeMethodAccessorImpl.invoke0(Native Method)
	at sun.reflect.NativeMethodAccessorImpl.invoke(NativeMethodAccessorImpl.java:57)
	at sun.reflect.DelegatingMethodAccessorImpl.invoke(DelegatingMethodAccessorImpl.java:43)
	at java.lang.reflect.Method.invoke(Method.java:606)
	at org.junit.runners.model.FrameworkMethod$1.runReflectiveCall(FrameworkMethod.java:47)
	at org.junit.internal.runners.model.ReflectiveCallable.run(ReflectiveCallable.java:12)
	at org.junit.runners.model.FrameworkMethod.invokeExplosively(FrameworkMethod.java:44)
	at org.junit.internal.runners.statements.InvokeMethod.evaluate(InvokeMethod.java:17)
	at org.junit.internal.runners.statements.FailOnTimeout$StatementThread.run(FailOnTimeout.java:74)


FAILED:  org.apache.hadoop.hdfs.TestMissingBlocksAlert.testMissingBlocksAlert

Error Message:
expected:<2> but was:<4>

Stack Trace:
java.lang.AssertionError: expected:<2> but was:<4>
	at org.junit.Assert.fail(Assert.java:88)
	at org.junit.Assert.failNotEquals(Assert.java:743)
	at org.junit.Assert.assertEquals(Assert.java:118)
	at org.junit.Assert.assertEquals(Assert.java:555)
	at org.junit.Assert.assertEquals(Assert.java:542)
	at org.apache.hadoop.hdfs.TestMissingBlocksAlert.testMissingBlocksAlert(TestMissingBlocksAlert.java:119)


FAILED:  org.apache.hadoop.hdfs.TestPersistBlocks.TestRestartDfsWithFlush

Error Message:
End of File Exception between local host is: "asf909.gq1.ygridcore.net/67.195.81.153"; destination
host is: "localhost":41006; : java.io.EOFException; For more details see:  http://wiki.apache.org/hadoop/EOFException

Stack Trace:
java.io.EOFException: End of File Exception between local host is: "asf909.gq1.ygridcore.net/67.195.81.153";
destination host is: "localhost":41006; : java.io.EOFException; For more details see:  http://wiki.apache.org/hadoop/EOFException
	at sun.reflect.NativeConstructorAccessorImpl.newInstance0(Native Method)
	at sun.reflect.NativeConstructorAccessorImpl.newInstance(NativeConstructorAccessorImpl.java:57)
	at sun.reflect.DelegatingConstructorAccessorImpl.newInstance(DelegatingConstructorAccessorImpl.java:45)
	at java.lang.reflect.Constructor.newInstance(Constructor.java:526)
	at org.apache.hadoop.net.NetUtils.wrapWithMessage(NetUtils.java:792)
	at org.apache.hadoop.net.NetUtils.wrapException(NetUtils.java:765)
	at org.apache.hadoop.ipc.Client.call(Client.java:1452)
	at org.apache.hadoop.ipc.Client.call(Client.java:1385)
	at org.apache.hadoop.ipc.ProtobufRpcEngine$Invoker.invoke(ProtobufRpcEngine.java:230)
	at com.sun.proxy.$Proxy19.addBlock(Unknown Source)
	at org.apache.hadoop.hdfs.protocolPB.ClientNamenodeProtocolTranslatorPB.addBlock(ClientNamenodeProtocolTranslatorPB.java:404)
	at sun.reflect.GeneratedMethodAccessor12.invoke(Unknown Source)
	at sun.reflect.DelegatingMethodAccessorImpl.invoke(DelegatingMethodAccessorImpl.java:43)
	at java.lang.reflect.Method.invoke(Method.java:606)
	at org.apache.hadoop.io.retry.RetryInvocationHandler.invokeMethod(RetryInvocationHandler.java:255)
	at org.apache.hadoop.io.retry.RetryInvocationHandler.invoke(RetryInvocationHandler.java:103)
	at com.sun.proxy.$Proxy20.addBlock(Unknown Source)
	at org.apache.hadoop.hdfs.DFSOutputStream.addBlock(DFSOutputStream.java:917)
	at org.apache.hadoop.hdfs.DataStreamer.locateFollowingBlock(DataStreamer.java:1685)
	at org.apache.hadoop.hdfs.DataStreamer.nextBlockOutputStream(DataStreamer.java:1495)
	at org.apache.hadoop.hdfs.DataStreamer.run(DataStreamer.java:595)
Caused by: java.io.EOFException: null
	at java.io.DataInputStream.readInt(DataInputStream.java:392)
	at org.apache.hadoop.ipc.Client$Connection.receiveRpcResponse(Client.java:1110)
	at org.apache.hadoop.ipc.Client$Connection.run(Client.java:1005)


FAILED:  org.apache.hadoop.hdfs.protocol.datatransfer.sasl.TestSaslDataTransfer.testNoSaslAndSecurePortsIgnored

Error Message:
test timed out after 60000 milliseconds

Stack Trace:
java.lang.Exception: test timed out after 60000 milliseconds
	at java.lang.Thread.sleep(Native Method)
	at org.apache.hadoop.hdfs.MiniDFSCluster.waitActive(MiniDFSCluster.java:2447)
	at org.apache.hadoop.hdfs.MiniDFSCluster.waitActive(MiniDFSCluster.java:2487)
	at org.apache.hadoop.hdfs.MiniDFSCluster.startDataNodes(MiniDFSCluster.java:1632)
	at org.apache.hadoop.hdfs.MiniDFSCluster.initMiniDFSCluster(MiniDFSCluster.java:844)
	at org.apache.hadoop.hdfs.MiniDFSCluster.<init>(MiniDFSCluster.java:482)
	at org.apache.hadoop.hdfs.MiniDFSCluster$Builder.build(MiniDFSCluster.java:441)
	at org.apache.hadoop.hdfs.protocol.datatransfer.sasl.TestSaslDataTransfer.startCluster(TestSaslDataTransfer.java:196)
	at org.apache.hadoop.hdfs.protocol.datatransfer.sasl.TestSaslDataTransfer.testNoSaslAndSecurePortsIgnored(TestSaslDataTransfer.java:164)


FAILED:  org.apache.hadoop.hdfs.protocol.datatransfer.sasl.TestSaslDataTransfer.testIntegrity

Error Message:
expected:<3> but was:<1>

Stack Trace:
java.lang.AssertionError: expected:<3> but was:<1>
	at org.junit.Assert.fail(Assert.java:88)
	at org.junit.Assert.failNotEquals(Assert.java:743)
	at org.junit.Assert.assertEquals(Assert.java:118)
	at org.junit.Assert.assertEquals(Assert.java:555)
	at org.junit.Assert.assertEquals(Assert.java:542)
	at org.apache.hadoop.hdfs.protocol.datatransfer.sasl.TestSaslDataTransfer.doTest(TestSaslDataTransfer.java:185)
	at org.apache.hadoop.hdfs.protocol.datatransfer.sasl.TestSaslDataTransfer.testIntegrity(TestSaslDataTransfer.java:90)


FAILED:  org.apache.hadoop.hdfs.server.blockmanagement.TestBlockManager.testBlockReportQueueing

Error Message:
null

Stack Trace:
java.lang.AssertionError: null
	at org.junit.Assert.fail(Assert.java:86)
	at org.junit.Assert.assertTrue(Assert.java:41)
	at org.junit.Assert.assertTrue(Assert.java:52)
	at org.apache.hadoop.hdfs.server.blockmanagement.TestBlockManager.testBlockReportQueueing(TestBlockManager.java:926)


FAILED:  org.apache.hadoop.hdfs.server.datanode.TestBlockReplacement.testDeletedBlockWhenAddBlockIsInEdit

Error Message:
The block should be only on 1 datanode  expected:<1> but was:<2>

Stack Trace:
java.lang.AssertionError: The block should be only on 1 datanode  expected:<1> but was:<2>
	at org.junit.Assert.fail(Assert.java:88)
	at org.junit.Assert.failNotEquals(Assert.java:743)
	at org.junit.Assert.assertEquals(Assert.java:118)
	at org.junit.Assert.assertEquals(Assert.java:555)
	at org.apache.hadoop.hdfs.server.datanode.TestBlockReplacement.testDeletedBlockWhenAddBlockIsInEdit(TestBlockReplacement.java:435)


FAILED:  org.apache.hadoop.hdfs.server.datanode.TestBlockScanner.testVolumeIteratorWithCaching

Error Message:
test timed out after 60000 milliseconds

Stack Trace:
java.lang.Exception: test timed out after 60000 milliseconds
	at java.lang.Object.wait(Native Method)
	at java.lang.Object.wait(Object.java:503)
	at org.apache.hadoop.ipc.Client.call(Client.java:1439)
	at org.apache.hadoop.ipc.Client.call(Client.java:1385)
	at org.apache.hadoop.ipc.ProtobufRpcEngine$Invoker.invoke(ProtobufRpcEngine.java:230)
	at com.sun.proxy.$Proxy20.getBlockLocations(Unknown Source)
	at org.apache.hadoop.hdfs.protocolPB.ClientNamenodeProtocolTranslatorPB.getBlockLocations(ClientNamenodeProtocolTranslatorPB.java:253)
	at sun.reflect.GeneratedMethodAccessor14.invoke(Unknown Source)
	at sun.reflect.DelegatingMethodAccessorImpl.invoke(DelegatingMethodAccessorImpl.java:43)
	at java.lang.reflect.Method.invoke(Method.java:606)
	at org.apache.hadoop.io.retry.RetryInvocationHandler.invokeMethod(RetryInvocationHandler.java:255)
	at org.apache.hadoop.io.retry.RetryInvocationHandler.invoke(RetryInvocationHandler.java:103)
	at com.sun.proxy.$Proxy21.getBlockLocations(Unknown Source)
	at org.apache.hadoop.hdfs.DFSClient.callGetBlockLocations(DFSClient.java:829)
	at org.apache.hadoop.hdfs.DFSClient.getLocatedBlocks(DFSClient.java:818)
	at org.apache.hadoop.hdfs.DFSClient.getLocatedBlocks(DFSClient.java:807)
	at org.apache.hadoop.hdfs.DFSClient.open(DFSClient.java:1039)
	at org.apache.hadoop.hdfs.DistributedFileSystem$3.doCall(DistributedFileSystem.java:270)
	at org.apache.hadoop.hdfs.DistributedFileSystem$3.doCall(DistributedFileSystem.java:267)
	at org.apache.hadoop.fs.FileSystemLinkResolver.resolve(FileSystemLinkResolver.java:81)
	at org.apache.hadoop.hdfs.DistributedFileSystem.open(DistributedFileSystem.java:267)
	at org.apache.hadoop.fs.FileSystem.open(FileSystem.java:773)
	at org.apache.hadoop.hdfs.DFSTestUtil.getFirstBlock(DFSTestUtil.java:781)
	at org.apache.hadoop.hdfs.server.datanode.TestBlockScanner$TestContext.getFileBlock(TestBlockScanner.java:140)
	at org.apache.hadoop.hdfs.server.datanode.TestBlockScanner.testVolumeIteratorImpl(TestBlockScanner.java:174)
	at org.apache.hadoop.hdfs.server.datanode.TestBlockScanner.testVolumeIteratorWithCaching(TestBlockScanner.java:250)


FAILED:  org.apache.hadoop.hdfs.server.datanode.TestDataNodeMultipleRegistrations.testClusterIdMismatchAtStartupWithHA

Error Message:
test timed out after 20000 milliseconds

Stack Trace:
java.lang.Exception: test timed out after 20000 milliseconds
	at java.lang.Thread.sleep(Native Method)
	at org.mortbay.thread.QueuedThreadPool.doStop(QueuedThreadPool.java:435)
	at org.mortbay.component.AbstractLifeCycle.stop(AbstractLifeCycle.java:76)
	at org.mortbay.jetty.Server.doStop(Server.java:291)
	at org.mortbay.component.AbstractLifeCycle.stop(AbstractLifeCycle.java:76)
	at org.apache.hadoop.http.HttpServer2.stop(HttpServer2.java:952)
	at org.apache.hadoop.hdfs.server.namenode.NameNodeHttpServer.stop(NameNodeHttpServer.java:199)
	at org.apache.hadoop.hdfs.server.namenode.NameNode.stopHttpServer(NameNode.java:828)
	at org.apache.hadoop.hdfs.server.namenode.NameNode.stopCommonServices(NameNode.java:785)
	at org.apache.hadoop.hdfs.server.namenode.NameNode.stop(NameNode.java:953)
	at org.apache.hadoop.hdfs.MiniDFSCluster.shutdown(MiniDFSCluster.java:1913)
	at org.apache.hadoop.hdfs.MiniDFSCluster.shutdown(MiniDFSCluster.java:1882)
	at org.apache.hadoop.hdfs.MiniDFSCluster.shutdown(MiniDFSCluster.java:1875)
	at org.apache.hadoop.hdfs.server.datanode.TestDataNodeMultipleRegistrations.testClusterIdMismatchAtStartupWithHA(TestDataNodeMultipleRegistrations.java:259)


FAILED:  org.apache.hadoop.hdfs.server.datanode.TestDataNodeVolumeFailure.testUnderReplicationAfterVolFailure

Error Message:
There is no under replicated block after volume failure

Stack Trace:
java.lang.AssertionError: There is no under replicated block after volume failure
	at org.junit.Assert.fail(Assert.java:88)
	at org.junit.Assert.assertTrue(Assert.java:41)
	at org.apache.hadoop.hdfs.server.datanode.TestDataNodeVolumeFailure.testUnderReplicationAfterVolFailure(TestDataNodeVolumeFailure.java:398)


FAILED:  org.apache.hadoop.hdfs.server.datanode.TestDirectoryScanner.testThrottling

Error Message:
test timed out after 300000 milliseconds

Stack Trace:
java.lang.Exception: test timed out after 300000 milliseconds
	at java.lang.Object.wait(Native Method)
	at java.lang.Object.wait(Object.java:503)
	at org.apache.hadoop.hdfs.DataStreamer.waitAndQueuePacket(DataStreamer.java:805)
	at org.apache.hadoop.hdfs.DFSOutputStream.enqueueCurrentPacket(DFSOutputStream.java:423)
	at org.apache.hadoop.hdfs.DFSOutputStream.enqueueCurrentPacketFull(DFSOutputStream.java:432)
	at org.apache.hadoop.hdfs.DFSOutputStream.writeChunk(DFSOutputStream.java:418)
	at org.apache.hadoop.fs.FSOutputSummer.writeChecksumChunks(FSOutputSummer.java:217)
	at org.apache.hadoop.fs.FSOutputSummer.write1(FSOutputSummer.java:125)
	at org.apache.hadoop.fs.FSOutputSummer.write(FSOutputSummer.java:111)
	at org.apache.hadoop.fs.FSDataOutputStream$PositionCache.write(FSDataOutputStream.java:57)
	at java.io.DataOutputStream.write(DataOutputStream.java:107)
	at org.apache.hadoop.hdfs.DFSTestUtil.createFile(DFSTestUtil.java:418)
	at org.apache.hadoop.hdfs.DFSTestUtil.createFile(DFSTestUtil.java:376)
	at org.apache.hadoop.hdfs.server.datanode.TestDirectoryScanner.createFile(TestDirectoryScanner.java:104)
	at org.apache.hadoop.hdfs.server.datanode.TestDirectoryScanner.testThrottling(TestDirectoryScanner.java:580)


FAILED:  org.apache.hadoop.hdfs.server.namenode.TestDeleteRace.testDeleteAndCommitBlockSynchonizationRaceNoSnapshot

Error Message:
test timed out after 600000 milliseconds

Stack Trace:
java.lang.Exception: test timed out after 600000 milliseconds
	at sun.misc.Unsafe.park(Native Method)
	at java.util.concurrent.locks.LockSupport.park(LockSupport.java:186)
	at java.util.concurrent.locks.AbstractQueuedSynchronizer.parkAndCheckInterrupt(AbstractQueuedSynchronizer.java:834)
	at java.util.concurrent.locks.AbstractQueuedSynchronizer.doAcquireSharedInterruptibly(AbstractQueuedSynchronizer.java:994)
	at java.util.concurrent.locks.AbstractQueuedSynchronizer.acquireSharedInterruptibly(AbstractQueuedSynchronizer.java:1303)
	at java.util.concurrent.CountDownLatch.await(CountDownLatch.java:236)
	at org.apache.hadoop.test.GenericTestUtils$DelayAnswer.waitForCall(GenericTestUtils.java:251)
	at org.apache.hadoop.hdfs.server.namenode.TestDeleteRace.testDeleteAndCommitBlockSynchronizationRace(TestDeleteRace.java:317)
	at org.apache.hadoop.hdfs.server.namenode.TestDeleteRace.testDeleteAndCommitBlockSynchonizationRaceNoSnapshot(TestDeleteRace.java:350)


FAILED:  org.apache.hadoop.hdfs.server.namenode.TestFileTruncate.testTruncateWithDataNodesShutdownImmediately

Error Message:
inode should complete in ~30000 ms.
Expected: is <true>
     but: was <false>

Stack Trace:
java.lang.AssertionError: inode should complete in ~30000 ms.
Expected: is <true>
     but: was <false>
	at org.hamcrest.MatcherAssert.assertThat(MatcherAssert.java:20)
	at org.junit.Assert.assertThat(Assert.java:865)
	at org.apache.hadoop.hdfs.server.namenode.TestFileTruncate.checkBlockRecovery(TestFileTruncate.java:1190)
	at org.apache.hadoop.hdfs.server.namenode.TestFileTruncate.checkBlockRecovery(TestFileTruncate.java:1174)
	at org.apache.hadoop.hdfs.server.namenode.TestFileTruncate.checkBlockRecovery(TestFileTruncate.java:1169)
	at org.apache.hadoop.hdfs.server.namenode.TestFileTruncate.testTruncateWithDataNodesShutdownImmediately(TestFileTruncate.java:866)


FAILED:  org.apache.hadoop.hdfs.server.namenode.TestFileTruncate.testTruncateWithDataNodesRestart

Error Message:
Timed out waiting for /test/testTruncateWithDataNodesRestart to reach 3 replicas

Stack Trace:
java.util.concurrent.TimeoutException: Timed out waiting for /test/testTruncateWithDataNodesRestart
to reach 3 replicas
	at org.apache.hadoop.hdfs.DFSTestUtil.waitReplication(DFSTestUtil.java:768)
	at org.apache.hadoop.hdfs.server.namenode.TestFileTruncate.testTruncateWithDataNodesRestart(TestFileTruncate.java:698)


FAILED:  org.apache.hadoop.hdfs.server.namenode.TestSecureNameNode.testName

Error Message:
Failed on local exception: java.io.IOException: javax.security.sasl.SaslException: GSS initiate
failed [Caused by GSSException: No valid credentials provided (Mechanism level: Cannot get
a KDC reply)]; Host Details : local host is: "asf909.gq1.ygridcore.net/67.195.81.153"; destination
host is: "localhost":57851; 

Stack Trace:
java.io.IOException: Failed on local exception: java.io.IOException: javax.security.sasl.SaslException:
GSS initiate failed [Caused by GSSException: No valid credentials provided (Mechanism level:
Cannot get a KDC reply)]; Host Details : local host is: "asf909.gq1.ygridcore.net/67.195.81.153";
destination host is: "localhost":57851; 
	at sun.security.krb5.KdcComm.send(KdcComm.java:250)
	at sun.security.krb5.KdcComm.send(KdcComm.java:191)
	at sun.security.krb5.KrbTgsReq.send(KrbTgsReq.java:187)
	at sun.security.krb5.KrbTgsReq.sendAndGetCreds(KrbTgsReq.java:202)
	at sun.security.krb5.internal.CredentialsUtil.serviceCreds(CredentialsUtil.java:311)
	at sun.security.krb5.internal.CredentialsUtil.acquireServiceCreds(CredentialsUtil.java:115)
	at sun.security.krb5.Credentials.acquireServiceCreds(Credentials.java:449)
	at sun.security.jgss.krb5.Krb5Context.initSecContext(Krb5Context.java:641)
	at sun.security.jgss.GSSContextImpl.initSecContext(GSSContextImpl.java:248)
	at sun.security.jgss.GSSContextImpl.initSecContext(GSSContextImpl.java:179)
	at com.sun.security.sasl.gsskerb.GssKrb5Client.evaluateChallenge(GssKrb5Client.java:193)
	at org.apache.hadoop.security.SaslRpcClient.saslConnect(SaslRpcClient.java:411)
	at org.apache.hadoop.ipc.Client$Connection.setupSaslConnection(Client.java:565)
	at org.apache.hadoop.ipc.Client$Connection.access$1900(Client.java:378)
	at org.apache.hadoop.ipc.Client$Connection$2.run(Client.java:749)
	at org.apache.hadoop.ipc.Client$Connection$2.run(Client.java:745)
	at java.security.AccessController.doPrivileged(Native Method)
	at javax.security.auth.Subject.doAs(Subject.java:415)
	at org.apache.hadoop.security.UserGroupInformation.doAs(UserGroupInformation.java:1669)
	at org.apache.hadoop.ipc.Client$Connection.setupIOstreams(Client.java:744)
	at org.apache.hadoop.ipc.Client$Connection.access$2900(Client.java:378)
	at org.apache.hadoop.ipc.Client.getConnection(Client.java:1509)
	at org.apache.hadoop.ipc.Client.call(Client.java:1424)
	at org.apache.hadoop.ipc.Client.call(Client.java:1385)
	at org.apache.hadoop.ipc.ProtobufRpcEngine$Invoker.invoke(ProtobufRpcEngine.java:230)
	at com.sun.proxy.$Proxy19.mkdirs(Unknown Source)
	at org.apache.hadoop.hdfs.protocolPB.ClientNamenodeProtocolTranslatorPB.mkdirs(ClientNamenodeProtocolTranslatorPB.java:533)
	at sun.reflect.NativeMethodAccessorImpl.invoke0(Native Method)
	at sun.reflect.NativeMethodAccessorImpl.invoke(NativeMethodAccessorImpl.java:57)
	at sun.reflect.DelegatingMethodAccessorImpl.invoke(DelegatingMethodAccessorImpl.java:43)
	at java.lang.reflect.Method.invoke(Method.java:606)
	at org.apache.hadoop.io.retry.RetryInvocationHandler.invokeMethod(RetryInvocationHandler.java:255)
	at org.apache.hadoop.io.retry.RetryInvocationHandler.invoke(RetryInvocationHandler.java:103)
	at com.sun.proxy.$Proxy20.mkdirs(Unknown Source)
	at org.apache.hadoop.hdfs.DFSClient.primitiveMkdir(DFSClient.java:2411)
	at org.apache.hadoop.hdfs.DFSClient.mkdirs(DFSClient.java:2386)
	at org.apache.hadoop.hdfs.DistributedFileSystem$22.doCall(DistributedFileSystem.java:1035)
	at org.apache.hadoop.hdfs.DistributedFileSystem$22.doCall(DistributedFileSystem.java:1032)
	at org.apache.hadoop.fs.FileSystemLinkResolver.resolve(FileSystemLinkResolver.java:81)
	at org.apache.hadoop.hdfs.DistributedFileSystem.mkdirsInternal(DistributedFileSystem.java:1032)
	at org.apache.hadoop.hdfs.DistributedFileSystem.mkdirs(DistributedFileSystem.java:1025)
	at org.apache.hadoop.fs.FileSystem.mkdirs(FileSystem.java:1891)
	at org.apache.hadoop.hdfs.server.namenode.TestSecureNameNode.testName(TestSecureNameNode.java:65)



Mime
  • Unnamed multipart/mixed (inline, None, 0 bytes)
View raw message