hadoop-hdfs-dev mailing list archives

Site index · List index
Message view « Date » · « Thread »
Top « Date » · « Thread »
From Apache Jenkins Server <jenk...@builds.apache.org>
Subject Build failed in Jenkins: Hadoop-Hdfs-trunk-Java8 #661
Date Thu, 03 Dec 2015 15:59:05 GMT
See <https://builds.apache.org/job/Hadoop-Hdfs-trunk-Java8/661/changes>

Changes:

[junping_du] YARN-4408. Fix issue that NodeManager still reports negative running

------------------------------------------
[...truncated 5816 lines...]
Running org.apache.hadoop.hdfs.TestErasureCodingPolicyWithSnapshot
Tests run: 4, Failures: 0, Errors: 0, Skipped: 0, Time elapsed: 25.263 sec - in org.apache.hadoop.hdfs.TestErasureCodingPolicyWithSnapshot
Java HotSpot(TM) 64-Bit Server VM warning: ignoring option MaxPermSize=768m; support was removed
in 8.0
Running org.apache.hadoop.hdfs.TestFsShellPermission
Tests run: 1, Failures: 0, Errors: 0, Skipped: 0, Time elapsed: 6.202 sec - in org.apache.hadoop.hdfs.TestFsShellPermission
Java HotSpot(TM) 64-Bit Server VM warning: ignoring option MaxPermSize=768m; support was removed
in 8.0
Running org.apache.hadoop.hdfs.server.namenode.TestAuditLogAtDebug
Tests run: 6, Failures: 0, Errors: 0, Skipped: 0, Time elapsed: 0.879 sec - in org.apache.hadoop.hdfs.server.namenode.TestAuditLogAtDebug
Java HotSpot(TM) 64-Bit Server VM warning: ignoring option MaxPermSize=768m; support was removed
in 8.0
Running org.apache.hadoop.hdfs.server.namenode.TestNamenodeCapacityReport
Tests run: 2, Failures: 0, Errors: 0, Skipped: 0, Time elapsed: 19.214 sec - in org.apache.hadoop.hdfs.server.namenode.TestNamenodeCapacityReport
Java HotSpot(TM) 64-Bit Server VM warning: ignoring option MaxPermSize=768m; support was removed
in 8.0
Running org.apache.hadoop.hdfs.server.namenode.TestNNStorageRetentionFunctional
Tests run: 1, Failures: 0, Errors: 0, Skipped: 0, Time elapsed: 4.533 sec - in org.apache.hadoop.hdfs.server.namenode.TestNNStorageRetentionFunctional
Java HotSpot(TM) 64-Bit Server VM warning: ignoring option MaxPermSize=768m; support was removed
in 8.0
Running org.apache.hadoop.hdfs.server.namenode.TestNameNodeHttpServer
Tests run: 3, Failures: 0, Errors: 0, Skipped: 0, Time elapsed: 2.063 sec - in org.apache.hadoop.hdfs.server.namenode.TestNameNodeHttpServer
Java HotSpot(TM) 64-Bit Server VM warning: ignoring option MaxPermSize=768m; support was removed
in 8.0
Running org.apache.hadoop.hdfs.server.namenode.TestLargeDirectoryDelete
Tests run: 1, Failures: 0, Errors: 0, Skipped: 0, Time elapsed: 33.207 sec - in org.apache.hadoop.hdfs.server.namenode.TestLargeDirectoryDelete
Java HotSpot(TM) 64-Bit Server VM warning: ignoring option MaxPermSize=768m; support was removed
in 8.0
Running org.apache.hadoop.hdfs.server.namenode.TestAddBlock
Tests run: 2, Failures: 0, Errors: 0, Skipped: 0, Time elapsed: 19.779 sec - in org.apache.hadoop.hdfs.server.namenode.TestAddBlock
Java HotSpot(TM) 64-Bit Server VM warning: ignoring option MaxPermSize=768m; support was removed
in 8.0
Running org.apache.hadoop.hdfs.server.namenode.TestNameNodeRpcServer
Tests run: 1, Failures: 0, Errors: 0, Skipped: 0, Time elapsed: 4.616 sec - in org.apache.hadoop.hdfs.server.namenode.TestNameNodeRpcServer
Java HotSpot(TM) 64-Bit Server VM warning: ignoring option MaxPermSize=768m; support was removed
in 8.0
Running org.apache.hadoop.hdfs.server.namenode.TestStartupProgressServlet
Tests run: 3, Failures: 0, Errors: 0, Skipped: 0, Time elapsed: 0.516 sec - in org.apache.hadoop.hdfs.server.namenode.TestStartupProgressServlet
Java HotSpot(TM) 64-Bit Server VM warning: ignoring option MaxPermSize=768m; support was removed
in 8.0
Running org.apache.hadoop.hdfs.server.namenode.web.resources.TestWebHdfsDataLocality
Tests run: 3, Failures: 0, Errors: 0, Skipped: 0, Time elapsed: 10.975 sec - in org.apache.hadoop.hdfs.server.namenode.web.resources.TestWebHdfsDataLocality
Java HotSpot(TM) 64-Bit Server VM warning: ignoring option MaxPermSize=768m; support was removed
in 8.0
Running org.apache.hadoop.hdfs.server.namenode.TestFileContextAcl
Tests run: 64, Failures: 0, Errors: 0, Skipped: 0, Time elapsed: 26.281 sec - in org.apache.hadoop.hdfs.server.namenode.TestFileContextAcl
Java HotSpot(TM) 64-Bit Server VM warning: ignoring option MaxPermSize=768m; support was removed
in 8.0
Running org.apache.hadoop.hdfs.server.namenode.TestBlockUnderConstruction
Tests run: 2, Failures: 0, Errors: 0, Skipped: 0, Time elapsed: 5.723 sec - in org.apache.hadoop.hdfs.server.namenode.TestBlockUnderConstruction
Java HotSpot(TM) 64-Bit Server VM warning: ignoring option MaxPermSize=768m; support was removed
in 8.0
Running org.apache.hadoop.hdfs.server.namenode.TestPathComponents
Tests run: 1, Failures: 0, Errors: 0, Skipped: 0, Time elapsed: 0.237 sec - in org.apache.hadoop.hdfs.server.namenode.TestPathComponents
Java HotSpot(TM) 64-Bit Server VM warning: ignoring option MaxPermSize=768m; support was removed
in 8.0
Running org.apache.hadoop.hdfs.server.namenode.top.window.TestRollingWindowManager
Tests run: 1, Failures: 0, Errors: 0, Skipped: 0, Time elapsed: 0.489 sec - in org.apache.hadoop.hdfs.server.namenode.top.window.TestRollingWindowManager
Java HotSpot(TM) 64-Bit Server VM warning: ignoring option MaxPermSize=768m; support was removed
in 8.0
Running org.apache.hadoop.hdfs.server.namenode.top.window.TestRollingWindow
Tests run: 2, Failures: 0, Errors: 0, Skipped: 0, Time elapsed: 0.175 sec - in org.apache.hadoop.hdfs.server.namenode.top.window.TestRollingWindow
Java HotSpot(TM) 64-Bit Server VM warning: ignoring option MaxPermSize=768m; support was removed
in 8.0
Running org.apache.hadoop.hdfs.server.namenode.snapshot.TestOpenFilesWithSnapshot
Tests run: 7, Failures: 0, Errors: 0, Skipped: 0, Time elapsed: 60.846 sec - in org.apache.hadoop.hdfs.server.namenode.snapshot.TestOpenFilesWithSnapshot
Java HotSpot(TM) 64-Bit Server VM warning: ignoring option MaxPermSize=768m; support was removed
in 8.0
Running org.apache.hadoop.hdfs.server.namenode.snapshot.TestFileWithSnapshotFeature
Tests run: 1, Failures: 0, Errors: 0, Skipped: 0, Time elapsed: 0.531 sec - in org.apache.hadoop.hdfs.server.namenode.snapshot.TestFileWithSnapshotFeature
Java HotSpot(TM) 64-Bit Server VM warning: ignoring option MaxPermSize=768m; support was removed
in 8.0
Running org.apache.hadoop.hdfs.server.namenode.snapshot.TestSnapshotMetrics
Tests run: 2, Failures: 0, Errors: 0, Skipped: 0, Time elapsed: 8.697 sec - in org.apache.hadoop.hdfs.server.namenode.snapshot.TestSnapshotMetrics
Java HotSpot(TM) 64-Bit Server VM warning: ignoring option MaxPermSize=768m; support was removed
in 8.0
Running org.apache.hadoop.hdfs.server.namenode.snapshot.TestUpdatePipelineWithSnapshots
Tests run: 1, Failures: 0, Errors: 0, Skipped: 0, Time elapsed: 11.38 sec - in org.apache.hadoop.hdfs.server.namenode.snapshot.TestUpdatePipelineWithSnapshots
Java HotSpot(TM) 64-Bit Server VM warning: ignoring option MaxPermSize=768m; support was removed
in 8.0
Running org.apache.hadoop.hdfs.server.namenode.snapshot.TestSetQuotaWithSnapshot
Tests run: 2, Failures: 0, Errors: 0, Skipped: 0, Time elapsed: 8.543 sec - in org.apache.hadoop.hdfs.server.namenode.snapshot.TestSetQuotaWithSnapshot
Java HotSpot(TM) 64-Bit Server VM warning: ignoring option MaxPermSize=768m; support was removed
in 8.0
Running org.apache.hadoop.hdfs.server.namenode.snapshot.TestSnapshotRename
Tests run: 6, Failures: 0, Errors: 0, Skipped: 0, Time elapsed: 17.337 sec - in org.apache.hadoop.hdfs.server.namenode.snapshot.TestSnapshotRename
Java HotSpot(TM) 64-Bit Server VM warning: ignoring option MaxPermSize=768m; support was removed
in 8.0
Running org.apache.hadoop.hdfs.server.namenode.snapshot.TestSnapshotDiffReport
Tests run: 8, Failures: 0, Errors: 0, Skipped: 0, Time elapsed: 22.143 sec - in org.apache.hadoop.hdfs.server.namenode.snapshot.TestSnapshotDiffReport
Java HotSpot(TM) 64-Bit Server VM warning: ignoring option MaxPermSize=768m; support was removed
in 8.0
Running org.apache.hadoop.hdfs.server.namenode.snapshot.TestXAttrWithSnapshot
Tests run: 8, Failures: 0, Errors: 0, Skipped: 0, Time elapsed: 9.792 sec - in org.apache.hadoop.hdfs.server.namenode.snapshot.TestXAttrWithSnapshot
Java HotSpot(TM) 64-Bit Server VM warning: ignoring option MaxPermSize=768m; support was removed
in 8.0
Running org.apache.hadoop.hdfs.server.namenode.snapshot.TestSnapshotStatsMXBean
Tests run: 1, Failures: 0, Errors: 0, Skipped: 0, Time elapsed: 4.838 sec - in org.apache.hadoop.hdfs.server.namenode.snapshot.TestSnapshotStatsMXBean
Java HotSpot(TM) 64-Bit Server VM warning: ignoring option MaxPermSize=768m; support was removed
in 8.0
Running org.apache.hadoop.hdfs.server.namenode.snapshot.TestAclWithSnapshot
Tests run: 16, Failures: 0, Errors: 0, Skipped: 0, Time elapsed: 14.818 sec - in org.apache.hadoop.hdfs.server.namenode.snapshot.TestAclWithSnapshot
Java HotSpot(TM) 64-Bit Server VM warning: ignoring option MaxPermSize=768m; support was removed
in 8.0
Running org.apache.hadoop.hdfs.server.namenode.snapshot.TestCheckpointsWithSnapshots
Tests run: 1, Failures: 0, Errors: 0, Skipped: 0, Time elapsed: 6.015 sec - in org.apache.hadoop.hdfs.server.namenode.snapshot.TestCheckpointsWithSnapshots
Java HotSpot(TM) 64-Bit Server VM warning: ignoring option MaxPermSize=768m; support was removed
in 8.0
Running org.apache.hadoop.hdfs.server.namenode.snapshot.TestSnapshotReplication
Tests run: 3, Failures: 0, Errors: 0, Skipped: 0, Time elapsed: 13.14 sec - in org.apache.hadoop.hdfs.server.namenode.snapshot.TestSnapshotReplication
Java HotSpot(TM) 64-Bit Server VM warning: ignoring option MaxPermSize=768m; support was removed
in 8.0
Running org.apache.hadoop.hdfs.server.namenode.snapshot.TestSnapshot
Tests run: 6, Failures: 0, Errors: 0, Skipped: 0, Time elapsed: 92.022 sec - in org.apache.hadoop.hdfs.server.namenode.snapshot.TestSnapshot
Java HotSpot(TM) 64-Bit Server VM warning: ignoring option MaxPermSize=768m; support was removed
in 8.0
Running org.apache.hadoop.hdfs.server.namenode.snapshot.TestSnapshotDeletion
Tests run: 17, Failures: 0, Errors: 0, Skipped: 0, Time elapsed: 75.798 sec - in org.apache.hadoop.hdfs.server.namenode.snapshot.TestSnapshotDeletion
Java HotSpot(TM) 64-Bit Server VM warning: ignoring option MaxPermSize=768m; support was removed
in 8.0
Running org.apache.hadoop.hdfs.server.namenode.snapshot.TestSnapshotFileLength
Tests run: 2, Failures: 0, Errors: 0, Skipped: 0, Time elapsed: 7.175 sec - in org.apache.hadoop.hdfs.server.namenode.snapshot.TestSnapshotFileLength
Java HotSpot(TM) 64-Bit Server VM warning: ignoring option MaxPermSize=768m; support was removed
in 8.0
Running org.apache.hadoop.hdfs.server.namenode.snapshot.TestSnapshotNameWithInvalidCharacters
Tests run: 2, Failures: 0, Errors: 0, Skipped: 0, Time elapsed: 6.862 sec - in org.apache.hadoop.hdfs.server.namenode.snapshot.TestSnapshotNameWithInvalidCharacters
Java HotSpot(TM) 64-Bit Server VM warning: ignoring option MaxPermSize=768m; support was removed
in 8.0
Running org.apache.hadoop.hdfs.server.namenode.snapshot.TestSnapshotManager
Tests run: 1, Failures: 0, Errors: 0, Skipped: 0, Time elapsed: 0.495 sec - in org.apache.hadoop.hdfs.server.namenode.snapshot.TestSnapshotManager
Java HotSpot(TM) 64-Bit Server VM warning: ignoring option MaxPermSize=768m; support was removed
in 8.0
Running org.apache.hadoop.hdfs.server.namenode.snapshot.TestSnapshotBlocksMap
Tests run: 7, Failures: 0, Errors: 0, Skipped: 0, Time elapsed: 30.582 sec - in org.apache.hadoop.hdfs.server.namenode.snapshot.TestSnapshotBlocksMap
Java HotSpot(TM) 64-Bit Server VM warning: ignoring option MaxPermSize=768m; support was removed
in 8.0
Running org.apache.hadoop.hdfs.server.namenode.snapshot.TestGetContentSummaryWithSnapshot
Tests run: 1, Failures: 0, Errors: 0, Skipped: 0, Time elapsed: 6.014 sec - in org.apache.hadoop.hdfs.server.namenode.snapshot.TestGetContentSummaryWithSnapshot
Java HotSpot(TM) 64-Bit Server VM warning: ignoring option MaxPermSize=768m; support was removed
in 8.0
Running org.apache.hadoop.hdfs.server.namenode.snapshot.TestINodeFileUnderConstructionWithSnapshot
Tests run: 4, Failures: 0, Errors: 0, Skipped: 0, Time elapsed: 14.48 sec - in org.apache.hadoop.hdfs.server.namenode.snapshot.TestINodeFileUnderConstructionWithSnapshot
Java HotSpot(TM) 64-Bit Server VM warning: ignoring option MaxPermSize=768m; support was removed
in 8.0
Running org.apache.hadoop.hdfs.server.namenode.snapshot.TestRenameWithSnapshots
Tests run: 36, Failures: 0, Errors: 0, Skipped: 0, Time elapsed: 177.956 sec - in org.apache.hadoop.hdfs.server.namenode.snapshot.TestRenameWithSnapshots
Java HotSpot(TM) 64-Bit Server VM warning: ignoring option MaxPermSize=768m; support was removed
in 8.0
Running org.apache.hadoop.hdfs.server.namenode.snapshot.TestSnapshotListing
Tests run: 1, Failures: 0, Errors: 0, Skipped: 0, Time elapsed: 5.486 sec - in org.apache.hadoop.hdfs.server.namenode.snapshot.TestSnapshotListing
Java HotSpot(TM) 64-Bit Server VM warning: ignoring option MaxPermSize=768m; support was removed
in 8.0
Running org.apache.hadoop.hdfs.server.namenode.snapshot.TestDisallowModifyROSnapshot
Tests run: 11, Failures: 0, Errors: 0, Skipped: 0, Time elapsed: 4.94 sec - in org.apache.hadoop.hdfs.server.namenode.snapshot.TestDisallowModifyROSnapshot
Java HotSpot(TM) 64-Bit Server VM warning: ignoring option MaxPermSize=768m; support was removed
in 8.0
Running org.apache.hadoop.hdfs.server.namenode.snapshot.TestNestedSnapshots
Tests run: 5, Failures: 0, Errors: 0, Skipped: 0, Time elapsed: 59.486 sec - in org.apache.hadoop.hdfs.server.namenode.snapshot.TestNestedSnapshots
Java HotSpot(TM) 64-Bit Server VM warning: ignoring option MaxPermSize=768m; support was removed
in 8.0
Running org.apache.hadoop.hdfs.server.namenode.snapshot.TestFileContextSnapshot
Tests run: 2, Failures: 0, Errors: 0, Skipped: 0, Time elapsed: 8.078 sec - in org.apache.hadoop.hdfs.server.namenode.snapshot.TestFileContextSnapshot
Java HotSpot(TM) 64-Bit Server VM warning: ignoring option MaxPermSize=768m; support was removed
in 8.0
Running org.apache.hadoop.hdfs.server.namenode.snapshot.TestSnapshottableDirListing
Tests run: 2, Failures: 0, Errors: 0, Skipped: 0, Time elapsed: 8.427 sec - in org.apache.hadoop.hdfs.server.namenode.snapshot.TestSnapshottableDirListing
Java HotSpot(TM) 64-Bit Server VM warning: ignoring option MaxPermSize=768m; support was removed
in 8.0
Running org.apache.hadoop.hdfs.server.namenode.TestCacheDirectives
Tests run: 13, Failures: 0, Errors: 0, Skipped: 0, Time elapsed: 110.197 sec - in org.apache.hadoop.hdfs.server.namenode.TestCacheDirectives
Java HotSpot(TM) 64-Bit Server VM warning: ignoring option MaxPermSize=768m; support was removed
in 8.0
Running org.apache.hadoop.hdfs.server.namenode.TestLeaseManager
Tests run: 3, Failures: 0, Errors: 0, Skipped: 0, Time elapsed: 0.638 sec - in org.apache.hadoop.hdfs.server.namenode.TestLeaseManager
Java HotSpot(TM) 64-Bit Server VM warning: ignoring option MaxPermSize=768m; support was removed
in 8.0
Running org.apache.hadoop.hdfs.server.namenode.TestNameNodeMetadataConsistency
Tests run: 2, Failures: 0, Errors: 0, Skipped: 0, Time elapsed: 33.095 sec - in org.apache.hadoop.hdfs.server.namenode.TestNameNodeMetadataConsistency
Java HotSpot(TM) 64-Bit Server VM warning: ignoring option MaxPermSize=768m; support was removed
in 8.0
Running org.apache.hadoop.hdfs.server.namenode.TestINodeAttributeProvider
Tests run: 2, Failures: 0, Errors: 0, Skipped: 0, Time elapsed: 6.048 sec - in org.apache.hadoop.hdfs.server.namenode.TestINodeAttributeProvider
Java HotSpot(TM) 64-Bit Server VM warning: ignoring option MaxPermSize=768m; support was removed
in 8.0
Running org.apache.hadoop.hdfs.server.namenode.TestFSImage
Tests run: 13, Failures: 0, Errors: 0, Skipped: 0, Time elapsed: 69.984 sec - in org.apache.hadoop.hdfs.server.namenode.TestFSImage
Java HotSpot(TM) 64-Bit Server VM warning: ignoring option MaxPermSize=768m; support was removed
in 8.0
Running org.apache.hadoop.hdfs.server.namenode.TestNameEditsConfigs
Tests run: 4, Failures: 0, Errors: 0, Skipped: 0, Time elapsed: 26.94 sec - in org.apache.hadoop.hdfs.server.namenode.TestNameEditsConfigs
Java HotSpot(TM) 64-Bit Server VM warning: ignoring option MaxPermSize=768m; support was removed
in 8.0
Running org.apache.hadoop.hdfs.server.namenode.TestFSNamesystemMBean
Tests run: 3, Failures: 0, Errors: 0, Skipped: 0, Time elapsed: 7.522 sec - in org.apache.hadoop.hdfs.server.namenode.TestFSNamesystemMBean
Java HotSpot(TM) 64-Bit Server VM warning: ignoring option MaxPermSize=768m; support was removed
in 8.0
Running org.apache.hadoop.hdfs.server.namenode.TestProcessCorruptBlocks
Tests run: 4, Failures: 0, Errors: 0, Skipped: 0, Time elapsed: 27.446 sec - in org.apache.hadoop.hdfs.server.namenode.TestProcessCorruptBlocks
Java HotSpot(TM) 64-Bit Server VM warning: ignoring option MaxPermSize=768m; support was removed
in 8.0
Running org.apache.hadoop.hdfs.server.namenode.TestXAttrFeature
Tests run: 1, Failures: 0, Errors: 0, Skipped: 0, Time elapsed: 0.253 sec - in org.apache.hadoop.hdfs.server.namenode.TestXAttrFeature
Java HotSpot(TM) 64-Bit Server VM warning: ignoring option MaxPermSize=768m; support was removed
in 8.0
Running org.apache.hadoop.hdfs.server.namenode.TestAddStripedBlocks
Tests run: 5, Failures: 0, Errors: 0, Skipped: 0, Time elapsed: 49.461 sec - in org.apache.hadoop.hdfs.server.namenode.TestAddStripedBlocks
Java HotSpot(TM) 64-Bit Server VM warning: ignoring option MaxPermSize=768m; support was removed
in 8.0
Running org.apache.hadoop.hdfs.server.namenode.TestFSImageWithSnapshot

Results :

Tests in error: 
  TestHDFSContractDelete.createCluster:36 ยป NoClassDefFound org/apache/hadoop/ut...

Tests run: 1821, Failures: 0, Errors: 1, Skipped: 12

[INFO]                                                                         
[INFO] ------------------------------------------------------------------------
[INFO] Skipping Apache Hadoop HDFS Native Client
[INFO] This project has been banned from the build due to previous failures.
[INFO] ------------------------------------------------------------------------
[INFO]                                                                         
[INFO] ------------------------------------------------------------------------
[INFO] Skipping Apache Hadoop HttpFS
[INFO] This project has been banned from the build due to previous failures.
[INFO] ------------------------------------------------------------------------
[INFO]                                                                         
[INFO] ------------------------------------------------------------------------
[INFO] Skipping Apache Hadoop HDFS BookKeeper Journal
[INFO] This project has been banned from the build due to previous failures.
[INFO] ------------------------------------------------------------------------
[INFO]                                                                         
[INFO] ------------------------------------------------------------------------
[INFO] Skipping Apache Hadoop HDFS-NFS
[INFO] This project has been banned from the build due to previous failures.
[INFO] ------------------------------------------------------------------------
[INFO]                                                                         
[INFO] ------------------------------------------------------------------------
[INFO] Building Apache Hadoop HDFS Project 3.0.0-SNAPSHOT
[INFO] ------------------------------------------------------------------------
[INFO] 
[INFO] --- maven-clean-plugin:2.5:clean (default-clean) @ hadoop-hdfs-project ---
[INFO] Deleting <https://builds.apache.org/job/Hadoop-Hdfs-trunk-Java8/ws/hadoop-hdfs-project/target>
[INFO] 
[INFO] --- maven-antrun-plugin:1.7:run (create-testdirs) @ hadoop-hdfs-project ---
[INFO] Executing tasks

main:
    [mkdir] Created dir: <https://builds.apache.org/job/Hadoop-Hdfs-trunk-Java8/ws/hadoop-hdfs-project/target/test-dir>
[INFO] Executed tasks
[INFO] 
[INFO] --- maven-source-plugin:2.3:jar-no-fork (hadoop-java-sources) @ hadoop-hdfs-project
---
[INFO] 
[INFO] --- maven-source-plugin:2.3:test-jar-no-fork (hadoop-java-sources) @ hadoop-hdfs-project
---
[INFO] 
[INFO] --- maven-enforcer-plugin:1.3.1:enforce (dist-enforce) @ hadoop-hdfs-project ---
[INFO] 
[INFO] --- maven-site-plugin:3.4:attach-descriptor (attach-descriptor) @ hadoop-hdfs-project
---
[INFO] 
[INFO] --- maven-javadoc-plugin:2.8.1:jar (module-javadocs) @ hadoop-hdfs-project ---
[INFO] Not executing Javadoc as the project is not a Java classpath-capable package
[INFO] 
[INFO] --- maven-enforcer-plugin:1.3.1:enforce (depcheck) @ hadoop-hdfs-project ---
[INFO] 
[INFO] --- maven-checkstyle-plugin:2.15:checkstyle (default-cli) @ hadoop-hdfs-project ---
[INFO] 
[INFO] --- findbugs-maven-plugin:3.0.0:findbugs (default-cli) @ hadoop-hdfs-project ---
[INFO] ------------------------------------------------------------------------
[INFO] Reactor Summary:
[INFO] 
[INFO] Apache Hadoop HDFS Client ......................... SUCCESS [04:12 min]
[INFO] Apache Hadoop HDFS ................................ FAILURE [  01:04 h]
[INFO] Apache Hadoop HDFS Native Client .................. SKIPPED
[INFO] Apache Hadoop HttpFS .............................. SKIPPED
[INFO] Apache Hadoop HDFS BookKeeper Journal ............. SKIPPED
[INFO] Apache Hadoop HDFS-NFS ............................ SKIPPED
[INFO] Apache Hadoop HDFS Project ........................ SUCCESS [  0.093 s]
[INFO] ------------------------------------------------------------------------
[INFO] BUILD FAILURE
[INFO] ------------------------------------------------------------------------
[INFO] Total time: 01:08 h
[INFO] Finished at: 2015-12-03T15:58:55+00:00
[INFO] Final Memory: 76M/1167M
[INFO] ------------------------------------------------------------------------
[ERROR] Failed to execute goal org.apache.maven.plugins:maven-surefire-plugin:2.17:test (default-test)
on project hadoop-hdfs: ExecutionException: java.lang.RuntimeException: The forked VM terminated
without properly saying goodbye. VM crash or System.exit called?
[ERROR] Command was /bin/sh -c cd <https://builds.apache.org/job/Hadoop-Hdfs-trunk-Java8/ws/hadoop-hdfs-project/hadoop-hdfs>
&& /home/jenkins/tools/java/jdk1.8.0/jre/bin/java -Xmx2048m -XX:MaxPermSize=768m -XX:+HeapDumpOnOutOfMemoryError
-jar <https://builds.apache.org/job/Hadoop-Hdfs-trunk-Java8/ws/hadoop-hdfs-project/hadoop-hdfs/target/surefire/surefirebooter7843144152030001570.jar>
<https://builds.apache.org/job/Hadoop-Hdfs-trunk-Java8/ws/hadoop-hdfs-project/hadoop-hdfs/target/surefire/surefire7812922278968461158tmp>
<https://builds.apache.org/job/Hadoop-Hdfs-trunk-Java8/ws/hadoop-hdfs-project/hadoop-hdfs/target/surefire/surefire_461696809135227813248tmp>
[ERROR] -> [Help 1]
[ERROR] 
[ERROR] To see the full stack trace of the errors, re-run Maven with the -e switch.
[ERROR] Re-run Maven using the -X switch to enable full debug logging.
[ERROR] 
[ERROR] For more information about the errors and possible solutions, please read the following
articles:
[ERROR] [Help 1] http://cwiki.apache.org/confluence/display/MAVEN/MojoFailureException
[ERROR] 
[ERROR] After correcting the problems, you can resume the build with the command
[ERROR]   mvn <goals> -rf :hadoop-hdfs
Build step 'Execute shell' marked build as failure
Archiving artifacts
Recording test results
Updating YARN-4408

Mime
View raw message