hadoop-hdfs-dev mailing list archives

Site index · List index
Message view « Date » · « Thread »
Top « Date » · « Thread »
From Apache Jenkins Server <jenk...@builds.apache.org>
Subject Build failed in Jenkins: Hadoop-Hdfs-trunk-Java8 #679
Date Wed, 09 Dec 2015 13:00:26 GMT
See <https://builds.apache.org/job/Hadoop-Hdfs-trunk-Java8/679/changes>

Changes:

[rohithsharmaks] YARN-4421. Remove dead code in RmAppImpl.RMAppRecoveredTransition.

[umamahesh] HADOOP-12618. Fix NPE in TestSequenceFile. (Brahma Reddy Battula via

[aajisaka] YARN-4434. NodeManager Disk Checker parameter documentation is not

------------------------------------------
[...truncated 6804 lines...]
Tests run: 14, Failures: 0, Errors: 0, Skipped: 0, Time elapsed: 31.152 sec - in org.apache.hadoop.hdfs.TestHFlush
Java HotSpot(TM) 64-Bit Server VM warning: ignoring option MaxPermSize=768m; support was removed
in 8.0
Running org.apache.hadoop.hdfs.TestDisableConnCache
Tests run: 1, Failures: 0, Errors: 0, Skipped: 0, Time elapsed: 4.558 sec - in org.apache.hadoop.hdfs.TestDisableConnCache
Java HotSpot(TM) 64-Bit Server VM warning: ignoring option MaxPermSize=768m; support was removed
in 8.0
Running org.apache.hadoop.hdfs.TestParallelUnixDomainRead
Tests run: 4, Failures: 0, Errors: 0, Skipped: 0, Time elapsed: 37.171 sec - in org.apache.hadoop.hdfs.TestParallelUnixDomainRead
Java HotSpot(TM) 64-Bit Server VM warning: ignoring option MaxPermSize=768m; support was removed
in 8.0
Running org.apache.hadoop.hdfs.TestClientProtocolForPipelineRecovery
Tests run: 5, Failures: 0, Errors: 0, Skipped: 0, Time elapsed: 39.129 sec - in org.apache.hadoop.hdfs.TestClientProtocolForPipelineRecovery
Java HotSpot(TM) 64-Bit Server VM warning: ignoring option MaxPermSize=768m; support was removed
in 8.0
Running org.apache.hadoop.hdfs.TestWriteReadStripedFile
Tests run: 17, Failures: 0, Errors: 0, Skipped: 0, Time elapsed: 131.24 sec - in org.apache.hadoop.hdfs.TestWriteReadStripedFile
Java HotSpot(TM) 64-Bit Server VM warning: ignoring option MaxPermSize=768m; support was removed
in 8.0
Running org.apache.hadoop.hdfs.TestDFSClientExcludedNodes
Tests run: 2, Failures: 0, Errors: 0, Skipped: 0, Time elapsed: 12.347 sec - in org.apache.hadoop.hdfs.TestDFSClientExcludedNodes
Java HotSpot(TM) 64-Bit Server VM warning: ignoring option MaxPermSize=768m; support was removed
in 8.0
Running org.apache.hadoop.hdfs.TestDatanodeReport
Tests run: 1, Failures: 0, Errors: 0, Skipped: 0, Time elapsed: 20.676 sec - in org.apache.hadoop.hdfs.TestDatanodeReport
Java HotSpot(TM) 64-Bit Server VM warning: ignoring option MaxPermSize=768m; support was removed
in 8.0
Running org.apache.hadoop.hdfs.TestBlockReaderFactory
Tests run: 7, Failures: 0, Errors: 0, Skipped: 0, Time elapsed: 12.281 sec - in org.apache.hadoop.hdfs.TestBlockReaderFactory
Java HotSpot(TM) 64-Bit Server VM warning: ignoring option MaxPermSize=768m; support was removed
in 8.0
Running org.apache.hadoop.hdfs.TestMiniDFSCluster
Tests run: 7, Failures: 0, Errors: 0, Skipped: 0, Time elapsed: 12.14 sec - in org.apache.hadoop.hdfs.TestMiniDFSCluster
Java HotSpot(TM) 64-Bit Server VM warning: ignoring option MaxPermSize=768m; support was removed
in 8.0
Running org.apache.hadoop.hdfs.TestBlocksScheduledCounter
Tests run: 1, Failures: 0, Errors: 0, Skipped: 0, Time elapsed: 4.558 sec - in org.apache.hadoop.hdfs.TestBlocksScheduledCounter
Java HotSpot(TM) 64-Bit Server VM warning: ignoring option MaxPermSize=768m; support was removed
in 8.0
Running org.apache.hadoop.hdfs.TestDFSClientSocketSize
Tests run: 3, Failures: 0, Errors: 0, Skipped: 0, Time elapsed: 5.728 sec - in org.apache.hadoop.hdfs.TestDFSClientSocketSize
Java HotSpot(TM) 64-Bit Server VM warning: ignoring option MaxPermSize=768m; support was removed
in 8.0
Running org.apache.hadoop.hdfs.TestDFSStorageStateRecovery
Tests run: 3, Failures: 0, Errors: 0, Skipped: 0, Time elapsed: 64.655 sec - in org.apache.hadoop.hdfs.TestDFSStorageStateRecovery
Java HotSpot(TM) 64-Bit Server VM warning: ignoring option MaxPermSize=768m; support was removed
in 8.0
Running org.apache.hadoop.hdfs.TestSnapshotCommands
Tests run: 6, Failures: 0, Errors: 0, Skipped: 0, Time elapsed: 4.448 sec - in org.apache.hadoop.hdfs.TestSnapshotCommands
Java HotSpot(TM) 64-Bit Server VM warning: ignoring option MaxPermSize=768m; support was removed
in 8.0
Running org.apache.hadoop.hdfs.TestParallelShortCircuitRead
Tests run: 4, Failures: 0, Errors: 0, Skipped: 0, Time elapsed: 11.952 sec - in org.apache.hadoop.hdfs.TestParallelShortCircuitRead
Java HotSpot(TM) 64-Bit Server VM warning: ignoring option MaxPermSize=768m; support was removed
in 8.0
Running org.apache.hadoop.hdfs.TestDFSPermission
Tests run: 8, Failures: 0, Errors: 0, Skipped: 0, Time elapsed: 20.56 sec - in org.apache.hadoop.hdfs.TestDFSPermission
Java HotSpot(TM) 64-Bit Server VM warning: ignoring option MaxPermSize=768m; support was removed
in 8.0
Running org.apache.hadoop.hdfs.TestDFSStripedOutputStreamWithFailure170
Tests run: 10, Failures: 0, Errors: 0, Skipped: 0, Time elapsed: 84.346 sec - in org.apache.hadoop.hdfs.TestDFSStripedOutputStreamWithFailure170
Java HotSpot(TM) 64-Bit Server VM warning: ignoring option MaxPermSize=768m; support was removed
in 8.0
Running org.apache.hadoop.hdfs.TestParallelRead
Tests run: 4, Failures: 0, Errors: 0, Skipped: 0, Time elapsed: 35.969 sec - in org.apache.hadoop.hdfs.TestParallelRead
Java HotSpot(TM) 64-Bit Server VM warning: ignoring option MaxPermSize=768m; support was removed
in 8.0
Running org.apache.hadoop.hdfs.TestDFSStripedOutputStream
Tests run: 14, Failures: 0, Errors: 0, Skipped: 0, Time elapsed: 50.941 sec - in org.apache.hadoop.hdfs.TestDFSStripedOutputStream
Java HotSpot(TM) 64-Bit Server VM warning: ignoring option MaxPermSize=768m; support was removed
in 8.0
Running org.apache.hadoop.hdfs.TestAclsEndToEnd
Tests run: 9, Failures: 0, Errors: 0, Skipped: 0, Time elapsed: 60.643 sec - in org.apache.hadoop.hdfs.TestAclsEndToEnd
Java HotSpot(TM) 64-Bit Server VM warning: ignoring option MaxPermSize=768m; support was removed
in 8.0
Running org.apache.hadoop.hdfs.TestRollingUpgradeRollback
Tests run: 3, Failures: 0, Errors: 0, Skipped: 0, Time elapsed: 11.201 sec - in org.apache.hadoop.hdfs.TestRollingUpgradeRollback
Java HotSpot(TM) 64-Bit Server VM warning: ignoring option MaxPermSize=768m; support was removed
in 8.0
Running org.apache.hadoop.hdfs.TestDFSConfigKeys
Tests run: 1, Failures: 0, Errors: 0, Skipped: 0, Time elapsed: 0.198 sec - in org.apache.hadoop.hdfs.TestDFSConfigKeys
Java HotSpot(TM) 64-Bit Server VM warning: ignoring option MaxPermSize=768m; support was removed
in 8.0
Running org.apache.hadoop.hdfs.TestRollingUpgradeDowngrade
Tests run: 2, Failures: 0, Errors: 0, Skipped: 0, Time elapsed: 8.636 sec - in org.apache.hadoop.hdfs.TestRollingUpgradeDowngrade
Java HotSpot(TM) 64-Bit Server VM warning: ignoring option MaxPermSize=768m; support was removed
in 8.0
Running org.apache.hadoop.hdfs.TestDFSUtil
Tests run: 31, Failures: 0, Errors: 0, Skipped: 0, Time elapsed: 2.066 sec - in org.apache.hadoop.hdfs.TestDFSUtil
Java HotSpot(TM) 64-Bit Server VM warning: ignoring option MaxPermSize=768m; support was removed
in 8.0
Running org.apache.hadoop.hdfs.TestDatanodeStartupFixesLegacyStorageIDs
Tests run: 3, Failures: 0, Errors: 0, Skipped: 0, Time elapsed: 6.846 sec - in org.apache.hadoop.hdfs.TestDatanodeStartupFixesLegacyStorageIDs
Java HotSpot(TM) 64-Bit Server VM warning: ignoring option MaxPermSize=768m; support was removed
in 8.0
Running org.apache.hadoop.hdfs.TestExternalBlockReader
Tests run: 2, Failures: 0, Errors: 0, Skipped: 0, Time elapsed: 5.326 sec - in org.apache.hadoop.hdfs.TestExternalBlockReader
Java HotSpot(TM) 64-Bit Server VM warning: ignoring option MaxPermSize=768m; support was removed
in 8.0
Running org.apache.hadoop.hdfs.TestDeprecatedKeys
Tests run: 1, Failures: 0, Errors: 0, Skipped: 0, Time elapsed: 0.492 sec - in org.apache.hadoop.hdfs.TestDeprecatedKeys
Java HotSpot(TM) 64-Bit Server VM warning: ignoring option MaxPermSize=768m; support was removed
in 8.0
Running org.apache.hadoop.hdfs.TestGetBlocks
Tests run: 3, Failures: 0, Errors: 0, Skipped: 0, Time elapsed: 44.264 sec - in org.apache.hadoop.hdfs.TestGetBlocks
Java HotSpot(TM) 64-Bit Server VM warning: ignoring option MaxPermSize=768m; support was removed
in 8.0
Running org.apache.hadoop.hdfs.TestRead
Tests run: 3, Failures: 0, Errors: 0, Skipped: 0, Time elapsed: 6.492 sec - in org.apache.hadoop.hdfs.TestRead
Java HotSpot(TM) 64-Bit Server VM warning: ignoring option MaxPermSize=768m; support was removed
in 8.0
Running org.apache.hadoop.hdfs.TestParallelReadUtil
Tests run: 1, Failures: 0, Errors: 0, Skipped: 1, Time elapsed: 0.04 sec - in org.apache.hadoop.hdfs.TestParallelReadUtil
Java HotSpot(TM) 64-Bit Server VM warning: ignoring option MaxPermSize=768m; support was removed
in 8.0
Running org.apache.hadoop.hdfs.shortcircuit.TestShortCircuitCache
Tests run: 11, Failures: 0, Errors: 0, Skipped: 0, Time elapsed: 12.258 sec - in org.apache.hadoop.hdfs.shortcircuit.TestShortCircuitCache
Java HotSpot(TM) 64-Bit Server VM warning: ignoring option MaxPermSize=768m; support was removed
in 8.0
Running org.apache.hadoop.hdfs.shortcircuit.TestShortCircuitLocalRead
Tests run: 11, Failures: 0, Errors: 0, Skipped: 0, Time elapsed: 18.735 sec - in org.apache.hadoop.hdfs.shortcircuit.TestShortCircuitLocalRead
Java HotSpot(TM) 64-Bit Server VM warning: ignoring option MaxPermSize=768m; support was removed
in 8.0
Running org.apache.hadoop.hdfs.TestMultiThreadedHflush
Tests run: 3, Failures: 0, Errors: 0, Skipped: 0, Time elapsed: 9.358 sec - in org.apache.hadoop.hdfs.TestMultiThreadedHflush
Java HotSpot(TM) 64-Bit Server VM warning: ignoring option MaxPermSize=768m; support was removed
in 8.0
Running org.apache.hadoop.hdfs.TestSafeModeWithStripedFile
Tests run: 2, Failures: 0, Errors: 0, Skipped: 0, Time elapsed: 28.938 sec - in org.apache.hadoop.hdfs.TestSafeModeWithStripedFile
Java HotSpot(TM) 64-Bit Server VM warning: ignoring option MaxPermSize=768m; support was removed
in 8.0
Running org.apache.hadoop.hdfs.TestEncryptionZonesWithKMS
Tests run: 23, Failures: 0, Errors: 0, Skipped: 0, Time elapsed: 63.514 sec - in org.apache.hadoop.hdfs.TestEncryptionZonesWithKMS
Java HotSpot(TM) 64-Bit Server VM warning: ignoring option MaxPermSize=768m; support was removed
in 8.0
Running org.apache.hadoop.hdfs.TestFileLengthOnClusterRestart
Tests run: 1, Failures: 0, Errors: 0, Skipped: 0, Time elapsed: 11.23 sec - in org.apache.hadoop.hdfs.TestFileLengthOnClusterRestart
Java HotSpot(TM) 64-Bit Server VM warning: ignoring option MaxPermSize=768m; support was removed
in 8.0
Running org.apache.hadoop.hdfs.TestRemoteBlockReader2
Tests run: 1, Failures: 0, Errors: 0, Skipped: 0, Time elapsed: 4.677 sec - in org.apache.hadoop.hdfs.TestRemoteBlockReader2
Java HotSpot(TM) 64-Bit Server VM warning: ignoring option MaxPermSize=768m; support was removed
in 8.0
Running org.apache.hadoop.hdfs.TestBlockMissingException
Tests run: 1, Failures: 0, Errors: 0, Skipped: 0, Time elapsed: 5.286 sec - in org.apache.hadoop.hdfs.TestBlockMissingException
Java HotSpot(TM) 64-Bit Server VM warning: ignoring option MaxPermSize=768m; support was removed
in 8.0
Running org.apache.hadoop.hdfs.TestReplication
Tests run: 9, Failures: 0, Errors: 0, Skipped: 0, Time elapsed: 51.207 sec - in org.apache.hadoop.hdfs.TestReplication
Java HotSpot(TM) 64-Bit Server VM warning: ignoring option MaxPermSize=768m; support was removed
in 8.0
Running org.apache.hadoop.hdfs.TestDFSStripedOutputStreamWithFailure090
Tests run: 10, Failures: 0, Errors: 0, Skipped: 0, Time elapsed: 41.154 sec - in org.apache.hadoop.hdfs.TestDFSStripedOutputStreamWithFailure090
Java HotSpot(TM) 64-Bit Server VM warning: ignoring option MaxPermSize=768m; support was removed
in 8.0
Running org.apache.hadoop.hdfs.TestFileAppend
Tests run: 10, Failures: 0, Errors: 0, Skipped: 0, Time elapsed: 23.51 sec - in org.apache.hadoop.hdfs.TestFileAppend
Java HotSpot(TM) 64-Bit Server VM warning: ignoring option MaxPermSize=768m; support was removed
in 8.0
Running org.apache.hadoop.hdfs.TestDistributedFileSystem
Tests run: 18, Failures: 0, Errors: 0, Skipped: 0, Time elapsed: 45.084 sec - in org.apache.hadoop.hdfs.TestDistributedFileSystem
Java HotSpot(TM) 64-Bit Server VM warning: ignoring option MaxPermSize=768m; support was removed
in 8.0
Running org.apache.hadoop.hdfs.TestClientBlockVerification
Tests run: 4, Failures: 0, Errors: 0, Skipped: 0, Time elapsed: 5.414 sec - in org.apache.hadoop.hdfs.TestClientBlockVerification
Java HotSpot(TM) 64-Bit Server VM warning: ignoring option MaxPermSize=768m; support was removed
in 8.0
Running org.apache.hadoop.hdfs.TestDFSStripedOutputStreamWithFailure160
Tests run: 10, Failures: 0, Errors: 0, Skipped: 0, Time elapsed: 0.334 sec - in org.apache.hadoop.hdfs.TestDFSStripedOutputStreamWithFailure160
Java HotSpot(TM) 64-Bit Server VM warning: ignoring option MaxPermSize=768m; support was removed
in 8.0
Running org.apache.hadoop.hdfs.TestReservedRawPaths
Tests run: 8, Failures: 0, Errors: 0, Skipped: 0, Time elapsed: 11.281 sec - in org.apache.hadoop.hdfs.TestReservedRawPaths
Java HotSpot(TM) 64-Bit Server VM warning: ignoring option MaxPermSize=768m; support was removed
in 8.0
Running org.apache.hadoop.hdfs.TestMissingBlocksAlert
Tests run: 1, Failures: 0, Errors: 0, Skipped: 0, Time elapsed: 5.742 sec - in org.apache.hadoop.hdfs.TestMissingBlocksAlert
Java HotSpot(TM) 64-Bit Server VM warning: ignoring option MaxPermSize=768m; support was removed
in 8.0
Running org.apache.hadoop.hdfs.TestClose
Tests run: 1, Failures: 0, Errors: 0, Skipped: 0, Time elapsed: 5.035 sec - in org.apache.hadoop.hdfs.TestClose
Java HotSpot(TM) 64-Bit Server VM warning: ignoring option MaxPermSize=768m; support was removed
in 8.0
Running org.apache.hadoop.hdfs.TestDFSStripedOutputStreamWithFailure120
Tests run: 10, Failures: 0, Errors: 0, Skipped: 0, Time elapsed: 76.836 sec - in org.apache.hadoop.hdfs.TestDFSStripedOutputStreamWithFailure120
Java HotSpot(TM) 64-Bit Server VM warning: ignoring option MaxPermSize=768m; support was removed
in 8.0
Running org.apache.hadoop.hdfs.TestFileConcurrentReader
Tests run: 7, Failures: 0, Errors: 0, Skipped: 0, Time elapsed: 21.227 sec - in org.apache.hadoop.hdfs.TestFileConcurrentReader
Java HotSpot(TM) 64-Bit Server VM warning: ignoring option MaxPermSize=768m; support was removed
in 8.0
Running org.apache.hadoop.hdfs.TestHDFSServerPorts
Tests run: 4, Failures: 0, Errors: 0, Skipped: 0, Time elapsed: 6.912 sec - in org.apache.hadoop.hdfs.TestHDFSServerPorts
Java HotSpot(TM) 64-Bit Server VM warning: ignoring option MaxPermSize=768m; support was removed
in 8.0
Running org.apache.hadoop.tracing.TestTracing
Tests run: 1, Failures: 0, Errors: 0, Skipped: 0, Time elapsed: 5.557 sec - in org.apache.hadoop.tracing.TestTracing
Java HotSpot(TM) 64-Bit Server VM warning: ignoring option MaxPermSize=768m; support was removed
in 8.0
Running org.apache.hadoop.tracing.TestTraceAdmin
Tests run: 1, Failures: 0, Errors: 0, Skipped: 0, Time elapsed: 4.403 sec - in org.apache.hadoop.tracing.TestTraceAdmin
Java HotSpot(TM) 64-Bit Server VM warning: ignoring option MaxPermSize=768m; support was removed
in 8.0
Running org.apache.hadoop.tracing.TestTracingShortCircuitLocalRead
Tests run: 1, Failures: 0, Errors: 0, Skipped: 0, Time elapsed: 4.934 sec - in org.apache.hadoop.tracing.TestTracingShortCircuitLocalRead

Results :

Tests in error: 
  TestBalancerWithMultipleNameNodes.testBalancer ยป Remote File /tmp.txt could on...

Tests run: 4118, Failures: 0, Errors: 1, Skipped: 17

[INFO]                                                                         
[INFO] ------------------------------------------------------------------------
[INFO] Skipping Apache Hadoop HDFS Native Client
[INFO] This project has been banned from the build due to previous failures.
[INFO] ------------------------------------------------------------------------
[INFO]                                                                         
[INFO] ------------------------------------------------------------------------
[INFO] Skipping Apache Hadoop HttpFS
[INFO] This project has been banned from the build due to previous failures.
[INFO] ------------------------------------------------------------------------
[INFO]                                                                         
[INFO] ------------------------------------------------------------------------
[INFO] Skipping Apache Hadoop HDFS BookKeeper Journal
[INFO] This project has been banned from the build due to previous failures.
[INFO] ------------------------------------------------------------------------
[INFO]                                                                         
[INFO] ------------------------------------------------------------------------
[INFO] Skipping Apache Hadoop HDFS-NFS
[INFO] This project has been banned from the build due to previous failures.
[INFO] ------------------------------------------------------------------------
[INFO]                                                                         
[INFO] ------------------------------------------------------------------------
[INFO] Building Apache Hadoop HDFS Project 3.0.0-SNAPSHOT
[INFO] ------------------------------------------------------------------------
[INFO] 
[INFO] --- maven-clean-plugin:2.5:clean (default-clean) @ hadoop-hdfs-project ---
[INFO] Deleting <https://builds.apache.org/job/Hadoop-Hdfs-trunk-Java8/ws/hadoop-hdfs-project/target>
[INFO] 
[INFO] --- maven-antrun-plugin:1.7:run (create-testdirs) @ hadoop-hdfs-project ---
[INFO] Executing tasks

main:
    [mkdir] Created dir: <https://builds.apache.org/job/Hadoop-Hdfs-trunk-Java8/ws/hadoop-hdfs-project/target/test-dir>
[INFO] Executed tasks
[INFO] 
[INFO] --- maven-source-plugin:2.3:jar-no-fork (hadoop-java-sources) @ hadoop-hdfs-project
---
[INFO] 
[INFO] --- maven-source-plugin:2.3:test-jar-no-fork (hadoop-java-sources) @ hadoop-hdfs-project
---
[INFO] 
[INFO] --- maven-enforcer-plugin:1.3.1:enforce (dist-enforce) @ hadoop-hdfs-project ---
[INFO] 
[INFO] --- maven-site-plugin:3.4:attach-descriptor (attach-descriptor) @ hadoop-hdfs-project
---
[INFO] 
[INFO] --- maven-javadoc-plugin:2.8.1:jar (module-javadocs) @ hadoop-hdfs-project ---
[INFO] Not executing Javadoc as the project is not a Java classpath-capable package
[INFO] 
[INFO] --- maven-enforcer-plugin:1.3.1:enforce (depcheck) @ hadoop-hdfs-project ---
[INFO] 
[INFO] --- maven-checkstyle-plugin:2.15:checkstyle (default-cli) @ hadoop-hdfs-project ---
[INFO] 
[INFO] --- findbugs-maven-plugin:3.0.0:findbugs (default-cli) @ hadoop-hdfs-project ---
[INFO] ------------------------------------------------------------------------
[INFO] Reactor Summary:
[INFO] 
[INFO] Apache Hadoop HDFS Client ......................... SUCCESS [03:58 min]
[INFO] Apache Hadoop HDFS ................................ FAILURE [  03:19 h]
[INFO] Apache Hadoop HDFS Native Client .................. SKIPPED
[INFO] Apache Hadoop HttpFS .............................. SKIPPED
[INFO] Apache Hadoop HDFS BookKeeper Journal ............. SKIPPED
[INFO] Apache Hadoop HDFS-NFS ............................ SKIPPED
[INFO] Apache Hadoop HDFS Project ........................ SUCCESS [  0.102 s]
[INFO] ------------------------------------------------------------------------
[INFO] BUILD FAILURE
[INFO] ------------------------------------------------------------------------
[INFO] Total time: 03:23 h
[INFO] Finished at: 2015-12-09T12:59:52+00:00
[INFO] Final Memory: 56M/538M
[INFO] ------------------------------------------------------------------------
[ERROR] Failed to execute goal org.apache.maven.plugins:maven-surefire-plugin:2.17:test (default-test)
on project hadoop-hdfs: There are test failures.
[ERROR] 
[ERROR] Please refer to <https://builds.apache.org/job/Hadoop-Hdfs-trunk-Java8/ws/hadoop-hdfs-project/hadoop-hdfs/target/surefire-reports>
for the individual test results.
[ERROR] -> [Help 1]
[ERROR] 
[ERROR] To see the full stack trace of the errors, re-run Maven with the -e switch.
[ERROR] Re-run Maven using the -X switch to enable full debug logging.
[ERROR] 
[ERROR] For more information about the errors and possible solutions, please read the following
articles:
[ERROR] [Help 1] http://cwiki.apache.org/confluence/display/MAVEN/MojoFailureException
[ERROR] 
[ERROR] After correcting the problems, you can resume the build with the command
[ERROR]   mvn <goals> -rf :hadoop-hdfs
Build step 'Execute shell' marked build as failure
Archiving artifacts
Recording test results
Updating YARN-4421
Updating HADOOP-12618
Updating YARN-4434

Mime
View raw message