hadoop-hdfs-dev mailing list archives

Site index · List index
Message view « Date » · « Thread »
Top « Date » · « Thread »
From Apache Jenkins Server <jenk...@builds.apache.org>
Subject Build failed in Jenkins: Hadoop-Hdfs-trunk #2575
Date Tue, 24 Nov 2015 21:07:02 GMT
See <https://builds.apache.org/job/Hadoop-Hdfs-trunk/2575/changes>

Changes:

[ozawa] YARN-4387. Fix typo in FairScheduler log message. Contributed by Xin

------------------------------------------
[...truncated 6235 lines...]
Tests run: 3, Failures: 0, Errors: 0, Skipped: 0, Time elapsed: 1.617 sec - in org.apache.hadoop.hdfs.web.TestAuthFilter
Running org.apache.hadoop.hdfs.web.TestWebHdfsFileSystemContract
Tests run: 52, Failures: 0, Errors: 0, Skipped: 0, Time elapsed: 59.132 sec - in org.apache.hadoop.hdfs.web.TestWebHdfsFileSystemContract
Running org.apache.hadoop.hdfs.web.TestWebHdfsTokens
Tests run: 11, Failures: 0, Errors: 0, Skipped: 0, Time elapsed: 20.534 sec - in org.apache.hadoop.hdfs.web.TestWebHdfsTokens
Running org.apache.hadoop.hdfs.web.TestJsonUtil
Tests run: 8, Failures: 0, Errors: 0, Skipped: 0, Time elapsed: 1.415 sec - in org.apache.hadoop.hdfs.web.TestJsonUtil
Running org.apache.hadoop.hdfs.web.TestFSMainOperationsWebHdfs
Tests run: 52, Failures: 0, Errors: 0, Skipped: 0, Time elapsed: 24.645 sec - in org.apache.hadoop.hdfs.web.TestFSMainOperationsWebHdfs
Running org.apache.hadoop.hdfs.web.TestWebHDFSAcl
Tests run: 64, Failures: 0, Errors: 0, Skipped: 1, Time elapsed: 49.365 sec - in org.apache.hadoop.hdfs.web.TestWebHDFSAcl
Running org.apache.hadoop.hdfs.web.TestWebHdfsUrl
Tests run: 6, Failures: 0, Errors: 0, Skipped: 0, Time elapsed: 4.735 sec - in org.apache.hadoop.hdfs.web.TestWebHdfsUrl
Running org.apache.hadoop.hdfs.web.TestWebHDFSForHA
Tests run: 6, Failures: 0, Errors: 0, Skipped: 0, Time elapsed: 28.229 sec - in org.apache.hadoop.hdfs.web.TestWebHDFSForHA
Running org.apache.hadoop.hdfs.web.TestHttpsFileSystem
Tests run: 1, Failures: 0, Errors: 0, Skipped: 0, Time elapsed: 12.936 sec - in org.apache.hadoop.hdfs.web.TestHttpsFileSystem
Running org.apache.hadoop.hdfs.web.resources.TestParam
Tests run: 29, Failures: 0, Errors: 0, Skipped: 0, Time elapsed: 1.985 sec - in org.apache.hadoop.hdfs.web.resources.TestParam
Running org.apache.hadoop.hdfs.web.TestWebHdfsWithAuthenticationFilter
Tests run: 1, Failures: 0, Errors: 0, Skipped: 0, Time elapsed: 11.726 sec - in org.apache.hadoop.hdfs.web.TestWebHdfsWithAuthenticationFilter
Running org.apache.hadoop.hdfs.web.TestWebHDFSXAttr
Tests run: 12, Failures: 0, Errors: 0, Skipped: 0, Time elapsed: 36.008 sec - in org.apache.hadoop.hdfs.web.TestWebHDFSXAttr
Running org.apache.hadoop.hdfs.web.TestWebHdfsTimeouts
Tests run: 8, Failures: 0, Errors: 0, Skipped: 0, Time elapsed: 4.496 sec - in org.apache.hadoop.hdfs.web.TestWebHdfsTimeouts
Running org.apache.hadoop.hdfs.TestClientBlockVerification
Tests run: 4, Failures: 0, Errors: 0, Skipped: 0, Time elapsed: 11.284 sec - in org.apache.hadoop.hdfs.TestClientBlockVerification
Running org.apache.hadoop.hdfs.TestDFSStripedOutputStreamWithFailure130
Tests run: 10, Failures: 0, Errors: 0, Skipped: 0, Time elapsed: 76.445 sec - in org.apache.hadoop.hdfs.TestDFSStripedOutputStreamWithFailure130
Running org.apache.hadoop.hdfs.TestHDFSTrash
Tests run: 2, Failures: 0, Errors: 0, Skipped: 0, Time elapsed: 12.447 sec - in org.apache.hadoop.hdfs.TestHDFSTrash
Running org.apache.hadoop.net.TestNetworkTopology
Tests run: 10, Failures: 0, Errors: 0, Skipped: 0, Time elapsed: 15.047 sec - in org.apache.hadoop.net.TestNetworkTopology
Running org.apache.hadoop.security.TestPermission
Tests run: 3, Failures: 1, Errors: 0, Skipped: 0, Time elapsed: 13.749 sec <<< FAILURE!
- in org.apache.hadoop.security.TestPermission
testBackwardCompatibility(org.apache.hadoop.security.TestPermission)  Time elapsed: 0.071
sec  <<< FAILURE!
java.lang.AssertionError: expected:<18> but was:<0>
	at org.junit.Assert.fail(Assert.java:88)
	at org.junit.Assert.failNotEquals(Assert.java:743)
	at org.junit.Assert.assertEquals(Assert.java:118)
	at org.junit.Assert.assertEquals(Assert.java:555)
	at org.junit.Assert.assertEquals(Assert.java:542)
	at org.apache.hadoop.security.TestPermission.testBackwardCompatibility(TestPermission.java:98)

Running org.apache.hadoop.security.TestRefreshUserMappings
Tests run: 2, Failures: 0, Errors: 0, Skipped: 0, Time elapsed: 14.459 sec - in org.apache.hadoop.security.TestRefreshUserMappings
Running org.apache.hadoop.security.TestPermissionSymlinks
Tests run: 15, Failures: 0, Errors: 0, Skipped: 0, Time elapsed: 12.966 sec - in org.apache.hadoop.security.TestPermissionSymlinks
Running org.apache.hadoop.cli.TestDeleteCLI
Tests run: 1, Failures: 0, Errors: 0, Skipped: 0, Time elapsed: 13.55 sec - in org.apache.hadoop.cli.TestDeleteCLI
Running org.apache.hadoop.cli.TestCacheAdminCLI
Tests run: 1, Failures: 0, Errors: 0, Skipped: 0, Time elapsed: 12.163 sec - in org.apache.hadoop.cli.TestCacheAdminCLI
Running org.apache.hadoop.cli.TestAclCLI
Tests run: 1, Failures: 0, Errors: 0, Skipped: 0, Time elapsed: 11.899 sec - in org.apache.hadoop.cli.TestAclCLI
Running org.apache.hadoop.cli.TestHDFSCLI
Tests run: 1, Failures: 0, Errors: 0, Skipped: 0, Time elapsed: 59.459 sec - in org.apache.hadoop.cli.TestHDFSCLI
Running org.apache.hadoop.cli.TestCryptoAdminCLI
Tests run: 1, Failures: 0, Errors: 0, Skipped: 0, Time elapsed: 12.932 sec - in org.apache.hadoop.cli.TestCryptoAdminCLI
Running org.apache.hadoop.cli.TestXAttrCLI
Tests run: 1, Failures: 0, Errors: 0, Skipped: 0, Time elapsed: 12.561 sec - in org.apache.hadoop.cli.TestXAttrCLI
Running org.apache.hadoop.cli.TestErasureCodingCLI
Tests run: 1, Failures: 0, Errors: 0, Skipped: 0, Time elapsed: 12.772 sec - in org.apache.hadoop.cli.TestErasureCodingCLI
Running org.apache.hadoop.tools.TestJMXGet
Tests run: 2, Failures: 0, Errors: 0, Skipped: 0, Time elapsed: 14.124 sec - in org.apache.hadoop.tools.TestJMXGet
Running org.apache.hadoop.tools.TestTools
Tests run: 5, Failures: 0, Errors: 0, Skipped: 0, Time elapsed: 3.614 sec - in org.apache.hadoop.tools.TestTools
Running org.apache.hadoop.tools.TestHdfsConfigFields
Tests run: 2, Failures: 0, Errors: 0, Skipped: 0, Time elapsed: 1.52 sec - in org.apache.hadoop.tools.TestHdfsConfigFields
Running org.apache.hadoop.fs.TestFcHdfsCreateMkdir
Tests run: 8, Failures: 0, Errors: 0, Skipped: 0, Time elapsed: 10.818 sec - in org.apache.hadoop.fs.TestFcHdfsCreateMkdir
Running org.apache.hadoop.fs.viewfs.TestViewFsWithXAttrs
Tests run: 1, Failures: 0, Errors: 0, Skipped: 0, Time elapsed: 10.775 sec - in org.apache.hadoop.fs.viewfs.TestViewFsWithXAttrs
Running org.apache.hadoop.fs.viewfs.TestViewFileSystemAtHdfsRoot
Tests run: 60, Failures: 0, Errors: 0, Skipped: 0, Time elapsed: 21.969 sec - in org.apache.hadoop.fs.viewfs.TestViewFileSystemAtHdfsRoot
Running org.apache.hadoop.fs.viewfs.TestViewFsAtHdfsRoot
Tests run: 58, Failures: 0, Errors: 0, Skipped: 0, Time elapsed: 19.086 sec - in org.apache.hadoop.fs.viewfs.TestViewFsAtHdfsRoot
Running org.apache.hadoop.fs.viewfs.TestViewFsHdfs
Tests run: 58, Failures: 0, Errors: 0, Skipped: 0, Time elapsed: 16.881 sec - in org.apache.hadoop.fs.viewfs.TestViewFsHdfs
Running org.apache.hadoop.fs.viewfs.TestViewFsWithAcls
Tests run: 1, Failures: 0, Errors: 0, Skipped: 0, Time elapsed: 10.374 sec - in org.apache.hadoop.fs.viewfs.TestViewFsWithAcls
Running org.apache.hadoop.fs.viewfs.TestViewFsDefaultValue
Tests run: 4, Failures: 0, Errors: 0, Skipped: 0, Time elapsed: 9.55 sec - in org.apache.hadoop.fs.viewfs.TestViewFsDefaultValue
Running org.apache.hadoop.fs.viewfs.TestViewFileSystemWithXAttrs
Tests run: 1, Failures: 0, Errors: 0, Skipped: 0, Time elapsed: 11.791 sec - in org.apache.hadoop.fs.viewfs.TestViewFileSystemWithXAttrs
Running org.apache.hadoop.fs.viewfs.TestViewFsFileStatusHdfs
Tests run: 2, Failures: 0, Errors: 0, Skipped: 0, Time elapsed: 10.179 sec - in org.apache.hadoop.fs.viewfs.TestViewFsFileStatusHdfs
Running org.apache.hadoop.fs.viewfs.TestViewFileSystemHdfs
Tests run: 60, Failures: 0, Errors: 0, Skipped: 0, Time elapsed: 28.098 sec - in org.apache.hadoop.fs.viewfs.TestViewFileSystemHdfs
Running org.apache.hadoop.fs.viewfs.TestViewFileSystemWithAcls
Tests run: 1, Failures: 0, Errors: 0, Skipped: 0, Time elapsed: 9.867 sec - in org.apache.hadoop.fs.viewfs.TestViewFileSystemWithAcls
Running org.apache.hadoop.fs.TestFcHdfsSetUMask
Tests run: 12, Failures: 0, Errors: 0, Skipped: 0, Time elapsed: 9.638 sec - in org.apache.hadoop.fs.TestFcHdfsSetUMask
Running org.apache.hadoop.fs.TestSymlinkHdfsFileSystem
Tests run: 74, Failures: 0, Errors: 0, Skipped: 2, Time elapsed: 24.012 sec - in org.apache.hadoop.fs.TestSymlinkHdfsFileSystem
Running org.apache.hadoop.fs.TestEnhancedByteBufferAccess
Tests run: 10, Failures: 0, Errors: 0, Skipped: 1, Time elapsed: 27.046 sec - in org.apache.hadoop.fs.TestEnhancedByteBufferAccess
Running org.apache.hadoop.fs.TestWebHdfsFileContextMainOperations
Tests run: 60, Failures: 0, Errors: 0, Skipped: 0, Time elapsed: 29.827 sec - in org.apache.hadoop.fs.TestWebHdfsFileContextMainOperations
Running org.apache.hadoop.fs.TestFcHdfsPermission
Tests run: 4, Failures: 0, Errors: 0, Skipped: 0, Time elapsed: 13.513 sec - in org.apache.hadoop.fs.TestFcHdfsPermission
Running org.apache.hadoop.fs.TestHDFSFileContextMainOperations
Tests run: 68, Failures: 0, Errors: 0, Skipped: 0, Time elapsed: 18.844 sec - in org.apache.hadoop.fs.TestHDFSFileContextMainOperations
Running org.apache.hadoop.fs.TestHdfsNativeCodeLoader
Tests run: 1, Failures: 0, Errors: 0, Skipped: 0, Time elapsed: 0.775 sec - in org.apache.hadoop.fs.TestHdfsNativeCodeLoader
Running org.apache.hadoop.fs.TestSWebHdfsFileContextMainOperations
Tests run: 60, Failures: 0, Errors: 0, Skipped: 0, Time elapsed: 38.528 sec - in org.apache.hadoop.fs.TestSWebHdfsFileContextMainOperations
Running org.apache.hadoop.fs.TestUrlStreamHandler
Tests run: 2, Failures: 0, Errors: 0, Skipped: 0, Time elapsed: 11.331 sec - in org.apache.hadoop.fs.TestUrlStreamHandler
Running org.apache.hadoop.fs.TestResolveHdfsSymlink
Tests run: 4, Failures: 0, Errors: 0, Skipped: 0, Time elapsed: 9.776 sec - in org.apache.hadoop.fs.TestResolveHdfsSymlink
Running org.apache.hadoop.fs.permission.TestStickyBit
Tests run: 6, Failures: 0, Errors: 0, Skipped: 0, Time elapsed: 19.455 sec - in org.apache.hadoop.fs.permission.TestStickyBit
Running org.apache.hadoop.fs.shell.TestHdfsTextCommand
Tests run: 1, Failures: 0, Errors: 0, Skipped: 0, Time elapsed: 11.158 sec - in org.apache.hadoop.fs.shell.TestHdfsTextCommand
Running org.apache.hadoop.fs.contract.hdfs.TestHDFSContractDelete
Tests run: 8, Failures: 0, Errors: 0, Skipped: 0, Time elapsed: 11.766 sec - in org.apache.hadoop.fs.contract.hdfs.TestHDFSContractDelete
Running org.apache.hadoop.fs.contract.hdfs.TestHDFSContractSetTimes
Tests run: 1, Failures: 0, Errors: 0, Skipped: 0, Time elapsed: 11.237 sec - in org.apache.hadoop.fs.contract.hdfs.TestHDFSContractSetTimes
Running org.apache.hadoop.fs.contract.hdfs.TestHDFSContractRename
Tests run: 6, Failures: 0, Errors: 0, Skipped: 0, Time elapsed: 12.494 sec - in org.apache.hadoop.fs.contract.hdfs.TestHDFSContractRename
Running org.apache.hadoop.fs.contract.hdfs.TestHDFSContractOpen
Tests run: 6, Failures: 0, Errors: 0, Skipped: 0, Time elapsed: 13.264 sec - in org.apache.hadoop.fs.contract.hdfs.TestHDFSContractOpen
Running org.apache.hadoop.fs.contract.hdfs.TestHDFSContractGetFileStatus
Tests run: 1, Failures: 0, Errors: 0, Skipped: 0, Time elapsed: 9.691 sec - in org.apache.hadoop.fs.contract.hdfs.TestHDFSContractGetFileStatus
Running org.apache.hadoop.fs.contract.hdfs.TestHDFSContractMkdir
Tests run: 5, Failures: 0, Errors: 0, Skipped: 0, Time elapsed: 12.148 sec - in org.apache.hadoop.fs.contract.hdfs.TestHDFSContractMkdir
Running org.apache.hadoop.fs.contract.hdfs.TestHDFSContractSeek
Tests run: 10, Failures: 0, Errors: 0, Skipped: 0, Time elapsed: 17.404 sec - in org.apache.hadoop.fs.contract.hdfs.TestHDFSContractSeek
Running org.apache.hadoop.fs.contract.hdfs.TestHDFSContractCreate
Tests run: 6, Failures: 0, Errors: 0, Skipped: 0, Time elapsed: 14.06 sec - in org.apache.hadoop.fs.contract.hdfs.TestHDFSContractCreate
Running org.apache.hadoop.fs.contract.hdfs.TestHDFSContractRootDirectory
Tests run: 6, Failures: 0, Errors: 0, Skipped: 0, Time elapsed: 12.412 sec - in org.apache.hadoop.fs.contract.hdfs.TestHDFSContractRootDirectory
Running org.apache.hadoop.fs.contract.hdfs.TestHDFSContractConcat
Tests run: 4, Failures: 0, Errors: 0, Skipped: 0, Time elapsed: 11.443 sec - in org.apache.hadoop.fs.contract.hdfs.TestHDFSContractConcat
Running org.apache.hadoop.fs.contract.hdfs.TestHDFSContractAppend
Tests run: 5, Failures: 0, Errors: 0, Skipped: 0, Time elapsed: 12.674 sec - in org.apache.hadoop.fs.contract.hdfs.TestHDFSContractAppend
Running org.apache.hadoop.fs.loadGenerator.TestLoadGenerator
Tests run: 2, Failures: 0, Errors: 0, Skipped: 0, Time elapsed: 21.226 sec - in org.apache.hadoop.fs.loadGenerator.TestLoadGenerator
Running org.apache.hadoop.fs.TestGlobPaths
Tests run: 36, Failures: 0, Errors: 0, Skipped: 6, Time elapsed: 12.196 sec - in org.apache.hadoop.fs.TestGlobPaths
Running org.apache.hadoop.fs.TestSymlinkHdfsDisable
Tests run: 1, Failures: 0, Errors: 0, Skipped: 0, Time elapsed: 10.814 sec - in org.apache.hadoop.fs.TestSymlinkHdfsDisable
Running org.apache.hadoop.fs.TestSymlinkHdfsFileContext
Tests run: 71, Failures: 0, Errors: 0, Skipped: 0, Time elapsed: 24.507 sec - in org.apache.hadoop.fs.TestSymlinkHdfsFileContext
Running org.apache.hadoop.fs.TestUnbuffer
Tests run: 2, Failures: 0, Errors: 0, Skipped: 0, Time elapsed: 16.655 sec - in org.apache.hadoop.fs.TestUnbuffer
Running org.apache.hadoop.TestGenericRefresh
Tests run: 9, Failures: 0, Errors: 0, Skipped: 0, Time elapsed: 10.687 sec - in org.apache.hadoop.TestGenericRefresh

Results :

Failed tests: 
  TestDataNodeMetrics.testDataNodeTimeSpend:289 null
  TestNameNodeMetadataConsistency.testGenerationStampInFuture:125 expected:<18> but
was:<0>
  TestDatanodeDeath.testSimple0:410->simpleTest:405 Test resulted in an unexpected exit
  TestDatanodeDeath.testSimple2:416->simpleTest:405 Test resulted in an unexpected exit
  TestPermission.testBackwardCompatibility:98 expected:<18> but was:<0>

Tests in error: 
  TestDatanodeDeath.testComplex:419->complexTest:333 » NoClassDefFound org/apach...
  TestDatanodeDeath.testSimple1:413->simpleTest:405 » NoClassDefFound org/apache...

Tests run: 4096, Failures: 5, Errors: 2, Skipped: 17

[INFO]                                                                         
[INFO] ------------------------------------------------------------------------
[INFO] Skipping Apache Hadoop HDFS Native Client
[INFO] This project has been banned from the build due to previous failures.
[INFO] ------------------------------------------------------------------------
[INFO]                                                                         
[INFO] ------------------------------------------------------------------------
[INFO] Skipping Apache Hadoop HttpFS
[INFO] This project has been banned from the build due to previous failures.
[INFO] ------------------------------------------------------------------------
[INFO]                                                                         
[INFO] ------------------------------------------------------------------------
[INFO] Skipping Apache Hadoop HDFS BookKeeper Journal
[INFO] This project has been banned from the build due to previous failures.
[INFO] ------------------------------------------------------------------------
[INFO]                                                                         
[INFO] ------------------------------------------------------------------------
[INFO] Skipping Apache Hadoop HDFS-NFS
[INFO] This project has been banned from the build due to previous failures.
[INFO] ------------------------------------------------------------------------
[INFO]                                                                         
[INFO] ------------------------------------------------------------------------
[INFO] Building Apache Hadoop HDFS Project 3.0.0-SNAPSHOT
[INFO] ------------------------------------------------------------------------
[INFO] 
[INFO] --- maven-clean-plugin:2.5:clean (default-clean) @ hadoop-hdfs-project ---
[INFO] Deleting <https://builds.apache.org/job/Hadoop-Hdfs-trunk/ws/hadoop-hdfs-project/target>
[INFO] 
[INFO] --- maven-antrun-plugin:1.7:run (create-testdirs) @ hadoop-hdfs-project ---
[INFO] Executing tasks

main:
    [mkdir] Created dir: <https://builds.apache.org/job/Hadoop-Hdfs-trunk/ws/hadoop-hdfs-project/target/test-dir>
[INFO] Executed tasks
[INFO] 
[INFO] --- maven-source-plugin:2.3:jar-no-fork (hadoop-java-sources) @ hadoop-hdfs-project
---
[INFO] 
[INFO] --- maven-source-plugin:2.3:test-jar-no-fork (hadoop-java-sources) @ hadoop-hdfs-project
---
[INFO] 
[INFO] --- maven-enforcer-plugin:1.3.1:enforce (dist-enforce) @ hadoop-hdfs-project ---
[INFO] 
[INFO] --- maven-site-plugin:3.4:attach-descriptor (attach-descriptor) @ hadoop-hdfs-project
---
[INFO] 
[INFO] --- maven-javadoc-plugin:2.8.1:jar (module-javadocs) @ hadoop-hdfs-project ---
[INFO] Skipping javadoc generation
[INFO] 
[INFO] --- maven-enforcer-plugin:1.3.1:enforce (depcheck) @ hadoop-hdfs-project ---
[INFO] 
[INFO] --- maven-checkstyle-plugin:2.15:checkstyle (default-cli) @ hadoop-hdfs-project ---
[INFO] 
[INFO] --- findbugs-maven-plugin:3.0.0:findbugs (default-cli) @ hadoop-hdfs-project ---
[INFO] ------------------------------------------------------------------------
[INFO] Reactor Summary:
[INFO] 
[INFO] Apache Hadoop HDFS Client ......................... SUCCESS [06:02 min]
[INFO] Apache Hadoop HDFS ................................ FAILURE [  04:28 h]
[INFO] Apache Hadoop HDFS Native Client .................. SKIPPED
[INFO] Apache Hadoop HttpFS .............................. SKIPPED
[INFO] Apache Hadoop HDFS BookKeeper Journal ............. SKIPPED
[INFO] Apache Hadoop HDFS-NFS ............................ SKIPPED
[INFO] Apache Hadoop HDFS Project ........................ SUCCESS [  0.105 s]
[INFO] ------------------------------------------------------------------------
[INFO] BUILD FAILURE
[INFO] ------------------------------------------------------------------------
[INFO] Total time: 04:34 h
[INFO] Finished at: 2015-11-24T21:06:27+00:00
[INFO] Final Memory: 57M/802M
[INFO] ------------------------------------------------------------------------
[ERROR] Failed to execute goal org.apache.maven.plugins:maven-surefire-plugin:2.17:test (default-test)
on project hadoop-hdfs: There are test failures.
[ERROR] 
[ERROR] Please refer to <https://builds.apache.org/job/Hadoop-Hdfs-trunk/ws/hadoop-hdfs-project/hadoop-hdfs/target/surefire-reports>
for the individual test results.
[ERROR] -> [Help 1]
[ERROR] 
[ERROR] To see the full stack trace of the errors, re-run Maven with the -e switch.
[ERROR] Re-run Maven using the -X switch to enable full debug logging.
[ERROR] 
[ERROR] For more information about the errors and possible solutions, please read the following
articles:
[ERROR] [Help 1] http://cwiki.apache.org/confluence/display/MAVEN/MojoFailureException
[ERROR] 
[ERROR] After correcting the problems, you can resume the build with the command
[ERROR]   mvn <goals> -rf :hadoop-hdfs
Build step 'Execute shell' marked build as failure
Archiving artifacts
Recording test results
Updating YARN-4387

Mime
View raw message