hadoop-hdfs-dev mailing list archives

Site index · List index
Message view « Date » · « Thread »
Top « Date » · « Thread »
From Apache Jenkins Server <jenk...@builds.apache.org>
Subject Build failed in Jenkins: Hadoop-Hdfs-trunk #2504
Date Tue, 03 Nov 2015 23:27:48 GMT
See <https://builds.apache.org/job/Hadoop-Hdfs-trunk/2504/changes>

Changes:

[wangda] YARN-4326. Fix TestDistributedShell timeout as AHS in MiniYarnCluster no

[cnauroth] HDFS-9354. Fix TestBalancer#testBalancerWithZeroThreadsForMove on

[cnauroth] HDFS-9362. TestAuditLogger#testAuditLoggerWithCallContext assumes Unix

------------------------------------------
[...truncated 6012 lines...]
Running org.apache.hadoop.hdfs.server.datanode.TestDataXceiverLazyPersistHint
Tests run: 3, Failures: 0, Errors: 0, Skipped: 0, Time elapsed: 1.267 sec - in org.apache.hadoop.hdfs.server.datanode.TestDataXceiverLazyPersistHint
Running org.apache.hadoop.hdfs.server.datanode.TestDatanodeStartupOptions
Tests run: 2, Failures: 0, Errors: 0, Skipped: 0, Time elapsed: 0.697 sec - in org.apache.hadoop.hdfs.server.datanode.TestDatanodeStartupOptions
Running org.apache.hadoop.hdfs.server.datanode.TestBpServiceActorScheduler
Tests run: 8, Failures: 0, Errors: 0, Skipped: 0, Time elapsed: 0.487 sec - in org.apache.hadoop.hdfs.server.datanode.TestBpServiceActorScheduler
Running org.apache.hadoop.hdfs.server.datanode.TestDataNodeRollingUpgrade
Tests run: 6, Failures: 0, Errors: 0, Skipped: 0, Time elapsed: 118.979 sec - in org.apache.hadoop.hdfs.server.datanode.TestDataNodeRollingUpgrade
Running org.apache.hadoop.hdfs.server.datanode.TestDataDirs
Tests run: 2, Failures: 0, Errors: 0, Skipped: 0, Time elapsed: 0.921 sec - in org.apache.hadoop.hdfs.server.datanode.TestDataDirs
Running org.apache.hadoop.hdfs.server.datanode.TestRefreshNamenodes
Tests run: 1, Failures: 0, Errors: 0, Skipped: 0, Time elapsed: 5.268 sec - in org.apache.hadoop.hdfs.server.datanode.TestRefreshNamenodes
Running org.apache.hadoop.hdfs.server.blockmanagement.TestBlockInfo
Tests run: 4, Failures: 0, Errors: 0, Skipped: 0, Time elapsed: 0.459 sec - in org.apache.hadoop.hdfs.server.blockmanagement.TestBlockInfo
Running org.apache.hadoop.hdfs.server.blockmanagement.TestUnderReplicatedBlockQueues
Tests run: 2, Failures: 0, Errors: 0, Skipped: 0, Time elapsed: 0.274 sec - in org.apache.hadoop.hdfs.server.blockmanagement.TestUnderReplicatedBlockQueues
Running org.apache.hadoop.hdfs.server.blockmanagement.TestCachedBlocksList
Tests run: 2, Failures: 0, Errors: 0, Skipped: 0, Time elapsed: 0.356 sec - in org.apache.hadoop.hdfs.server.blockmanagement.TestCachedBlocksList
Running org.apache.hadoop.hdfs.server.blockmanagement.TestHost2NodesMap
Tests run: 3, Failures: 0, Errors: 0, Skipped: 0, Time elapsed: 0.305 sec - in org.apache.hadoop.hdfs.server.blockmanagement.TestHost2NodesMap
Running org.apache.hadoop.hdfs.server.blockmanagement.TestHostFileManager
Tests run: 3, Failures: 0, Errors: 0, Skipped: 0, Time elapsed: 1.231 sec - in org.apache.hadoop.hdfs.server.blockmanagement.TestHostFileManager
Running org.apache.hadoop.hdfs.server.blockmanagement.TestPendingInvalidateBlock
Tests run: 2, Failures: 0, Errors: 0, Skipped: 0, Time elapsed: 31.122 sec - in org.apache.hadoop.hdfs.server.blockmanagement.TestPendingInvalidateBlock
Running org.apache.hadoop.hdfs.server.blockmanagement.TestReplicationPolicyConsiderLoad
Tests run: 2, Failures: 0, Errors: 0, Skipped: 0, Time elapsed: 3.09 sec - in org.apache.hadoop.hdfs.server.blockmanagement.TestReplicationPolicyConsiderLoad
Running org.apache.hadoop.hdfs.server.blockmanagement.TestAvailableSpaceBlockPlacementPolicy
Tests run: 2, Failures: 0, Errors: 0, Skipped: 0, Time elapsed: 3.782 sec - in org.apache.hadoop.hdfs.server.blockmanagement.TestAvailableSpaceBlockPlacementPolicy
Running org.apache.hadoop.hdfs.server.blockmanagement.TestRBWBlockInvalidation
Tests run: 2, Failures: 0, Errors: 0, Skipped: 0, Time elapsed: 14.171 sec - in org.apache.hadoop.hdfs.server.blockmanagement.TestRBWBlockInvalidation
Running org.apache.hadoop.hdfs.server.blockmanagement.TestBlocksWithNotEnoughRacks
Tests run: 9, Failures: 0, Errors: 0, Skipped: 0, Time elapsed: 45.589 sec - in org.apache.hadoop.hdfs.server.blockmanagement.TestBlocksWithNotEnoughRacks
Running org.apache.hadoop.hdfs.server.blockmanagement.TestReplicationPolicyWithUpgradeDomain
Tests run: 5, Failures: 0, Errors: 0, Skipped: 0, Time elapsed: 4.189 sec - in org.apache.hadoop.hdfs.server.blockmanagement.TestReplicationPolicyWithUpgradeDomain
Running org.apache.hadoop.hdfs.server.blockmanagement.TestComputeInvalidateWork
Tests run: 3, Failures: 0, Errors: 0, Skipped: 0, Time elapsed: 8.705 sec - in org.apache.hadoop.hdfs.server.blockmanagement.TestComputeInvalidateWork
Running org.apache.hadoop.hdfs.server.blockmanagement.TestHeartbeatHandling
Tests run: 3, Failures: 0, Errors: 0, Skipped: 0, Time elapsed: 7.467 sec - in org.apache.hadoop.hdfs.server.blockmanagement.TestHeartbeatHandling
Running org.apache.hadoop.hdfs.server.blockmanagement.TestNameNodePrunesMissingStorages
Tests run: 4, Failures: 0, Errors: 0, Skipped: 0, Time elapsed: 8.587 sec - in org.apache.hadoop.hdfs.server.blockmanagement.TestNameNodePrunesMissingStorages
Running org.apache.hadoop.hdfs.server.blockmanagement.TestUnderReplicatedBlocks
Tests run: 2, Failures: 0, Errors: 0, Skipped: 0, Time elapsed: 21.527 sec - in org.apache.hadoop.hdfs.server.blockmanagement.TestUnderReplicatedBlocks
Running org.apache.hadoop.hdfs.server.blockmanagement.TestSequentialBlockId
Tests run: 4, Failures: 0, Errors: 0, Skipped: 0, Time elapsed: 6.185 sec - in org.apache.hadoop.hdfs.server.blockmanagement.TestSequentialBlockId
Running org.apache.hadoop.hdfs.server.blockmanagement.TestPendingReplication
Tests run: 4, Failures: 0, Errors: 0, Skipped: 0, Time elapsed: 25.863 sec - in org.apache.hadoop.hdfs.server.blockmanagement.TestPendingReplication
Running org.apache.hadoop.hdfs.server.blockmanagement.TestBlockReportRateLimiting
Tests run: 2, Failures: 0, Errors: 0, Skipped: 0, Time elapsed: 8.803 sec - in org.apache.hadoop.hdfs.server.blockmanagement.TestBlockReportRateLimiting
Running org.apache.hadoop.hdfs.server.blockmanagement.TestNodeCount
Tests run: 1, Failures: 0, Errors: 0, Skipped: 0, Time elapsed: 15.354 sec - in org.apache.hadoop.hdfs.server.blockmanagement.TestNodeCount
Running org.apache.hadoop.hdfs.server.blockmanagement.TestOverReplicatedBlocks
Tests run: 3, Failures: 0, Errors: 0, Skipped: 0, Time elapsed: 27.156 sec - in org.apache.hadoop.hdfs.server.blockmanagement.TestOverReplicatedBlocks
Running org.apache.hadoop.hdfs.server.blockmanagement.TestReplicationPolicyWithNodeGroup
Tests run: 16, Failures: 0, Errors: 0, Skipped: 0, Time elapsed: 7.582 sec - in org.apache.hadoop.hdfs.server.blockmanagement.TestReplicationPolicyWithNodeGroup
Running org.apache.hadoop.hdfs.server.blockmanagement.TestBlockUnderConstructionFeature
Tests run: 1, Failures: 0, Errors: 0, Skipped: 0, Time elapsed: 0.378 sec - in org.apache.hadoop.hdfs.server.blockmanagement.TestBlockUnderConstructionFeature
Running org.apache.hadoop.hdfs.server.blockmanagement.TestReplicationPolicy
Tests run: 58, Failures: 0, Errors: 0, Skipped: 0, Time elapsed: 27.871 sec - in org.apache.hadoop.hdfs.server.blockmanagement.TestReplicationPolicy
Running org.apache.hadoop.hdfs.server.blockmanagement.TestBlockStatsMXBean
Tests run: 2, Failures: 0, Errors: 0, Skipped: 0, Time elapsed: 7.303 sec - in org.apache.hadoop.hdfs.server.blockmanagement.TestBlockStatsMXBean
Running org.apache.hadoop.hdfs.server.blockmanagement.TestPendingDataNodeMessages
Tests run: 1, Failures: 0, Errors: 0, Skipped: 0, Time elapsed: 0.328 sec - in org.apache.hadoop.hdfs.server.blockmanagement.TestPendingDataNodeMessages
Running org.apache.hadoop.hdfs.server.blockmanagement.TestBlockTokenWithDFSStriped
Tests run: 4, Failures: 0, Errors: 0, Skipped: 0, Time elapsed: 31.422 sec - in org.apache.hadoop.hdfs.server.blockmanagement.TestBlockTokenWithDFSStriped
Running org.apache.hadoop.hdfs.server.blockmanagement.TestBlockInfoStriped
Tests run: 3, Failures: 0, Errors: 0, Skipped: 0, Time elapsed: 0.344 sec - in org.apache.hadoop.hdfs.server.blockmanagement.TestBlockInfoStriped
Running org.apache.hadoop.hdfs.server.blockmanagement.TestCorruptReplicaInfo
Tests run: 1, Failures: 0, Errors: 0, Skipped: 0, Time elapsed: 0.408 sec - in org.apache.hadoop.hdfs.server.blockmanagement.TestCorruptReplicaInfo
Running org.apache.hadoop.hdfs.server.blockmanagement.TestBlockTokenWithDFS
Tests run: 4, Failures: 0, Errors: 0, Skipped: 0, Time elapsed: 21.676 sec - in org.apache.hadoop.hdfs.server.blockmanagement.TestBlockTokenWithDFS
Running org.apache.hadoop.hdfs.server.blockmanagement.TestBlockManager
Tests run: 13, Failures: 0, Errors: 0, Skipped: 0, Time elapsed: 5.742 sec - in org.apache.hadoop.hdfs.server.blockmanagement.TestBlockManager
Running org.apache.hadoop.hdfs.server.blockmanagement.TestSequentialBlockGroupId
Tests run: 3, Failures: 0, Errors: 0, Skipped: 0, Time elapsed: 13.365 sec - in org.apache.hadoop.hdfs.server.blockmanagement.TestSequentialBlockGroupId
Running org.apache.hadoop.hdfs.server.blockmanagement.TestDatanodeManager
Tests run: 6, Failures: 0, Errors: 0, Skipped: 0, Time elapsed: 66.935 sec - in org.apache.hadoop.hdfs.server.blockmanagement.TestDatanodeManager
Running org.apache.hadoop.hdfs.server.blockmanagement.TestDatanodeDescriptor
Tests run: 2, Failures: 0, Errors: 0, Skipped: 0, Time elapsed: 0.329 sec - in org.apache.hadoop.hdfs.server.blockmanagement.TestDatanodeDescriptor
Running org.apache.hadoop.hdfs.TestDFSStorageStateRecovery
Tests run: 3, Failures: 0, Errors: 0, Skipped: 0, Time elapsed: 63.777 sec - in org.apache.hadoop.hdfs.TestDFSStorageStateRecovery
Running org.apache.hadoop.hdfs.TestDFSStripedOutputStreamWithFailure160
Tests run: 10, Failures: 0, Errors: 0, Skipped: 0, Time elapsed: 0.308 sec - in org.apache.hadoop.hdfs.TestDFSStripedOutputStreamWithFailure160
Running org.apache.hadoop.hdfs.TestDFSRollback
Tests run: 1, Failures: 0, Errors: 0, Skipped: 0, Time elapsed: 14.404 sec - in org.apache.hadoop.hdfs.TestDFSRollback
Running org.apache.hadoop.hdfs.TestDFSStripedOutputStreamWithFailure190
Tests run: 10, Failures: 0, Errors: 0, Skipped: 0, Time elapsed: 44.517 sec - in org.apache.hadoop.hdfs.TestDFSStripedOutputStreamWithFailure190
Running org.apache.hadoop.hdfs.TestSafeMode
Tests run: 7, Failures: 0, Errors: 0, Skipped: 0, Time elapsed: 37.147 sec - in org.apache.hadoop.hdfs.TestSafeMode
Running org.apache.hadoop.hdfs.TestHFlush
Tests run: 14, Failures: 0, Errors: 0, Skipped: 0, Time elapsed: 30.167 sec - in org.apache.hadoop.hdfs.TestHFlush
Running org.apache.hadoop.hdfs.TestDFSClientSocketSize
Tests run: 3, Failures: 0, Errors: 0, Skipped: 0, Time elapsed: 5.633 sec - in org.apache.hadoop.hdfs.TestDFSClientSocketSize
Running org.apache.hadoop.hdfs.TestParallelUnixDomainRead
Tests run: 4, Failures: 0, Errors: 0, Skipped: 0, Time elapsed: 39.221 sec - in org.apache.hadoop.hdfs.TestParallelUnixDomainRead
Running org.apache.hadoop.hdfs.TestWriteStripedFileWithFailure
Tests run: 1, Failures: 0, Errors: 0, Skipped: 1, Time elapsed: 0.093 sec - in org.apache.hadoop.hdfs.TestWriteStripedFileWithFailure
Running org.apache.hadoop.hdfs.TestRead
Tests run: 3, Failures: 0, Errors: 0, Skipped: 0, Time elapsed: 6.496 sec - in org.apache.hadoop.hdfs.TestRead
Running org.apache.hadoop.hdfs.TestIsMethodSupported
Tests run: 10, Failures: 0, Errors: 0, Skipped: 0, Time elapsed: 4.301 sec - in org.apache.hadoop.hdfs.TestIsMethodSupported
Running org.apache.hadoop.hdfs.TestSetrepDecreasing
Tests run: 1, Failures: 0, Errors: 0, Skipped: 0, Time elapsed: 16.507 sec - in org.apache.hadoop.hdfs.TestSetrepDecreasing
Running org.apache.hadoop.hdfs.TestWriteReadStripedFile
Tests run: 17, Failures: 0, Errors: 0, Skipped: 0, Time elapsed: 131.626 sec - in org.apache.hadoop.hdfs.TestWriteReadStripedFile
Running org.apache.hadoop.hdfs.TestFSInputChecker
Tests run: 1, Failures: 0, Errors: 0, Skipped: 0, Time elapsed: 5.08 sec - in org.apache.hadoop.hdfs.TestFSInputChecker
Running org.apache.hadoop.hdfs.TestParallelShortCircuitLegacyRead
Tests run: 4, Failures: 0, Errors: 0, Skipped: 0, Time elapsed: 16.283 sec - in org.apache.hadoop.hdfs.TestParallelShortCircuitLegacyRead
Running org.apache.hadoop.hdfs.TestDatanodeRegistration
Tests run: 5, Failures: 0, Errors: 0, Skipped: 0, Time elapsed: 9.225 sec - in org.apache.hadoop.hdfs.TestDatanodeRegistration
Running org.apache.hadoop.hdfs.TestDFSUtil
Tests run: 31, Failures: 0, Errors: 0, Skipped: 0, Time elapsed: 3.118 sec - in org.apache.hadoop.hdfs.TestDFSUtil
Running org.apache.hadoop.hdfs.TestDFSPermission
Tests run: 8, Failures: 0, Errors: 0, Skipped: 0, Time elapsed: 22.571 sec - in org.apache.hadoop.hdfs.TestDFSPermission
Running org.apache.hadoop.hdfs.TestDFSRename
Tests run: 2, Failures: 0, Errors: 0, Skipped: 0, Time elapsed: 11.857 sec - in org.apache.hadoop.hdfs.TestDFSRename
Running org.apache.hadoop.hdfs.TestRollingUpgradeDowngrade
Tests run: 2, Failures: 0, Errors: 0, Skipped: 0, Time elapsed: 7.514 sec - in org.apache.hadoop.hdfs.TestRollingUpgradeDowngrade
Running org.apache.hadoop.hdfs.TestDFSStripedInputStream
Tests run: 4, Failures: 0, Errors: 0, Skipped: 0, Time elapsed: 18.955 sec - in org.apache.hadoop.hdfs.TestDFSStripedInputStream
Running org.apache.hadoop.hdfs.protocol.TestLayoutVersion
Tests run: 11, Failures: 0, Errors: 0, Skipped: 0, Time elapsed: 0.303 sec - in org.apache.hadoop.hdfs.protocol.TestLayoutVersion
Running org.apache.hadoop.hdfs.protocol.TestLocatedBlock
Tests run: 1, Failures: 0, Errors: 0, Skipped: 0, Time elapsed: 0.266 sec - in org.apache.hadoop.hdfs.protocol.TestLocatedBlock
Running org.apache.hadoop.hdfs.protocol.TestBlockListAsLongs
Tests run: 7, Failures: 0, Errors: 0, Skipped: 0, Time elapsed: 1.06 sec - in org.apache.hadoop.hdfs.protocol.TestBlockListAsLongs
Running org.apache.hadoop.hdfs.protocol.datatransfer.TestPacketReceiver
Tests run: 1, Failures: 0, Errors: 0, Skipped: 0, Time elapsed: 0.446 sec - in org.apache.hadoop.hdfs.protocol.datatransfer.TestPacketReceiver
Running org.apache.hadoop.hdfs.protocol.datatransfer.sasl.TestSaslDataTransfer
Tests run: 8, Failures: 0, Errors: 0, Skipped: 0, Time elapsed: 29.383 sec - in org.apache.hadoop.hdfs.protocol.datatransfer.sasl.TestSaslDataTransfer
Running org.apache.hadoop.hdfs.protocol.TestAnnotations
Tests run: 1, Failures: 0, Errors: 0, Skipped: 0, Time elapsed: 0.165 sec - in org.apache.hadoop.hdfs.protocol.TestAnnotations
Running org.apache.hadoop.hdfs.TestDFSStripedOutputStreamWithFailure030
Tests run: 10, Failures: 0, Errors: 0, Skipped: 0, Time elapsed: 0.31 sec - in org.apache.hadoop.hdfs.TestDFSStripedOutputStreamWithFailure030
Running org.apache.hadoop.hdfs.TestAbandonBlock
Tests run: 2, Failures: 0, Errors: 0, Skipped: 0, Time elapsed: 11.603 sec - in org.apache.hadoop.hdfs.TestAbandonBlock
Running org.apache.hadoop.hdfs.TestReplication
Tests run: 9, Failures: 0, Errors: 0, Skipped: 0, Time elapsed: 49.061 sec - in org.apache.hadoop.hdfs.TestReplication
Running org.apache.hadoop.hdfs.TestHttpPolicy
Tests run: 1, Failures: 0, Errors: 0, Skipped: 0, Time elapsed: 0.565 sec - in org.apache.hadoop.hdfs.TestHttpPolicy
Running org.apache.hadoop.hdfs.TestClientReportBadBlock
Tests run: 3, Failures: 0, Errors: 0, Skipped: 0, Time elapsed: 8.312 sec - in org.apache.hadoop.hdfs.TestClientReportBadBlock
Running org.apache.hadoop.hdfs.TestConnCache
Tests run: 1, Failures: 0, Errors: 0, Skipped: 0, Time elapsed: 4.343 sec - in org.apache.hadoop.hdfs.TestConnCache
Running org.apache.hadoop.hdfs.TestMissingBlocksAlert
Tests run: 1, Failures: 0, Errors: 0, Skipped: 0, Time elapsed: 4.659 sec - in org.apache.hadoop.hdfs.TestMissingBlocksAlert
Running org.apache.hadoop.hdfs.TestEncryptionZonesWithKMS
Tests run: 20, Failures: 0, Errors: 0, Skipped: 0, Time elapsed: 53.302 sec - in org.apache.hadoop.hdfs.TestEncryptionZonesWithKMS
Running org.apache.hadoop.hdfs.TestQuota
Tests run: 9, Failures: 0, Errors: 0, Skipped: 0, Time elapsed: 13.715 sec - in org.apache.hadoop.hdfs.TestQuota
Running org.apache.hadoop.hdfs.TestSetrepIncreasing
Tests run: 2, Failures: 0, Errors: 0, Skipped: 0, Time elapsed: 29.207 sec - in org.apache.hadoop.hdfs.TestSetrepIncreasing

Results :

Failed tests: 
  TestStandbyCheckpoints.testCheckpointCancellationDuringUpload:317 Expected non-empty <https://builds.apache.org/job/Hadoop-Hdfs-trunk/ws/hadoop-hdfs-project/hadoop-hdfs/target/test/data/dfs/name-0-5/current/fsimage_0000000000000000104>

Tests in error: 
  TestFileTruncate.testTruncate4Symlink:1146 ยป NoClassDefFound org/apache/hadoop...

Tests run: 3394, Failures: 1, Errors: 1, Skipped: 17

[INFO]                                                                         
[INFO] ------------------------------------------------------------------------
[INFO] Skipping Apache Hadoop HDFS Native Client
[INFO] This project has been banned from the build due to previous failures.
[INFO] ------------------------------------------------------------------------
[INFO]                                                                         
[INFO] ------------------------------------------------------------------------
[INFO] Skipping Apache Hadoop HttpFS
[INFO] This project has been banned from the build due to previous failures.
[INFO] ------------------------------------------------------------------------
[INFO]                                                                         
[INFO] ------------------------------------------------------------------------
[INFO] Skipping Apache Hadoop HDFS BookKeeper Journal
[INFO] This project has been banned from the build due to previous failures.
[INFO] ------------------------------------------------------------------------
[INFO]                                                                         
[INFO] ------------------------------------------------------------------------
[INFO] Skipping Apache Hadoop HDFS-NFS
[INFO] This project has been banned from the build due to previous failures.
[INFO] ------------------------------------------------------------------------
[INFO]                                                                         
[INFO] ------------------------------------------------------------------------
[INFO] Building Apache Hadoop HDFS Project 3.0.0-SNAPSHOT
[INFO] ------------------------------------------------------------------------
[INFO] 
[INFO] --- maven-clean-plugin:2.5:clean (default-clean) @ hadoop-hdfs-project ---
[INFO] Deleting <https://builds.apache.org/job/Hadoop-Hdfs-trunk/ws/hadoop-hdfs-project/target>
[INFO] 
[INFO] --- maven-antrun-plugin:1.7:run (create-testdirs) @ hadoop-hdfs-project ---
[INFO] Executing tasks

main:
    [mkdir] Created dir: <https://builds.apache.org/job/Hadoop-Hdfs-trunk/ws/hadoop-hdfs-project/target/test-dir>
[INFO] Executed tasks
[INFO] 
[INFO] --- maven-source-plugin:2.3:jar-no-fork (hadoop-java-sources) @ hadoop-hdfs-project
---
[INFO] 
[INFO] --- maven-source-plugin:2.3:test-jar-no-fork (hadoop-java-sources) @ hadoop-hdfs-project
---
[INFO] 
[INFO] --- maven-enforcer-plugin:1.3.1:enforce (dist-enforce) @ hadoop-hdfs-project ---
[INFO] 
[INFO] --- maven-site-plugin:3.4:attach-descriptor (attach-descriptor) @ hadoop-hdfs-project
---
[INFO] 
[INFO] --- maven-javadoc-plugin:2.8.1:jar (module-javadocs) @ hadoop-hdfs-project ---
[INFO] Skipping javadoc generation
[INFO] 
[INFO] --- maven-enforcer-plugin:1.3.1:enforce (depcheck) @ hadoop-hdfs-project ---
[INFO] 
[INFO] --- maven-checkstyle-plugin:2.15:checkstyle (default-cli) @ hadoop-hdfs-project ---
[INFO] 
[INFO] --- findbugs-maven-plugin:3.0.0:findbugs (default-cli) @ hadoop-hdfs-project ---
[INFO] ------------------------------------------------------------------------
[INFO] Reactor Summary:
[INFO] 
[INFO] Apache Hadoop HDFS Client ......................... SUCCESS [03:59 min]
[INFO] Apache Hadoop HDFS ................................ FAILURE [  02:36 h]
[INFO] Apache Hadoop HDFS Native Client .................. SKIPPED
[INFO] Apache Hadoop HttpFS .............................. SKIPPED
[INFO] Apache Hadoop HDFS BookKeeper Journal ............. SKIPPED
[INFO] Apache Hadoop HDFS-NFS ............................ SKIPPED
[INFO] Apache Hadoop HDFS Project ........................ SUCCESS [  0.062 s]
[INFO] ------------------------------------------------------------------------
[INFO] BUILD FAILURE
[INFO] ------------------------------------------------------------------------
[INFO] Total time: 02:40 h
[INFO] Finished at: 2015-11-03T23:27:41+00:00
[INFO] Final Memory: 65M/765M
[INFO] ------------------------------------------------------------------------
[ERROR] Failed to execute goal org.apache.maven.plugins:maven-surefire-plugin:2.17:test (default-test)
on project hadoop-hdfs: ExecutionException: java.lang.RuntimeException: The forked VM terminated
without properly saying goodbye. VM crash or System.exit called?
[ERROR] Command was /bin/sh -c cd <https://builds.apache.org/job/Hadoop-Hdfs-trunk/ws/hadoop-hdfs-project/hadoop-hdfs>
&& /home/jenkins/tools/java/jdk1.7.0_55/jre/bin/java -Xmx2048m -XX:MaxPermSize=768m
-XX:+HeapDumpOnOutOfMemoryError -jar <https://builds.apache.org/job/Hadoop-Hdfs-trunk/ws/hadoop-hdfs-project/hadoop-hdfs/target/surefire/surefirebooter1109021599583161013.jar>
<https://builds.apache.org/job/Hadoop-Hdfs-trunk/ws/hadoop-hdfs-project/hadoop-hdfs/target/surefire/surefire4609260435029226334tmp>
<https://builds.apache.org/job/Hadoop-Hdfs-trunk/ws/hadoop-hdfs-project/hadoop-hdfs/target/surefire/surefire_3012731838369010198215tmp>
[ERROR] -> [Help 1]
[ERROR] 
[ERROR] To see the full stack trace of the errors, re-run Maven with the -e switch.
[ERROR] Re-run Maven using the -X switch to enable full debug logging.
[ERROR] 
[ERROR] For more information about the errors and possible solutions, please read the following
articles:
[ERROR] [Help 1] http://cwiki.apache.org/confluence/display/MAVEN/MojoFailureException
[ERROR] 
[ERROR] After correcting the problems, you can resume the build with the command
[ERROR]   mvn <goals> -rf :hadoop-hdfs
Build step 'Execute shell' marked build as failure
Archiving artifacts
Recording test results
Updating HDFS-9362
Updating HDFS-9354
Updating YARN-4326

Mime
View raw message