hadoop-hdfs-dev mailing list archives

Site index · List index
Message view « Date » · « Thread »
Top « Date » · « Thread »
From Apache Jenkins Server <jenk...@builds.apache.org>
Subject Hadoop-Hdfs-trunk - Build # 2577 - Still Failing
Date Wed, 25 Nov 2015 04:08:07 GMT
See https://builds.apache.org/job/Hadoop-Hdfs-trunk/2577/

###################################################################################
########################## LAST 60 LINES OF THE CONSOLE ###########################
[...truncated 7090 lines...]
[INFO] Executed tasks
[INFO] 
[INFO] --- maven-source-plugin:2.3:jar-no-fork (hadoop-java-sources) @ hadoop-hdfs-project
---
[INFO] 
[INFO] --- maven-source-plugin:2.3:test-jar-no-fork (hadoop-java-sources) @ hadoop-hdfs-project
---
[INFO] 
[INFO] --- maven-enforcer-plugin:1.3.1:enforce (dist-enforce) @ hadoop-hdfs-project ---
[INFO] 
[INFO] --- maven-site-plugin:3.4:attach-descriptor (attach-descriptor) @ hadoop-hdfs-project
---
[INFO] 
[INFO] --- maven-javadoc-plugin:2.8.1:jar (module-javadocs) @ hadoop-hdfs-project ---
[INFO] Skipping javadoc generation
[INFO] 
[INFO] --- maven-enforcer-plugin:1.3.1:enforce (depcheck) @ hadoop-hdfs-project ---
[INFO] 
[INFO] --- maven-checkstyle-plugin:2.15:checkstyle (default-cli) @ hadoop-hdfs-project ---
[INFO] 
[INFO] --- findbugs-maven-plugin:3.0.0:findbugs (default-cli) @ hadoop-hdfs-project ---
[INFO] ------------------------------------------------------------------------
[INFO] Reactor Summary:
[INFO] 
[INFO] Apache Hadoop HDFS Client ......................... SUCCESS [09:27 min]
[INFO] Apache Hadoop HDFS ................................ FAILURE [  02:24 h]
[INFO] Apache Hadoop HDFS Native Client .................. SKIPPED
[INFO] Apache Hadoop HttpFS .............................. SKIPPED
[INFO] Apache Hadoop HDFS BookKeeper Journal ............. SKIPPED
[INFO] Apache Hadoop HDFS-NFS ............................ SKIPPED
[INFO] Apache Hadoop HDFS Project ........................ SUCCESS [  0.125 s]
[INFO] ------------------------------------------------------------------------
[INFO] BUILD FAILURE
[INFO] ------------------------------------------------------------------------
[INFO] Total time: 02:34 h
[INFO] Finished at: 2015-11-25T04:07:45+00:00
[INFO] Final Memory: 83M/1247M
[INFO] ------------------------------------------------------------------------
[ERROR] Failed to execute goal org.apache.maven.plugins:maven-surefire-plugin:2.17:test (default-test)
on project hadoop-hdfs: ExecutionException: java.lang.RuntimeException: The forked VM terminated
without properly saying goodbye. VM crash or System.exit called?
[ERROR] Command was /bin/sh -c cd /home/jenkins/jenkins-slave/workspace/Hadoop-Hdfs-trunk/hadoop-hdfs-project/hadoop-hdfs
&& /home/jenkins/tools/java/jdk1.7.0_55/jre/bin/java -Xmx2048m -XX:MaxPermSize=768m
-XX:+HeapDumpOnOutOfMemoryError -jar /home/jenkins/jenkins-slave/workspace/Hadoop-Hdfs-trunk/hadoop-hdfs-project/hadoop-hdfs/target/surefire/surefirebooter5582045299305795669.jar
/home/jenkins/jenkins-slave/workspace/Hadoop-Hdfs-trunk/hadoop-hdfs-project/hadoop-hdfs/target/surefire/surefire6131172976044930303tmp
/home/jenkins/jenkins-slave/workspace/Hadoop-Hdfs-trunk/hadoop-hdfs-project/hadoop-hdfs/target/surefire/surefire_1607540855531553554778tmp
[ERROR] -> [Help 1]
[ERROR] 
[ERROR] To see the full stack trace of the errors, re-run Maven with the -e switch.
[ERROR] Re-run Maven using the -X switch to enable full debug logging.
[ERROR] 
[ERROR] For more information about the errors and possible solutions, please read the following
articles:
[ERROR] [Help 1] http://cwiki.apache.org/confluence/display/MAVEN/MojoFailureException
[ERROR] 
[ERROR] After correcting the problems, you can resume the build with the command
[ERROR]   mvn <goals> -rf :hadoop-hdfs
Build step 'Execute shell' marked build as failure
Archiving artifacts
Recording test results
Updating YARN-4384
Updating MAPREDUCE-5883
Updating HDFS-8807
Updating MAPREDUCE-5870
Updating YARN-4365
Updating YARN-4132
Sending e-mails to: hdfs-dev@hadoop.apache.org
Email was triggered for: Failure - Any
Sending email for trigger: Failure - Any



###################################################################################
############################## FAILED TESTS (if any) ##############################
4 tests failed.
FAILED:  org.apache.hadoop.hdfs.TestDFSUpgradeFromImage.testUpgradeFromRel1BBWImage

Error Message:
Cannot obtain block length for LocatedBlock{BP-1419548466-67.195.81.151-1448417113501:blk_7162739548153522810_1020;
getBlockSize()=1024; corrupt=false; offset=0; locs=[DatanodeInfoWithStorage[127.0.0.1:34292,DS-11612660-bddd-40f7-b5e2-d515193c2caa,DISK]]}

Stack Trace:
java.io.IOException: Cannot obtain block length for LocatedBlock{BP-1419548466-67.195.81.151-1448417113501:blk_7162739548153522810_1020;
getBlockSize()=1024; corrupt=false; offset=0; locs=[DatanodeInfoWithStorage[127.0.0.1:34292,DS-11612660-bddd-40f7-b5e2-d515193c2caa,DISK]]}
	at org.apache.hadoop.hdfs.DFSInputStream.readBlockLength(DFSInputStream.java:399)
	at org.apache.hadoop.hdfs.DFSInputStream.fetchLocatedBlocksAndGetLastBlockLength(DFSInputStream.java:343)
	at org.apache.hadoop.hdfs.DFSInputStream.openInfo(DFSInputStream.java:275)
	at org.apache.hadoop.hdfs.DFSInputStream.<init>(DFSInputStream.java:265)
	at org.apache.hadoop.hdfs.DFSClient.open(DFSClient.java:1046)
	at org.apache.hadoop.hdfs.DFSClient.open(DFSClient.java:1011)
	at org.apache.hadoop.hdfs.TestDFSUpgradeFromImage.dfsOpenFileWithRetries(TestDFSUpgradeFromImage.java:177)
	at org.apache.hadoop.hdfs.TestDFSUpgradeFromImage.verifyDir(TestDFSUpgradeFromImage.java:213)
	at org.apache.hadoop.hdfs.TestDFSUpgradeFromImage.verifyFileSystem(TestDFSUpgradeFromImage.java:228)
	at org.apache.hadoop.hdfs.TestDFSUpgradeFromImage.upgradeAndVerify(TestDFSUpgradeFromImage.java:600)
	at org.apache.hadoop.hdfs.TestDFSUpgradeFromImage.testUpgradeFromRel1BBWImage(TestDFSUpgradeFromImage.java:622)


FAILED:  org.apache.hadoop.hdfs.TestEncryptionZones.testStartFileRetry

Error Message:
test timed out after 120000 milliseconds

Stack Trace:
java.lang.Exception: test timed out after 120000 milliseconds
	at sun.misc.Unsafe.park(Native Method)
	at java.util.concurrent.locks.LockSupport.park(LockSupport.java:186)
	at java.util.concurrent.locks.AbstractQueuedSynchronizer.parkAndCheckInterrupt(AbstractQueuedSynchronizer.java:834)
	at java.util.concurrent.locks.AbstractQueuedSynchronizer.doAcquireSharedInterruptibly(AbstractQueuedSynchronizer.java:994)
	at java.util.concurrent.locks.AbstractQueuedSynchronizer.acquireSharedInterruptibly(AbstractQueuedSynchronizer.java:1303)
	at java.util.concurrent.CountDownLatch.await(CountDownLatch.java:236)
	at org.apache.hadoop.hdfs.TestEncryptionZones.testStartFileRetry(TestEncryptionZones.java:1053)


FAILED:  org.apache.hadoop.hdfs.server.datanode.TestDirectoryScanner.testThrottling

Error Message:
test timed out after 300000 milliseconds

Stack Trace:
java.lang.Exception: test timed out after 300000 milliseconds
	at sun.misc.Unsafe.park(Native Method)
	at java.util.concurrent.locks.LockSupport.park(LockSupport.java:186)
	at java.util.concurrent.FutureTask.awaitDone(FutureTask.java:425)
	at java.util.concurrent.FutureTask.get(FutureTask.java:187)
	at org.apache.hadoop.hdfs.server.datanode.DirectoryScanner.getDiskReport(DirectoryScanner.java:731)
	at org.apache.hadoop.hdfs.server.datanode.DirectoryScanner.scan(DirectoryScanner.java:581)
	at org.apache.hadoop.hdfs.server.datanode.DirectoryScanner.reconcile(DirectoryScanner.java:562)
	at org.apache.hadoop.hdfs.server.datanode.TestDirectoryScanner.scan(TestDirectoryScanner.java:307)
	at org.apache.hadoop.hdfs.server.datanode.TestDirectoryScanner.scan(TestDirectoryScanner.java:301)
	at org.apache.hadoop.hdfs.server.datanode.TestDirectoryScanner.runThrottleTest(TestDirectoryScanner.java:760)
	at org.apache.hadoop.hdfs.server.datanode.TestDirectoryScanner.testThrottling(TestDirectoryScanner.java:606)


FAILED:  org.apache.hadoop.hdfs.server.datanode.TestBlockReplacement.testBlockReplacement

Error Message:
Did not achieve expected replication to expected nodes after more than 20000 msec.  See logs
for details.

Stack Trace:
java.util.concurrent.TimeoutException: Did not achieve expected replication to expected nodes
after more than 20000 msec.  See logs for details.
	at org.apache.hadoop.hdfs.server.datanode.TestBlockReplacement.checkBlocks(TestBlockReplacement.java:297)
	at org.apache.hadoop.hdfs.server.datanode.TestBlockReplacement.testBlockReplacement(TestBlockReplacement.java:203)



Mime
  • Unnamed multipart/mixed (inline, None, 0 bytes)
View raw message