hadoop-hdfs-dev mailing list archives

Site index · List index
Message view « Date » · « Thread »
Top « Date » · « Thread »
From Apache Jenkins Server <jenk...@builds.apache.org>
Subject Hadoop-Hdfs-trunk - Build # 2533 - Still Failing
Date Wed, 11 Nov 2015 06:49:44 GMT
See https://builds.apache.org/job/Hadoop-Hdfs-trunk/2533/

###################################################################################
########################## LAST 60 LINES OF THE CONSOLE ###########################
[...truncated 6390 lines...]
[INFO] Executing tasks

main:
    [mkdir] Created dir: /home/jenkins/jenkins-slave/workspace/Hadoop-Hdfs-trunk/hadoop-hdfs-project/target/test-dir
[INFO] Executed tasks
[INFO] 
[INFO] --- maven-source-plugin:2.3:jar-no-fork (hadoop-java-sources) @ hadoop-hdfs-project
---
[INFO] 
[INFO] --- maven-source-plugin:2.3:test-jar-no-fork (hadoop-java-sources) @ hadoop-hdfs-project
---
[INFO] 
[INFO] --- maven-enforcer-plugin:1.3.1:enforce (dist-enforce) @ hadoop-hdfs-project ---
[INFO] 
[INFO] --- maven-site-plugin:3.4:attach-descriptor (attach-descriptor) @ hadoop-hdfs-project
---
[INFO] 
[INFO] --- maven-javadoc-plugin:2.8.1:jar (module-javadocs) @ hadoop-hdfs-project ---
[INFO] Skipping javadoc generation
[INFO] 
[INFO] --- maven-enforcer-plugin:1.3.1:enforce (depcheck) @ hadoop-hdfs-project ---
[INFO] 
[INFO] --- maven-checkstyle-plugin:2.15:checkstyle (default-cli) @ hadoop-hdfs-project ---
[INFO] 
[INFO] --- findbugs-maven-plugin:3.0.0:findbugs (default-cli) @ hadoop-hdfs-project ---
[INFO] ------------------------------------------------------------------------
[INFO] Reactor Summary:
[INFO] 
[INFO] Apache Hadoop HDFS Client ......................... SUCCESS [03:57 min]
[INFO] Apache Hadoop HDFS ................................ FAILURE [  03:24 h]
[INFO] Apache Hadoop HDFS Native Client .................. SKIPPED
[INFO] Apache Hadoop HttpFS .............................. SKIPPED
[INFO] Apache Hadoop HDFS BookKeeper Journal ............. SKIPPED
[INFO] Apache Hadoop HDFS-NFS ............................ SKIPPED
[INFO] Apache Hadoop HDFS Project ........................ SUCCESS [  0.082 s]
[INFO] ------------------------------------------------------------------------
[INFO] BUILD FAILURE
[INFO] ------------------------------------------------------------------------
[INFO] Total time: 03:28 h
[INFO] Finished at: 2015-11-11T06:49:45+00:00
[INFO] Final Memory: 56M/728M
[INFO] ------------------------------------------------------------------------
[ERROR] Failed to execute goal org.apache.maven.plugins:maven-surefire-plugin:2.17:test (default-test)
on project hadoop-hdfs: There are test failures.
[ERROR] 
[ERROR] Please refer to /home/jenkins/jenkins-slave/workspace/Hadoop-Hdfs-trunk/hadoop-hdfs-project/hadoop-hdfs/target/surefire-reports
for the individual test results.
[ERROR] -> [Help 1]
[ERROR] 
[ERROR] To see the full stack trace of the errors, re-run Maven with the -e switch.
[ERROR] Re-run Maven using the -X switch to enable full debug logging.
[ERROR] 
[ERROR] For more information about the errors and possible solutions, please read the following
articles:
[ERROR] [Help 1] http://cwiki.apache.org/confluence/display/MAVEN/MojoFailureException
[ERROR] 
[ERROR] After correcting the problems, you can resume the build with the command
[ERROR]   mvn <goals> -rf :hadoop-hdfs
Build step 'Execute shell' marked build as failure
Archiving artifacts
Recording test results
Updating HDFS-9245
Sending e-mails to: hdfs-dev@hadoop.apache.org
Email was triggered for: Failure - Any
Sending email for trigger: Failure - Any



###################################################################################
############################## FAILED TESTS (if any) ##############################
4 tests failed.
FAILED:  org.apache.hadoop.hdfs.server.blockmanagement.TestPendingInvalidateBlock.testPendingDeletion

Error Message:
expected:<0> but was:<1>

Stack Trace:
java.lang.AssertionError: expected:<0> but was:<1>
	at org.junit.Assert.fail(Assert.java:88)
	at org.junit.Assert.failNotEquals(Assert.java:743)
	at org.junit.Assert.assertEquals(Assert.java:118)
	at org.junit.Assert.assertEquals(Assert.java:555)
	at org.junit.Assert.assertEquals(Assert.java:542)
	at org.apache.hadoop.hdfs.server.blockmanagement.TestPendingInvalidateBlock.testPendingDeletion(TestPendingInvalidateBlock.java:92)


FAILED:  org.apache.hadoop.hdfs.server.datanode.TestDataNodeHotSwapVolumes.testRemoveVolumeBeingWritten

Error Message:
Timed out waiting for /test to reach 3 replicas

Stack Trace:
java.util.concurrent.TimeoutException: Timed out waiting for /test to reach 3 replicas
	at org.apache.hadoop.hdfs.DFSTestUtil.waitReplication(DFSTestUtil.java:768)
	at org.apache.hadoop.hdfs.server.datanode.TestDataNodeHotSwapVolumes.testRemoveVolumeBeingWrittenForDatanode(TestDataNodeHotSwapVolumes.java:644)
	at org.apache.hadoop.hdfs.server.datanode.TestDataNodeHotSwapVolumes.testRemoveVolumeBeingWritten(TestDataNodeHotSwapVolumes.java:569)


FAILED:  org.apache.hadoop.hdfs.server.datanode.TestDirectoryScanner.testThrottling

Error Message:
Throttle is too permissive

Stack Trace:
java.lang.AssertionError: Throttle is too permissive
	at org.junit.Assert.fail(Assert.java:88)
	at org.junit.Assert.assertTrue(Assert.java:41)
	at org.apache.hadoop.hdfs.server.datanode.TestDirectoryScanner.testThrottling(TestDirectoryScanner.java:613)


FAILED:  org.apache.hadoop.hdfs.server.namenode.TestBackupNode.startBackupNodeWithIncorrectAuthentication

Error Message:
Port in use: 0.0.0.0:50070

Stack Trace:
java.net.BindException: Port in use: 0.0.0.0:50070
	at sun.nio.ch.Net.bind0(Native Method)
	at sun.nio.ch.Net.bind(Net.java:444)
	at sun.nio.ch.Net.bind(Net.java:436)
	at sun.nio.ch.ServerSocketChannelImpl.bind(ServerSocketChannelImpl.java:214)
	at sun.nio.ch.ServerSocketAdaptor.bind(ServerSocketAdaptor.java:74)
	at org.mortbay.jetty.nio.SelectChannelConnector.open(SelectChannelConnector.java:216)
	at org.apache.hadoop.http.HttpServer2.openListeners(HttpServer2.java:884)
	at org.apache.hadoop.http.HttpServer2.start(HttpServer2.java:826)
	at org.apache.hadoop.hdfs.server.namenode.NameNodeHttpServer.start(NameNodeHttpServer.java:142)
	at org.apache.hadoop.hdfs.server.namenode.NameNode.startHttpServer(NameNode.java:821)
	at org.apache.hadoop.hdfs.server.namenode.NameNode.initialize(NameNode.java:675)
	at org.apache.hadoop.hdfs.server.namenode.NameNode.<init>(NameNode.java:883)
	at org.apache.hadoop.hdfs.server.namenode.NameNode.<init>(NameNode.java:862)
	at org.apache.hadoop.hdfs.server.namenode.NameNode.createNameNode(NameNode.java:1564)
	at org.apache.hadoop.hdfs.server.namenode.TestBackupNode.startBackupNodeWithIncorrectAuthentication(TestBackupNode.java:169)



Mime
  • Unnamed multipart/mixed (inline, None, 0 bytes)
View raw message