hadoop-hdfs-dev mailing list archives

Site index · List index
Message view « Date » · « Thread »
Top « Date » · « Thread »
From Apache Jenkins Server <jenk...@builds.apache.org>
Subject Hadoop-Hdfs-trunk-Java8 - Build # 603 - Still Failing
Date Fri, 13 Nov 2015 08:34:15 GMT
See https://builds.apache.org/job/Hadoop-Hdfs-trunk-Java8/603/

###################################################################################
########################## LAST 60 LINES OF THE CONSOLE ###########################
[...truncated 6117 lines...]
[INFO] --- maven-antrun-plugin:1.7:run (create-testdirs) @ hadoop-hdfs-project ---
[INFO] Executing tasks

main:
    [mkdir] Created dir: /home/jenkins/jenkins-slave/workspace/Hadoop-Hdfs-trunk-Java8/hadoop-hdfs-project/target/test-dir
[INFO] Executed tasks
[INFO] 
[INFO] --- maven-source-plugin:2.3:jar-no-fork (hadoop-java-sources) @ hadoop-hdfs-project
---
[INFO] 
[INFO] --- maven-source-plugin:2.3:test-jar-no-fork (hadoop-java-sources) @ hadoop-hdfs-project
---
[INFO] 
[INFO] --- maven-enforcer-plugin:1.3.1:enforce (dist-enforce) @ hadoop-hdfs-project ---
[INFO] 
[INFO] --- maven-site-plugin:3.4:attach-descriptor (attach-descriptor) @ hadoop-hdfs-project
---
[INFO] 
[INFO] --- maven-javadoc-plugin:2.8.1:jar (module-javadocs) @ hadoop-hdfs-project ---
[INFO] Not executing Javadoc as the project is not a Java classpath-capable package
[INFO] 
[INFO] --- maven-enforcer-plugin:1.3.1:enforce (depcheck) @ hadoop-hdfs-project ---
[INFO] 
[INFO] --- maven-checkstyle-plugin:2.15:checkstyle (default-cli) @ hadoop-hdfs-project ---
[INFO] 
[INFO] --- findbugs-maven-plugin:3.0.0:findbugs (default-cli) @ hadoop-hdfs-project ---
[INFO] ------------------------------------------------------------------------
[INFO] Reactor Summary:
[INFO] 
[INFO] Apache Hadoop HDFS Client ......................... SUCCESS [05:39 min]
[INFO] Apache Hadoop HDFS ................................ FAILURE [  01:38 h]
[INFO] Apache Hadoop HDFS Native Client .................. SKIPPED
[INFO] Apache Hadoop HttpFS .............................. SKIPPED
[INFO] Apache Hadoop HDFS BookKeeper Journal ............. SKIPPED
[INFO] Apache Hadoop HDFS-NFS ............................ SKIPPED
[INFO] Apache Hadoop HDFS Project ........................ SUCCESS [  0.084 s]
[INFO] ------------------------------------------------------------------------
[INFO] BUILD FAILURE
[INFO] ------------------------------------------------------------------------
[INFO] Total time: 01:44 h
[INFO] Finished at: 2015-11-13T08:34:05+00:00
[INFO] Final Memory: 68M/990M
[INFO] ------------------------------------------------------------------------
[ERROR] Failed to execute goal org.apache.maven.plugins:maven-surefire-plugin:2.17:test (default-test)
on project hadoop-hdfs: ExecutionException: java.lang.RuntimeException: The forked VM terminated
without properly saying goodbye. VM crash or System.exit called?
[ERROR] Command was /bin/sh -c cd /home/jenkins/jenkins-slave/workspace/Hadoop-Hdfs-trunk-Java8/hadoop-hdfs-project/hadoop-hdfs
&& /home/jenkins/tools/java/jdk1.8.0/jre/bin/java -Xmx2048m -XX:MaxPermSize=768m -XX:+HeapDumpOnOutOfMemoryError
-jar /home/jenkins/jenkins-slave/workspace/Hadoop-Hdfs-trunk-Java8/hadoop-hdfs-project/hadoop-hdfs/target/surefire/surefirebooter6989515690504899727.jar
/home/jenkins/jenkins-slave/workspace/Hadoop-Hdfs-trunk-Java8/hadoop-hdfs-project/hadoop-hdfs/target/surefire/surefire8127538473838072597tmp
/home/jenkins/jenkins-slave/workspace/Hadoop-Hdfs-trunk-Java8/hadoop-hdfs-project/hadoop-hdfs/target/surefire/surefire_1304244100812893482555tmp
[ERROR] -> [Help 1]
[ERROR] 
[ERROR] To see the full stack trace of the errors, re-run Maven with the -e switch.
[ERROR] Re-run Maven using the -X switch to enable full debug logging.
[ERROR] 
[ERROR] For more information about the errors and possible solutions, please read the following
articles:
[ERROR] [Help 1] http://cwiki.apache.org/confluence/display/MAVEN/MojoFailureException
[ERROR] 
[ERROR] After correcting the problems, you can resume the build with the command
[ERROR]   mvn <goals> -rf :hadoop-hdfs
Build step 'Execute shell' marked build as failure
Archiving artifacts
Recording test results
Updating HDFS-9410
Sending e-mails to: hdfs-dev@hadoop.apache.org
Email was triggered for: Failure - Any
Sending email for trigger: Failure - Any



###################################################################################
############################## FAILED TESTS (if any) ##############################
7 tests failed.
FAILED:  org.apache.hadoop.hdfs.TestAclsEndToEnd.testGoodWithWhitelist

Error Message:
null

Stack Trace:
java.lang.NullPointerException: null
	at org.apache.hadoop.hdfs.TestAclsEndToEnd.doFullAclTest(TestAclsEndToEnd.java:474)
	at org.apache.hadoop.hdfs.TestAclsEndToEnd.testGoodWithWhitelist(TestAclsEndToEnd.java:317)


FAILED:  org.apache.hadoop.hdfs.TestAclsEndToEnd.testDeleteKey

Error Message:
Could not find kms-webapp/ dir in test classpath

Stack Trace:
java.lang.RuntimeException: Could not find kms-webapp/ dir in test classpath
	at org.apache.hadoop.crypto.key.kms.server.MiniKMS.start(MiniKMS.java:188)
	at org.apache.hadoop.hdfs.TestAclsEndToEnd.setup(TestAclsEndToEnd.java:184)
	at org.apache.hadoop.hdfs.TestAclsEndToEnd.setup(TestAclsEndToEnd.java:145)
	at org.apache.hadoop.hdfs.TestAclsEndToEnd.testDeleteKey(TestAclsEndToEnd.java:1379)


FAILED:  org.apache.hadoop.hdfs.TestAclsEndToEnd.testCreateEncryptionZone

Error Message:
Could not find kms-webapp/ dir in test classpath

Stack Trace:
java.lang.RuntimeException: Could not find kms-webapp/ dir in test classpath
	at org.apache.hadoop.crypto.key.kms.server.MiniKMS.start(MiniKMS.java:188)
	at org.apache.hadoop.hdfs.TestAclsEndToEnd.setup(TestAclsEndToEnd.java:184)
	at org.apache.hadoop.hdfs.TestAclsEndToEnd.setup(TestAclsEndToEnd.java:145)
	at org.apache.hadoop.hdfs.TestAclsEndToEnd.testCreateEncryptionZone(TestAclsEndToEnd.java:620)


FAILED:  org.apache.hadoop.hdfs.TestAclsEndToEnd.testReadFileInEncryptionZone

Error Message:
null

Stack Trace:
java.lang.NullPointerException: null
	at org.apache.hadoop.hdfs.TestAclsEndToEnd.testReadFileInEncryptionZone(TestAclsEndToEnd.java:1208)


FAILED:  org.apache.hadoop.hdfs.TestAclsEndToEnd.testCreateKey

Error Message:
Could not find kms-webapp/ dir in test classpath

Stack Trace:
java.lang.RuntimeException: Could not find kms-webapp/ dir in test classpath
	at org.apache.hadoop.crypto.key.kms.server.MiniKMS.start(MiniKMS.java:188)
	at org.apache.hadoop.hdfs.TestAclsEndToEnd.setup(TestAclsEndToEnd.java:184)
	at org.apache.hadoop.hdfs.TestAclsEndToEnd.setup(TestAclsEndToEnd.java:145)
	at org.apache.hadoop.hdfs.TestAclsEndToEnd.testCreateKey(TestAclsEndToEnd.java:495)


FAILED:  org.apache.hadoop.hdfs.TestAclsEndToEnd.testGoodWithKeyAclsWithoutBlacklist

Error Message:
null

Stack Trace:
java.lang.NullPointerException: null
	at org.apache.hadoop.hdfs.TestAclsEndToEnd.doFullAclTest(TestAclsEndToEnd.java:474)
	at org.apache.hadoop.hdfs.TestAclsEndToEnd.testGoodWithKeyAclsWithoutBlacklist(TestAclsEndToEnd.java:393)


FAILED:  org.apache.hadoop.hdfs.TestAclsEndToEnd.testCreateFileInEncryptionZone

Error Message:
null

Stack Trace:
java.lang.NullPointerException: null
	at org.apache.hadoop.hdfs.TestAclsEndToEnd.testCreateFileInEncryptionZone(TestAclsEndToEnd.java:913)



Mime
  • Unnamed multipart/mixed (inline, None, 0 bytes)
View raw message